[
  {
    "fields": {
      "account_updated": null,
      "account_created": "1",
      "datetime_updated": "2020-07-14T04:49:42Z",
      "datetime_created": "2020-07-14T04:49:42Z",
      "name": "TEST"
    },
    "model": "amortize.category",
    "pk": "AMC20200700001"
  }
]