{
  "doctorData": [{
    "Id": 1,
    "Subject": "Meeting with MR Chaouachi",
    "StartTime": "2021-06-07T10:00:00.000Z",
    "EndTime": "2021-06-07T11:00:00.000Z",
    "IsAllDay": false,
    "DoctorId": 1
  }, {
    "Id": 2,
    "Subject": "General Checks",
    "StartTime": "2021-06-07T08:00:00.000Z",
    "EndTime": "2021-06-07T09:15:00.000Z",
    "IsAllDay": false,
    "DoctorId": 2
  }, {
    "Id": 3,
    "Subject": "General assembly",
    "StartTime": "2021-06-08T08:30:00.000Z",
    "EndTime": "2021-06-08T09:30:00.000Z",
    "IsAllDay": false,
    "DoctorId": 3
  }, {
    "Id": 4,
    "Subject": "Meeting with clients",
    "StartTime": "2021-06-09T13:00:00.000Z",
    "EndTime": "2021-06-09T14:00:00.000Z",
    "IsAllDay": false,
    "DoctorId": 1
  }, {
    "Id": 5,
    "Subject": "Cloud Conference",
    "StartTime": "2021-06-10T09:00:00.000Z",
    "EndTime": "2021-06-10T11:00:00.000Z",
    "IsAllDay": false,
    "DoctorId": 3
  }, {
    "Id": 6,
    "Subject": "Checks Updates(application)",
    "StartTime": "2021-06-11T10:00:00.000Z",
    "EndTime": "2021-06-11T11:15:00.000Z",
    "IsAllDay": false,
    "DoctorId": 2
  }, {
    "Id": 7,
    "Subject": "Meeting with HR Manager",
    "StartTime": "2021-06-28T09:30:00.000Z",
    "EndTime": "2021-06-28T11:30:00.000Z",
    "IsAllDay": false,
    "DoctorId": 3
  }, {
    "Id": 8,
    "Subject": "Daily tasks",
    "StartTime": "2021-06-10T07:00:00.000Z",
    "EndTime": "2021-06-10T08:30:00.000Z",
    "IsAllDay": false,
    "DoctorId": 1
  }, {
    "Id": 9,
    "Subject": "Daily Tasks",
    "StartTime": "2021-06-29T08:00:00.000Z",
    "EndTime": "2021-06-29T10:00:00.000Z",
    "IsAllDay": false,
    "DoctorId": 3
  }, {
    "Id": 10,
    "Subject": "Customer Meeting",
    "StartTime": "2021-06-28T07:10:00.000Z",
    "EndTime": "2021-06-28T10:30:00.000Z",
    "IsAllDay": false,
    "DoctorId": 2
  }, {
    "Id": 11,
    "Subject": "Brainstorming",
    "StartTime": "2021-07-02T13:00:00.000Z",
    "EndTime": "2021-07-02T14:15:00.000Z",
    "IsAllDay": false,
    "DoctorId": 3
  }, {
    "Id": 12,
    "Subject": "Meeting with team members",
    "StartTime": "2021-06-28T07:30:00.000Z",
    "EndTime": "2018-06-28T09:30:00.000Z",
    "IsAllDay": false,
    "DoctorId": 2
  }, {
    "Id": 13,
    "Subject": "Check customer request",
    "StartTime": "2021-06-28T13:00:00.000Z",
    "EndTime": "2021-06-28T14:40:00.000Z",
    "IsAllDay": false,
    "DoctorId": 1
  }, {
    "Id": 14,
    "Subject": "Daily tasks",
    "StartTime": "2021-07-01T08:15:00.000Z",
    "EndTime": "2021-07-01T10:15:00.000Z",
    "IsAllDay": false,
    "DoctorId": 1
  }, {
    "Id": 15,
    "Subject": "Checks conventions",
    "StartTime": "2021-07-02T07:15:00.000Z",
    "EndTime": "2021-07-02T10:00:00.000Z",
    "IsAllDay": false,
    "DoctorId": 1
  },{
    "Id": 16,
    "Subject": "Checks applications",
    "StartTime": "2021-06-29T10:15:00.000Z",
    "EndTime": "2021-06-29T12:00:00.000Z",
    "IsAllDay": false,
    "DoctorId": 1
  }, {
    "Id": 16,
    "Subject": "Check application updates ",
    "StartTime": "2021-06-30T07:15:00.000Z",
    "EndTime": "2021-06-30T09:15:00.000Z",
    "IsAllDay": false,
    "DoctorId": 3
  }, {
    "Id": 17,
    "Subject": "Security Conference",
    "StartTime": "2021-06-30T08:30:00.000Z",
    "EndTime": "2021-06-30T11:00:00.000Z",
    "IsAllDay": false,
    "DoctorId": 2
  }, {
    "Id": 18,
    "Subject": "Meeting with new team members",
    "StartTime": "2021-07-02T09:30:00.000Z",
    "EndTime": "2021-07-02T11:30:00.000Z",
    "IsAllDay": false,
    "DoctorId": 2
  }, {
    "Id": 19,
    "Subject": "check team's reviews",
    "StartTime": "2021-07-01T07:00:00.000Z",
    "EndTime": "2021-07-01T09:20:00.000Z",
    "IsAllDay": false,
    "DoctorId": 3
  }, {
    "Id": 20,
    "Subject": "Coronary angiogram",
    "StartTime": "2018-04-12T05:00:00.000Z",
    "EndTime": "2018-04-12T07:00:00.000Z",
    "IsAllDay": false,
    "DoctorId": 1
  }, {
    "Id": 21,
    "Subject": "Back pain",
    "StartTime": "2018-04-12T05:00:00.000Z",
    "EndTime": "2018-04-12T06:00:00.000Z",
    "IsAllDay": false,
    "DoctorId": 3
  }, {
    "Id": 22,
    "Subject": "Neuropathy",
    "StartTime": "2018-04-13T07:00:00.000Z",
    "EndTime": "2018-04-13T08:15:00.000Z",
    "IsAllDay": false,
    "DoctorId": 2
  }, {
    "Id": 23,
    "Subject": "Ruptured disks",
    "StartTime": "2018-04-13T07:30:00.000Z",
    "EndTime": "2018-04-13T10:20:00.000Z",
    "IsAllDay": false,
    "DoctorId": 3
  }, {
    "Id": 24,
    "Subject": "Atherosclerosis",
    "StartTime": "2018-04-13T04:30:00.000Z",
    "EndTime": "2018-04-13T07:00:00.000Z",
    "IsAllDay": false,
    "DoctorId": 1
  }, {
    "Id": 25,
    "Subject": "Arthroplasty",
    "StartTime": "2018-04-16T03:30:00.000Z",
    "EndTime": "2018-04-16T04:30:00.000Z",
    "IsAllDay": false,
    "DoctorId": 1
  }, {
    "Id": 26,
    "Subject": "Hyperactivity disorder",
    "StartTime": "2018-04-16T08:30:00.000Z",
    "EndTime": "2018-04-16T10:15:00.000Z",
    "IsAllDay": false,
    "DoctorId": 2
  }, {
    "Id": 27,
    "Subject": "Muscular dystrophy",
    "StartTime": "2018-04-16T07:40:00.000Z",
    "EndTime": "2018-04-16T09:50:00.000Z",
    "IsAllDay": false,
    "DoctorId": 3
  }, {
    "Id": 28,
    "Subject": "Consulting",
    "StartTime": "2018-04-17T03:50:00.000Z",
    "EndTime": "2018-04-17T05:00:00.000Z",
    "IsAllDay": false,
    "DoctorId": 1
  }, {
    "Id": 29,
    "Subject": "Hand surgery",
    "StartTime": "2018-04-17T07:50:00.000Z",
    "EndTime": "2018-04-17T09:52:00.000Z",
    "IsAllDay": false,
    "DoctorId": 3
  }, {
    "Id": 30,
    "Subject": "Neuromuscular",
    "StartTime": "2018-04-18T08:30:00.000Z",
    "EndTime": "2018-04-18T10:10:00.000Z",
    "IsAllDay": false,
    "DoctorId": 2
  }, {
    "Id": 31,
    "Subject": "Spine surgery",
    "StartTime": "2018-04-18T06:48:00.000Z",
    "EndTime": "2018-04-18T08:53:00.000Z",
    "IsAllDay": false,
    "DoctorId": 3
  }, {
    "Id": 32,
    "Subject": "Fibrinogen",
    "StartTime": "2018-04-19T03:30:00.000Z",
    "EndTime": "2018-04-19T07:00:00.000Z",
    "IsAllDay": false,
    "DoctorId": 1
  }, {
    "Id": 33,
    "Subject": "Bone tumors",
    "StartTime": "2018-04-19T05:15:00.000Z",
    "EndTime": "2018-04-19T06:50:00.000Z",
    "IsAllDay": false,
    "DoctorId": 3
  }, {
    "Id": 34,
    "Subject": "Neuromuscular",
    "StartTime": "2018-04-20T07:30:00.000Z",
    "EndTime": "2018-04-20T11:30:00.000Z",
    "IsAllDay": false,
    "DoctorId": 2
  }, {
    "Id": 35,
    "Subject": "Osteoporosis",
    "StartTime": "2018-04-20T06:15:00.000Z",
    "EndTime": "2018-04-20T09:00:00.000Z",
    "IsAllDay": false,
    "DoctorId": 3
  }, {
    "Id": 36,
    "Subject": "Triglyceride",
    "StartTime": "2018-04-20T04:00:00.000Z",
    "EndTime": "2018-04-20T05:15:00.000Z",
    "IsAllDay": false,
    "DoctorId": 1
  }, {
    "Id": 37,
    "Subject": "Fibrinogen",
    "StartTime": "2018-04-23T02:30:00.000Z",
    "EndTime": "2018-04-23T07:00:00.000Z",
    "IsAllDay": false,
    "DoctorId": 1
  }, {
    "Id": 38,
    "Subject": "Head trauma",
    "StartTime": "2018-04-23T06:30:00.000Z",
    "EndTime": "2018-04-23T09:30:00.000Z",
    "IsAllDay": false,
    "DoctorId": 2
  }, {
    "Id": 39,
    "Subject": "Arthroplasty",
    "StartTime": "2018-04-23T06:48:00.000Z",
    "EndTime": "2018-04-23T07:52:00.000Z",
    "IsAllDay": false,
    "DoctorId": 3
  }, {
    "Id": 40,
    "Subject": "Echocardiogram",
    "StartTime": "2018-04-24T05:00:00.000Z",
    "EndTime": "2018-04-24T07:10:00.000Z",
    "IsAllDay": false,
    "DoctorId": 1
  }, {
    "Id": 41,
    "Subject": "Skull reconstruction",
    "StartTime": "2018-04-24T07:50:00.000Z",
    "EndTime": "2018-04-24T10:15:00.000Z",
    "IsAllDay": false,
    "DoctorId": 3
  }, {
    "Id": 42,
    "Subject": "Dementia",
    "StartTime": "2018-04-25T07:00:00.000Z",
    "EndTime": "2018-04-25T11:15:00.000Z",
    "IsAllDay": false,
    "DoctorId": 2
  }, {
    "Id": 43,
    "Subject": "Orthopedic trauma",
    "StartTime": "2018-04-25T04:48:00.000Z",
    "EndTime": "2018-04-25T06:50:00.000Z",
    "IsAllDay": false,
    "DoctorId": 3
  }, {
    "Id": 44,
    "Subject": "Blood pressure",
    "StartTime": "2018-04-26T05:20:00.000Z",
    "EndTime": "2018-04-26T07:00:00.000Z",
    "IsAllDay": false,
    "DoctorId": 1
  }, {
    "Id": 45,
    "Subject": "Ruptured disks",
    "StartTime": "2018-04-26T07:20:00.000Z",
    "EndTime": "2018-04-26T09:50:00.000Z",
    "IsAllDay": false,
    "DoctorId": 3
  }, {
    "Id": 46,
    "Subject": "Head trauma",
    "StartTime": "2018-04-27T06:20:00.000Z",
    "EndTime": "2018-04-27T07:15:00.000Z",
    "IsAllDay": false,
    "DoctorId": 2
  }, {
    "Id": 47,
    "Subject": "Cerebral palsy",
    "StartTime": "2018-04-27T09:20:00.000Z",
    "EndTime": "2018-04-27T10:20:00.000Z",
    "IsAllDay": false,
    "DoctorId": 3
  }, {
    "Id": 48,
    "Subject": "Consulting",
    "StartTime": "2018-04-27T03:30:00.000Z",
    "EndTime": "2018-04-27T06:00:00.000Z",
    "IsAllDay": false,
    "DoctorId": 1
  }, {
    "Id": 49,
    "Subject": "Electrocardiogram",
    "StartTime": "2018-04-30T04:00:00.000Z",
    "EndTime": "2018-04-30T06:20:00.000Z",
    "IsAllDay": false,
    "DoctorId": 1
  }, {
    "Id": 50,
    "Subject": "Radiculopathy",
    "StartTime": "2018-04-30T08:30:00.000Z",
    "EndTime": "2018-04-30T10:00:00.000Z",
    "IsAllDay": false,
    "DoctorId": 2
  }, {
    "Id": 51,
    "Subject": "Skull reconstruction",
    "StartTime": "2018-04-30T08:30:00.000Z",
    "EndTime": "2018-04-30T10:30:00.000Z",
    "IsAllDay": false,
    "DoctorId": 3
  }]}
