999
"DXF R12 Output" (www.mydxf.blogspot.com)
 0 
SECTION
 2 
HEADER
 9 
$ACADVER
 1 
AC1009
 9 
$EXTMIN
 10 
 0 
 20 
 0 
 9 
$EXTMAX
 10 
 8.5 
 20 
 11 
 0 
ENDSEC
 0 
SECTION
 2 
ENTITIES
0
LINE
8
EuroPanel
10
52.704700
20
240.106000
11
123.504700
21
240.106000
0
LINE
8
EuroPanel
10
123.504700
20
240.106000
11
123.504700
21
111.606000
0
LINE
8
EuroPanel
10
123.504700
20
111.606000
11
52.704700
21
111.606000
0
LINE
8
EuroPanel
10
52.704700
20
111.606000
11
52.704700
21
240.106000
0
LINE
8
EuroPanel
10
59.054700
20
116.206000
11
61.354700
21
116.206000
0
LINE
8
EuroPanel
10
61.354700
20
116.206000
11
61.966993
21
116.084207
0
LINE
8
EuroPanel
10
61.966993
20
116.084207
11
62.486071
21
115.737371
0
LINE
8
EuroPanel
10
62.486071
20
115.737371
11
62.832907
21
115.218293
0
LINE
8
EuroPanel
10
62.832907
20
115.218293
11
62.954700
21
114.606000
0
LINE
8
EuroPanel
10
62.954700
20
114.606000
11
62.954700
21
114.606000
0
LINE
8
EuroPanel
10
62.954700
20
114.606000
11
62.832907
21
113.993707
0
LINE
8
EuroPanel
10
62.832907
20
113.993707
11
62.486071
21
113.474629
0
LINE
8
EuroPanel
10
62.486071
20
113.474629
11
61.966993
21
113.127793
0
LINE
8
EuroPanel
10
61.966993
20
113.127793
11
61.354700
21
113.006000
0
LINE
8
EuroPanel
10
61.354700
20
113.006000
11
59.054700
21
113.006000
0
LINE
8
EuroPanel
10
59.054700
20
113.006000
11
58.442407
21
113.127793
0
LINE
8
EuroPanel
10
58.442407
20
113.127793
11
57.923329
21
113.474629
0
LINE
8
EuroPanel
10
57.923329
20
113.474629
11
57.576493
21
113.993707
0
LINE
8
EuroPanel
10
57.576493
20
113.993707
11
57.454700
21
114.606000
0
LINE
8
EuroPanel
10
57.454700
20
114.606000
11
57.454700
21
114.606000
0
LINE
8
EuroPanel
10
57.454700
20
114.606000
11
57.576493
21
115.218293
0
LINE
8
EuroPanel
10
57.576493
20
115.218293
11
57.923329
21
115.737371
0
LINE
8
EuroPanel
10
57.923329
20
115.737371
11
58.442407
21
116.084207
0
LINE
8
EuroPanel
10
58.442407
20
116.084207
11
59.054700
21
116.206000
0
LINE
8
EuroPanel
10
59.054700
20
116.206000
11
59.054700
21
116.206000
0
LINE
8
EuroPanel
10
59.054700
20
238.706000
11
61.354700
21
238.706000
0
LINE
8
EuroPanel
10
61.354700
20
238.706000
11
61.966993
21
238.584207
0
LINE
8
EuroPanel
10
61.966993
20
238.584207
11
62.486071
21
238.237371
0
LINE
8
EuroPanel
10
62.486071
20
238.237371
11
62.832907
21
237.718293
0
LINE
8
EuroPanel
10
62.832907
20
237.718293
11
62.954700
21
237.106000
0
LINE
8
EuroPanel
10
62.954700
20
237.106000
11
62.954700
21
237.106000
0
LINE
8
EuroPanel
10
62.954700
20
237.106000
11
62.832907
21
236.493707
0
LINE
8
EuroPanel
10
62.832907
20
236.493707
11
62.486071
21
235.974629
0
LINE
8
EuroPanel
10
62.486071
20
235.974629
11
61.966993
21
235.627793
0
LINE
8
EuroPanel
10
61.966993
20
235.627793
11
61.354700
21
235.506000
0
LINE
8
EuroPanel
10
61.354700
20
235.506000
11
59.054700
21
235.506000
0
LINE
8
EuroPanel
10
59.054700
20
235.506000
11
58.442407
21
235.627793
0
LINE
8
EuroPanel
10
58.442407
20
235.627793
11
57.923329
21
235.974629
0
LINE
8
EuroPanel
10
57.923329
20
235.974629
11
57.576493
21
236.493707
0
LINE
8
EuroPanel
10
57.576493
20
236.493707
11
57.454700
21
237.106000
0
LINE
8
EuroPanel
10
57.454700
20
237.106000
11
57.454700
21
237.106000
0
LINE
8
EuroPanel
10
57.454700
20
237.106000
11
57.576493
21
237.718293
0
LINE
8
EuroPanel
10
57.576493
20
237.718293
11
57.923329
21
238.237371
0
LINE
8
EuroPanel
10
57.923329
20
238.237371
11
58.442407
21
238.584207
0
LINE
8
EuroPanel
10
58.442407
20
238.584207
11
59.054700
21
238.706000
0
LINE
8
EuroPanel
10
59.054700
20
238.706000
11
59.054700
21
238.706000
0
LINE
8
EuroPanel
10
114.934700
20
116.206000
11
117.234700
21
116.206000
0
LINE
8
EuroPanel
10
117.234700
20
116.206000
11
117.846993
21
116.084207
0
LINE
8
EuroPanel
10
117.846993
20
116.084207
11
118.366071
21
115.737371
0
LINE
8
EuroPanel
10
118.366071
20
115.737371
11
118.712907
21
115.218293
0
LINE
8
EuroPanel
10
118.712907
20
115.218293
11
118.834700
21
114.606000
0
LINE
8
EuroPanel
10
118.834700
20
114.606000
11
118.834700
21
114.606000
0
LINE
8
EuroPanel
10
118.834700
20
114.606000
11
118.712907
21
113.993707
0
LINE
8
EuroPanel
10
118.712907
20
113.993707
11
118.366071
21
113.474629
0
LINE
8
EuroPanel
10
118.366071
20
113.474629
11
117.846993
21
113.127793
0
LINE
8
EuroPanel
10
117.846993
20
113.127793
11
117.234700
21
113.006000
0
LINE
8
EuroPanel
10
117.234700
20
113.006000
11
114.934700
21
113.006000
0
LINE
8
EuroPanel
10
114.934700
20
113.006000
11
114.322407
21
113.127793
0
LINE
8
EuroPanel
10
114.322407
20
113.127793
11
113.803329
21
113.474629
0
LINE
8
EuroPanel
10
113.803329
20
113.474629
11
113.456493
21
113.993707
0
LINE
8
EuroPanel
10
113.456493
20
113.993707
11
113.334700
21
114.606000
0
LINE
8
EuroPanel
10
113.334700
20
114.606000
11
113.334700
21
114.606000
0
LINE
8
EuroPanel
10
113.334700
20
114.606000
11
113.456493
21
115.218293
0
LINE
8
EuroPanel
10
113.456493
20
115.218293
11
113.803329
21
115.737371
0
LINE
8
EuroPanel
10
113.803329
20
115.737371
11
114.322407
21
116.084207
0
LINE
8
EuroPanel
10
114.322407
20
116.084207
11
114.934700
21
116.206000
0
LINE
8
EuroPanel
10
114.934700
20
116.206000
11
114.934700
21
116.206000
0
LINE
8
EuroPanel
10
114.934700
20
238.706000
11
117.234700
21
238.706000
0
LINE
8
EuroPanel
10
117.234700
20
238.706000
11
117.846993
21
238.584207
0
LINE
8
EuroPanel
10
117.846993
20
238.584207
11
118.366071
21
238.237371
0
LINE
8
EuroPanel
10
118.366071
20
238.237371
11
118.712907
21
237.718293
0
LINE
8
EuroPanel
10
118.712907
20
237.718293
11
118.834700
21
237.106000
0
LINE
8
EuroPanel
10
118.834700
20
237.106000
11
118.834700
21
237.106000
0
LINE
8
EuroPanel
10
118.834700
20
237.106000
11
118.712907
21
236.493707
0
LINE
8
EuroPanel
10
118.712907
20
236.493707
11
118.366071
21
235.974629
0
LINE
8
EuroPanel
10
118.366071
20
235.974629
11
117.846993
21
235.627793
0
LINE
8
EuroPanel
10
117.846993
20
235.627793
11
117.234700
21
235.506000
0
LINE
8
EuroPanel
10
117.234700
20
235.506000
11
114.934700
21
235.506000
0
LINE
8
EuroPanel
10
114.934700
20
235.506000
11
114.322407
21
235.627793
0
LINE
8
EuroPanel
10
114.322407
20
235.627793
11
113.803329
21
235.974629
0
LINE
8
EuroPanel
10
113.803329
20
235.974629
11
113.456493
21
236.493707
0
LINE
8
EuroPanel
10
113.456493
20
236.493707
11
113.334700
21
237.106000
0
LINE
8
EuroPanel
10
113.334700
20
237.106000
11
113.334700
21
237.106000
0
LINE
8
EuroPanel
10
113.334700
20
237.106000
11
113.456493
21
237.718293
0
LINE
8
EuroPanel
10
113.456493
20
237.718293
11
113.803329
21
238.237371
0
LINE
8
EuroPanel
10
113.803329
20
238.237371
11
114.322407
21
238.584207
0
LINE
8
EuroPanel
10
114.322407
20
238.584207
11
114.934700
21
238.706000
0
LINE
8
EuroPanel
10
114.934700
20
238.706000
11
114.934700
21
238.706000
 0 
ENDSEC
 0 
EOF