999
"DXF R12 Output" (www.mydxf.blogspot.com)
 0 
SECTION
 2 
HEADER
 9 
$ACADVER
 1 
AC1009
 9 
$EXTMIN
 10 
 0 
 20 
 0 
 9 
$EXTMAX
 10 
 8.5 
 20 
 11 
 0 
ENDSEC
 0 
SECTION
 2 
ENTITIES
0
LINE
8
EuroPanel
10
73.104700
20
195.681000
11
103.104700
21
195.681000
0
LINE
8
EuroPanel
10
103.104700
20
195.681000
11
103.104700
21
156.031000
0
LINE
8
EuroPanel
10
103.104700
20
156.031000
11
73.104700
21
156.031000
0
LINE
8
EuroPanel
10
73.104700
20
156.031000
11
73.104700
21
195.681000
0
LINE
8
EuroPanel
10
79.454700
20
160.631000
11
81.754700
21
160.631000
0
LINE
8
EuroPanel
10
81.754700
20
160.631000
11
82.366993
21
160.509207
0
LINE
8
EuroPanel
10
82.366993
20
160.509207
11
82.886071
21
160.162371
0
LINE
8
EuroPanel
10
82.886071
20
160.162371
11
83.232907
21
159.643293
0
LINE
8
EuroPanel
10
83.232907
20
159.643293
11
83.354700
21
159.031000
0
LINE
8
EuroPanel
10
83.354700
20
159.031000
11
83.354700
21
159.031000
0
LINE
8
EuroPanel
10
83.354700
20
159.031000
11
83.232907
21
158.418707
0
LINE
8
EuroPanel
10
83.232907
20
158.418707
11
82.886071
21
157.899629
0
LINE
8
EuroPanel
10
82.886071
20
157.899629
11
82.366993
21
157.552793
0
LINE
8
EuroPanel
10
82.366993
20
157.552793
11
81.754700
21
157.431000
0
LINE
8
EuroPanel
10
81.754700
20
157.431000
11
79.454700
21
157.431000
0
LINE
8
EuroPanel
10
79.454700
20
157.431000
11
78.842407
21
157.552793
0
LINE
8
EuroPanel
10
78.842407
20
157.552793
11
78.323329
21
157.899629
0
LINE
8
EuroPanel
10
78.323329
20
157.899629
11
77.976493
21
158.418707
0
LINE
8
EuroPanel
10
77.976493
20
158.418707
11
77.854700
21
159.031000
0
LINE
8
EuroPanel
10
77.854700
20
159.031000
11
77.854700
21
159.031000
0
LINE
8
EuroPanel
10
77.854700
20
159.031000
11
77.976493
21
159.643293
0
LINE
8
EuroPanel
10
77.976493
20
159.643293
11
78.323329
21
160.162371
0
LINE
8
EuroPanel
10
78.323329
20
160.162371
11
78.842407
21
160.509207
0
LINE
8
EuroPanel
10
78.842407
20
160.509207
11
79.454700
21
160.631000
0
LINE
8
EuroPanel
10
79.454700
20
160.631000
11
79.454700
21
160.631000
0
LINE
8
EuroPanel
10
79.454700
20
194.281000
11
81.754700
21
194.281000
0
LINE
8
EuroPanel
10
81.754700
20
194.281000
11
82.366993
21
194.159207
0
LINE
8
EuroPanel
10
82.366993
20
194.159207
11
82.886071
21
193.812371
0
LINE
8
EuroPanel
10
82.886071
20
193.812371
11
83.232907
21
193.293293
0
LINE
8
EuroPanel
10
83.232907
20
193.293293
11
83.354700
21
192.681000
0
LINE
8
EuroPanel
10
83.354700
20
192.681000
11
83.354700
21
192.681000
0
LINE
8
EuroPanel
10
83.354700
20
192.681000
11
83.232907
21
192.068707
0
LINE
8
EuroPanel
10
83.232907
20
192.068707
11
82.886071
21
191.549629
0
LINE
8
EuroPanel
10
82.886071
20
191.549629
11
82.366993
21
191.202793
0
LINE
8
EuroPanel
10
82.366993
20
191.202793
11
81.754700
21
191.081000
0
LINE
8
EuroPanel
10
81.754700
20
191.081000
11
79.454700
21
191.081000
0
LINE
8
EuroPanel
10
79.454700
20
191.081000
11
78.842407
21
191.202793
0
LINE
8
EuroPanel
10
78.842407
20
191.202793
11
78.323329
21
191.549629
0
LINE
8
EuroPanel
10
78.323329
20
191.549629
11
77.976493
21
192.068707
0
LINE
8
EuroPanel
10
77.976493
20
192.068707
11
77.854700
21
192.681000
0
LINE
8
EuroPanel
10
77.854700
20
192.681000
11
77.854700
21
192.681000
0
LINE
8
EuroPanel
10
77.854700
20
192.681000
11
77.976493
21
193.293293
0
LINE
8
EuroPanel
10
77.976493
20
193.293293
11
78.323329
21
193.812371
0
LINE
8
EuroPanel
10
78.323329
20
193.812371
11
78.842407
21
194.159207
0
LINE
8
EuroPanel
10
78.842407
20
194.159207
11
79.454700
21
194.281000
0
LINE
8
EuroPanel
10
79.454700
20
194.281000
11
79.454700
21
194.281000
0
LINE
8
EuroPanel
10
94.694700
20
160.631000
11
96.994700
21
160.631000
0
LINE
8
EuroPanel
10
96.994700
20
160.631000
11
97.606993
21
160.509207
0
LINE
8
EuroPanel
10
97.606993
20
160.509207
11
98.126071
21
160.162371
0
LINE
8
EuroPanel
10
98.126071
20
160.162371
11
98.472907
21
159.643293
0
LINE
8
EuroPanel
10
98.472907
20
159.643293
11
98.594700
21
159.031000
0
LINE
8
EuroPanel
10
98.594700
20
159.031000
11
98.594700
21
159.031000
0
LINE
8
EuroPanel
10
98.594700
20
159.031000
11
98.472907
21
158.418707
0
LINE
8
EuroPanel
10
98.472907
20
158.418707
11
98.126071
21
157.899629
0
LINE
8
EuroPanel
10
98.126071
20
157.899629
11
97.606993
21
157.552793
0
LINE
8
EuroPanel
10
97.606993
20
157.552793
11
96.994700
21
157.431000
0
LINE
8
EuroPanel
10
96.994700
20
157.431000
11
94.694700
21
157.431000
0
LINE
8
EuroPanel
10
94.694700
20
157.431000
11
94.082407
21
157.552793
0
LINE
8
EuroPanel
10
94.082407
20
157.552793
11
93.563329
21
157.899629
0
LINE
8
EuroPanel
10
93.563329
20
157.899629
11
93.216493
21
158.418707
0
LINE
8
EuroPanel
10
93.216493
20
158.418707
11
93.094700
21
159.031000
0
LINE
8
EuroPanel
10
93.094700
20
159.031000
11
93.094700
21
159.031000
0
LINE
8
EuroPanel
10
93.094700
20
159.031000
11
93.216493
21
159.643293
0
LINE
8
EuroPanel
10
93.216493
20
159.643293
11
93.563329
21
160.162371
0
LINE
8
EuroPanel
10
93.563329
20
160.162371
11
94.082407
21
160.509207
0
LINE
8
EuroPanel
10
94.082407
20
160.509207
11
94.694700
21
160.631000
0
LINE
8
EuroPanel
10
94.694700
20
160.631000
11
94.694700
21
160.631000
0
LINE
8
EuroPanel
10
94.694700
20
194.281000
11
96.994700
21
194.281000
0
LINE
8
EuroPanel
10
96.994700
20
194.281000
11
97.606993
21
194.159207
0
LINE
8
EuroPanel
10
97.606993
20
194.159207
11
98.126071
21
193.812371
0
LINE
8
EuroPanel
10
98.126071
20
193.812371
11
98.472907
21
193.293293
0
LINE
8
EuroPanel
10
98.472907
20
193.293293
11
98.594700
21
192.681000
0
LINE
8
EuroPanel
10
98.594700
20
192.681000
11
98.594700
21
192.681000
0
LINE
8
EuroPanel
10
98.594700
20
192.681000
11
98.472907
21
192.068707
0
LINE
8
EuroPanel
10
98.472907
20
192.068707
11
98.126071
21
191.549629
0
LINE
8
EuroPanel
10
98.126071
20
191.549629
11
97.606993
21
191.202793
0
LINE
8
EuroPanel
10
97.606993
20
191.202793
11
96.994700
21
191.081000
0
LINE
8
EuroPanel
10
96.994700
20
191.081000
11
94.694700
21
191.081000
0
LINE
8
EuroPanel
10
94.694700
20
191.081000
11
94.082407
21
191.202793
0
LINE
8
EuroPanel
10
94.082407
20
191.202793
11
93.563329
21
191.549629
0
LINE
8
EuroPanel
10
93.563329
20
191.549629
11
93.216493
21
192.068707
0
LINE
8
EuroPanel
10
93.216493
20
192.068707
11
93.094700
21
192.681000
0
LINE
8
EuroPanel
10
93.094700
20
192.681000
11
93.094700
21
192.681000
0
LINE
8
EuroPanel
10
93.094700
20
192.681000
11
93.216493
21
193.293293
0
LINE
8
EuroPanel
10
93.216493
20
193.293293
11
93.563329
21
193.812371
0
LINE
8
EuroPanel
10
93.563329
20
193.812371
11
94.082407
21
194.159207
0
LINE
8
EuroPanel
10
94.082407
20
194.159207
11
94.694700
21
194.281000
0
LINE
8
EuroPanel
10
94.694700
20
194.281000
11
94.694700
21
194.281000
 0 
ENDSEC
 0 
EOF