999
"DXF R12 Output" (www.mydxf.blogspot.com)
 0 
SECTION
 2 
HEADER
 9 
$ACADVER
 1 
AC1009
 9 
$EXTMIN
 10 
 0 
 20 
 0 
 9 
$EXTMAX
 10 
 8.5 
 20 
 11 
 0 
ENDSEC
 0 
SECTION
 2 
ENTITIES
0
LINE
8
EuroPanel
10
83.204700
20
240.106000
11
93.004700
21
240.106000
0
LINE
8
EuroPanel
10
93.004700
20
240.106000
11
93.004700
21
111.606000
0
LINE
8
EuroPanel
10
93.004700
20
111.606000
11
83.204700
21
111.606000
0
LINE
8
EuroPanel
10
83.204700
20
111.606000
11
83.204700
21
240.106000
 0 
ENDSEC
 0 
EOF