999
"DXF R12 Output" (www.mydxf.blogspot.com)
 0 
SECTION
 2 
HEADER
 9 
$ACADVER
 1 
AC1009
 9 
$EXTMIN
 10 
 0 
 20 
 0 
 9 
$EXTMAX
 10 
 8.5 
 20 
 11 
 0 
ENDSEC
 0 
SECTION
 2 
ENTITIES
0
LINE
8
EuroPanel
10
42.454700
20
195.681000
11
133.754700
21
195.681000
0
LINE
8
EuroPanel
10
133.754700
20
195.681000
11
133.754700
21
156.031000
0
LINE
8
EuroPanel
10
133.754700
20
156.031000
11
42.454700
21
156.031000
0
LINE
8
EuroPanel
10
42.454700
20
156.031000
11
42.454700
21
195.681000
0
LINE
8
EuroPanel
10
48.804700
20
160.631000
11
51.104700
21
160.631000
0
LINE
8
EuroPanel
10
51.104700
20
160.631000
11
51.716993
21
160.509207
0
LINE
8
EuroPanel
10
51.716993
20
160.509207
11
52.236071
21
160.162371
0
LINE
8
EuroPanel
10
52.236071
20
160.162371
11
52.582907
21
159.643293
0
LINE
8
EuroPanel
10
52.582907
20
159.643293
11
52.704700
21
159.031000
0
LINE
8
EuroPanel
10
52.704700
20
159.031000
11
52.704700
21
159.031000
0
LINE
8
EuroPanel
10
52.704700
20
159.031000
11
52.582907
21
158.418707
0
LINE
8
EuroPanel
10
52.582907
20
158.418707
11
52.236071
21
157.899629
0
LINE
8
EuroPanel
10
52.236071
20
157.899629
11
51.716993
21
157.552793
0
LINE
8
EuroPanel
10
51.716993
20
157.552793
11
51.104700
21
157.431000
0
LINE
8
EuroPanel
10
51.104700
20
157.431000
11
48.804700
21
157.431000
0
LINE
8
EuroPanel
10
48.804700
20
157.431000
11
48.192407
21
157.552793
0
LINE
8
EuroPanel
10
48.192407
20
157.552793
11
47.673329
21
157.899629
0
LINE
8
EuroPanel
10
47.673329
20
157.899629
11
47.326493
21
158.418707
0
LINE
8
EuroPanel
10
47.326493
20
158.418707
11
47.204700
21
159.031000
0
LINE
8
EuroPanel
10
47.204700
20
159.031000
11
47.204700
21
159.031000
0
LINE
8
EuroPanel
10
47.204700
20
159.031000
11
47.326493
21
159.643293
0
LINE
8
EuroPanel
10
47.326493
20
159.643293
11
47.673329
21
160.162371
0
LINE
8
EuroPanel
10
47.673329
20
160.162371
11
48.192407
21
160.509207
0
LINE
8
EuroPanel
10
48.192407
20
160.509207
11
48.804700
21
160.631000
0
LINE
8
EuroPanel
10
48.804700
20
160.631000
11
48.804700
21
160.631000
0
LINE
8
EuroPanel
10
48.804700
20
194.281000
11
51.104700
21
194.281000
0
LINE
8
EuroPanel
10
51.104700
20
194.281000
11
51.716993
21
194.159207
0
LINE
8
EuroPanel
10
51.716993
20
194.159207
11
52.236071
21
193.812371
0
LINE
8
EuroPanel
10
52.236071
20
193.812371
11
52.582907
21
193.293293
0
LINE
8
EuroPanel
10
52.582907
20
193.293293
11
52.704700
21
192.681000
0
LINE
8
EuroPanel
10
52.704700
20
192.681000
11
52.704700
21
192.681000
0
LINE
8
EuroPanel
10
52.704700
20
192.681000
11
52.582907
21
192.068707
0
LINE
8
EuroPanel
10
52.582907
20
192.068707
11
52.236071
21
191.549629
0
LINE
8
EuroPanel
10
52.236071
20
191.549629
11
51.716993
21
191.202793
0
LINE
8
EuroPanel
10
51.716993
20
191.202793
11
51.104700
21
191.081000
0
LINE
8
EuroPanel
10
51.104700
20
191.081000
11
48.804700
21
191.081000
0
LINE
8
EuroPanel
10
48.804700
20
191.081000
11
48.192407
21
191.202793
0
LINE
8
EuroPanel
10
48.192407
20
191.202793
11
47.673329
21
191.549629
0
LINE
8
EuroPanel
10
47.673329
20
191.549629
11
47.326493
21
192.068707
0
LINE
8
EuroPanel
10
47.326493
20
192.068707
11
47.204700
21
192.681000
0
LINE
8
EuroPanel
10
47.204700
20
192.681000
11
47.204700
21
192.681000
0
LINE
8
EuroPanel
10
47.204700
20
192.681000
11
47.326493
21
193.293293
0
LINE
8
EuroPanel
10
47.326493
20
193.293293
11
47.673329
21
193.812371
0
LINE
8
EuroPanel
10
47.673329
20
193.812371
11
48.192407
21
194.159207
0
LINE
8
EuroPanel
10
48.192407
20
194.159207
11
48.804700
21
194.281000
0
LINE
8
EuroPanel
10
48.804700
20
194.281000
11
48.804700
21
194.281000
0
LINE
8
EuroPanel
10
125.004700
20
160.631000
11
127.304700
21
160.631000
0
LINE
8
EuroPanel
10
127.304700
20
160.631000
11
127.916993
21
160.509207
0
LINE
8
EuroPanel
10
127.916993
20
160.509207
11
128.436071
21
160.162371
0
LINE
8
EuroPanel
10
128.436071
20
160.162371
11
128.782907
21
159.643293
0
LINE
8
EuroPanel
10
128.782907
20
159.643293
11
128.904700
21
159.031000
0
LINE
8
EuroPanel
10
128.904700
20
159.031000
11
128.904700
21
159.031000
0
LINE
8
EuroPanel
10
128.904700
20
159.031000
11
128.782907
21
158.418707
0
LINE
8
EuroPanel
10
128.782907
20
158.418707
11
128.436071
21
157.899629
0
LINE
8
EuroPanel
10
128.436071
20
157.899629
11
127.916993
21
157.552793
0
LINE
8
EuroPanel
10
127.916993
20
157.552793
11
127.304700
21
157.431000
0
LINE
8
EuroPanel
10
127.304700
20
157.431000
11
125.004700
21
157.431000
0
LINE
8
EuroPanel
10
125.004700
20
157.431000
11
124.392407
21
157.552793
0
LINE
8
EuroPanel
10
124.392407
20
157.552793
11
123.873329
21
157.899629
0
LINE
8
EuroPanel
10
123.873329
20
157.899629
11
123.526493
21
158.418707
0
LINE
8
EuroPanel
10
123.526493
20
158.418707
11
123.404700
21
159.031000
0
LINE
8
EuroPanel
10
123.404700
20
159.031000
11
123.404700
21
159.031000
0
LINE
8
EuroPanel
10
123.404700
20
159.031000
11
123.526493
21
159.643293
0
LINE
8
EuroPanel
10
123.526493
20
159.643293
11
123.873329
21
160.162371
0
LINE
8
EuroPanel
10
123.873329
20
160.162371
11
124.392407
21
160.509207
0
LINE
8
EuroPanel
10
124.392407
20
160.509207
11
125.004700
21
160.631000
0
LINE
8
EuroPanel
10
125.004700
20
160.631000
11
125.004700
21
160.631000
0
LINE
8
EuroPanel
10
125.004700
20
194.281000
11
127.304700
21
194.281000
0
LINE
8
EuroPanel
10
127.304700
20
194.281000
11
127.916993
21
194.159207
0
LINE
8
EuroPanel
10
127.916993
20
194.159207
11
128.436071
21
193.812371
0
LINE
8
EuroPanel
10
128.436071
20
193.812371
11
128.782907
21
193.293293
0
LINE
8
EuroPanel
10
128.782907
20
193.293293
11
128.904700
21
192.681000
0
LINE
8
EuroPanel
10
128.904700
20
192.681000
11
128.904700
21
192.681000
0
LINE
8
EuroPanel
10
128.904700
20
192.681000
11
128.782907
21
192.068707
0
LINE
8
EuroPanel
10
128.782907
20
192.068707
11
128.436071
21
191.549629
0
LINE
8
EuroPanel
10
128.436071
20
191.549629
11
127.916993
21
191.202793
0
LINE
8
EuroPanel
10
127.916993
20
191.202793
11
127.304700
21
191.081000
0
LINE
8
EuroPanel
10
127.304700
20
191.081000
11
125.004700
21
191.081000
0
LINE
8
EuroPanel
10
125.004700
20
191.081000
11
124.392407
21
191.202793
0
LINE
8
EuroPanel
10
124.392407
20
191.202793
11
123.873329
21
191.549629
0
LINE
8
EuroPanel
10
123.873329
20
191.549629
11
123.526493
21
192.068707
0
LINE
8
EuroPanel
10
123.526493
20
192.068707
11
123.404700
21
192.681000
0
LINE
8
EuroPanel
10
123.404700
20
192.681000
11
123.404700
21
192.681000
0
LINE
8
EuroPanel
10
123.404700
20
192.681000
11
123.526493
21
193.293293
0
LINE
8
EuroPanel
10
123.526493
20
193.293293
11
123.873329
21
193.812371
0
LINE
8
EuroPanel
10
123.873329
20
193.812371
11
124.392407
21
194.159207
0
LINE
8
EuroPanel
10
124.392407
20
194.159207
11
125.004700
21
194.281000
0
LINE
8
EuroPanel
10
125.004700
20
194.281000
11
125.004700
21
194.281000
 0 
ENDSEC
 0 
EOF