999
"DXF R12 Output" (www.mydxf.blogspot.com)
 0 
SECTION
 2 
HEADER
 9 
$ACADVER
 1 
AC1009
 9 
$EXTMIN
 10 
 0 
 20 
 0 
 9 
$EXTMAX
 10 
 8.5 
 20 
 11 
 0 
ENDSEC
 0 
SECTION
 2 
ENTITIES
0
LINE
8
EuroPanel
10
57.804700
20
240.106000
11
118.404700
21
240.106000
0
LINE
8
EuroPanel
10
118.404700
20
240.106000
11
118.404700
21
111.606000
0
LINE
8
EuroPanel
10
118.404700
20
111.606000
11
57.804700
21
111.606000
0
LINE
8
EuroPanel
10
57.804700
20
111.606000
11
57.804700
21
240.106000
0
LINE
8
EuroPanel
10
64.154700
20
116.206000
11
66.454700
21
116.206000
0
LINE
8
EuroPanel
10
66.454700
20
116.206000
11
67.066993
21
116.084207
0
LINE
8
EuroPanel
10
67.066993
20
116.084207
11
67.586071
21
115.737371
0
LINE
8
EuroPanel
10
67.586071
20
115.737371
11
67.932907
21
115.218293
0
LINE
8
EuroPanel
10
67.932907
20
115.218293
11
68.054700
21
114.606000
0
LINE
8
EuroPanel
10
68.054700
20
114.606000
11
68.054700
21
114.606000
0
LINE
8
EuroPanel
10
68.054700
20
114.606000
11
67.932907
21
113.993707
0
LINE
8
EuroPanel
10
67.932907
20
113.993707
11
67.586071
21
113.474629
0
LINE
8
EuroPanel
10
67.586071
20
113.474629
11
67.066993
21
113.127793
0
LINE
8
EuroPanel
10
67.066993
20
113.127793
11
66.454700
21
113.006000
0
LINE
8
EuroPanel
10
66.454700
20
113.006000
11
64.154700
21
113.006000
0
LINE
8
EuroPanel
10
64.154700
20
113.006000
11
63.531908
21
113.131736
0
LINE
8
EuroPanel
10
63.531908
20
113.131736
11
63.023329
21
113.474629
0
LINE
8
EuroPanel
10
63.023329
20
113.474629
11
62.680436
21
113.983208
0
LINE
8
EuroPanel
10
62.680436
20
113.983208
11
62.554700
21
114.606000
0
LINE
8
EuroPanel
10
62.554700
20
114.606000
11
62.554700
21
114.606000
0
LINE
8
EuroPanel
10
62.554700
20
114.606000
11
62.680436
21
115.228792
0
LINE
8
EuroPanel
10
62.680436
20
115.228792
11
63.023329
21
115.737371
0
LINE
8
EuroPanel
10
63.023329
20
115.737371
11
63.531908
21
116.080264
0
LINE
8
EuroPanel
10
63.531908
20
116.080264
11
64.154700
21
116.206000
0
LINE
8
EuroPanel
10
64.154700
20
116.206000
11
64.154700
21
116.206000
0
LINE
8
EuroPanel
10
64.154700
20
238.706000
11
66.454700
21
238.706000
0
LINE
8
EuroPanel
10
66.454700
20
238.706000
11
67.066993
21
238.584207
0
LINE
8
EuroPanel
10
67.066993
20
238.584207
11
67.586071
21
238.237371
0
LINE
8
EuroPanel
10
67.586071
20
238.237371
11
67.932907
21
237.718293
0
LINE
8
EuroPanel
10
67.932907
20
237.718293
11
68.054700
21
237.106000
0
LINE
8
EuroPanel
10
68.054700
20
237.106000
11
68.054700
21
237.106000
0
LINE
8
EuroPanel
10
68.054700
20
237.106000
11
67.932907
21
236.493707
0
LINE
8
EuroPanel
10
67.932907
20
236.493707
11
67.586071
21
235.974629
0
LINE
8
EuroPanel
10
67.586071
20
235.974629
11
67.066993
21
235.627793
0
LINE
8
EuroPanel
10
67.066993
20
235.627793
11
66.454700
21
235.506000
0
LINE
8
EuroPanel
10
66.454700
20
235.506000
11
64.154700
21
235.506000
0
LINE
8
EuroPanel
10
64.154700
20
235.506000
11
63.531908
21
235.631736
0
LINE
8
EuroPanel
10
63.531908
20
235.631736
11
63.023329
21
235.974629
0
LINE
8
EuroPanel
10
63.023329
20
235.974629
11
62.680436
21
236.483208
0
LINE
8
EuroPanel
10
62.680436
20
236.483208
11
62.554700
21
237.106000
0
LINE
8
EuroPanel
10
62.554700
20
237.106000
11
62.554700
21
237.106000
0
LINE
8
EuroPanel
10
62.554700
20
237.106000
11
62.680436
21
237.728792
0
LINE
8
EuroPanel
10
62.680436
20
237.728792
11
63.023329
21
238.237371
0
LINE
8
EuroPanel
10
63.023329
20
238.237371
11
63.531908
21
238.580264
0
LINE
8
EuroPanel
10
63.531908
20
238.580264
11
64.154700
21
238.706000
0
LINE
8
EuroPanel
10
64.154700
20
238.706000
11
64.154700
21
238.706000
0
LINE
8
EuroPanel
10
109.874700
20
116.206000
11
112.174700
21
116.206000
0
LINE
8
EuroPanel
10
112.174700
20
116.206000
11
112.797492
21
116.080264
0
LINE
8
EuroPanel
10
112.797492
20
116.080264
11
113.306071
21
115.737371
0
LINE
8
EuroPanel
10
113.306071
20
115.737371
11
113.648964
21
115.228792
0
LINE
8
EuroPanel
10
113.648964
20
115.228792
11
113.774700
21
114.606000
0
LINE
8
EuroPanel
10
113.774700
20
114.606000
11
113.774700
21
114.606000
0
LINE
8
EuroPanel
10
113.774700
20
114.606000
11
113.648964
21
113.983208
0
LINE
8
EuroPanel
10
113.648964
20
113.983208
11
113.306071
21
113.474629
0
LINE
8
EuroPanel
10
113.306071
20
113.474629
11
112.797492
21
113.131736
0
LINE
8
EuroPanel
10
112.797492
20
113.131736
11
112.174700
21
113.006000
0
LINE
8
EuroPanel
10
112.174700
20
113.006000
11
109.874700
21
113.006000
0
LINE
8
EuroPanel
10
109.874700
20
113.006000
11
109.262407
21
113.127793
0
LINE
8
EuroPanel
10
109.262407
20
113.127793
11
108.743329
21
113.474629
0
LINE
8
EuroPanel
10
108.743329
20
113.474629
11
108.396493
21
113.993707
0
LINE
8
EuroPanel
10
108.396493
20
113.993707
11
108.274700
21
114.606000
0
LINE
8
EuroPanel
10
108.274700
20
114.606000
11
108.274700
21
114.606000
0
LINE
8
EuroPanel
10
108.274700
20
114.606000
11
108.396493
21
115.218293
0
LINE
8
EuroPanel
10
108.396493
20
115.218293
11
108.743329
21
115.737371
0
LINE
8
EuroPanel
10
108.743329
20
115.737371
11
109.262407
21
116.084207
0
LINE
8
EuroPanel
10
109.262407
20
116.084207
11
109.874700
21
116.206000
0
LINE
8
EuroPanel
10
109.874700
20
116.206000
11
109.874700
21
116.206000
0
LINE
8
EuroPanel
10
109.874700
20
238.706000
11
112.174700
21
238.706000
0
LINE
8
EuroPanel
10
112.174700
20
238.706000
11
112.797492
21
238.580264
0
LINE
8
EuroPanel
10
112.797492
20
238.580264
11
113.306071
21
238.237371
0
LINE
8
EuroPanel
10
113.306071
20
238.237371
11
113.648964
21
237.728792
0
LINE
8
EuroPanel
10
113.648964
20
237.728792
11
113.774700
21
237.106000
0
LINE
8
EuroPanel
10
113.774700
20
237.106000
11
113.774700
21
237.106000
0
LINE
8
EuroPanel
10
113.774700
20
237.106000
11
113.648964
21
236.483208
0
LINE
8
EuroPanel
10
113.648964
20
236.483208
11
113.306071
21
235.974629
0
LINE
8
EuroPanel
10
113.306071
20
235.974629
11
112.797492
21
235.631736
0
LINE
8
EuroPanel
10
112.797492
20
235.631736
11
112.174700
21
235.506000
0
LINE
8
EuroPanel
10
112.174700
20
235.506000
11
109.874700
21
235.506000
0
LINE
8
EuroPanel
10
109.874700
20
235.506000
11
109.262407
21
235.627793
0
LINE
8
EuroPanel
10
109.262407
20
235.627793
11
108.743329
21
235.974629
0
LINE
8
EuroPanel
10
108.743329
20
235.974629
11
108.396493
21
236.493707
0
LINE
8
EuroPanel
10
108.396493
20
236.493707
11
108.274700
21
237.106000
0
LINE
8
EuroPanel
10
108.274700
20
237.106000
11
108.274700
21
237.106000
0
LINE
8
EuroPanel
10
108.274700
20
237.106000
11
108.396493
21
237.718293
0
LINE
8
EuroPanel
10
108.396493
20
237.718293
11
108.743329
21
238.237371
0
LINE
8
EuroPanel
10
108.743329
20
238.237371
11
109.262407
21
238.584207
0
LINE
8
EuroPanel
10
109.262407
20
238.584207
11
109.874700
21
238.706000
0
LINE
8
EuroPanel
10
109.874700
20
238.706000
11
109.874700
21
238.706000
 0 
ENDSEC
 0 
EOF