999
"DXF R12 Output" (www.mydxf.blogspot.com)
 0 
SECTION
 2 
HEADER
 9 
$ACADVER
 1 
AC1009
 9 
$EXTMIN
 10 
 0 
 20 
 0 
 9 
$EXTMAX
 10 
 8.5 
 20 
 11 
 0 
ENDSEC
 0 
SECTION
 2 
ENTITIES
0
LINE
8
EuroPanel
10
3.932160
20
218.692000
11
216.932160
21
218.692000
0
LINE
8
EuroPanel
10
216.932160
20
218.692000
11
216.932160
21
90.192000
0
LINE
8
EuroPanel
10
216.932160
20
90.192000
11
3.932160
21
90.192000
0
LINE
8
EuroPanel
10
3.932160
20
90.192000
11
3.932160
21
218.692000
0
LINE
8
EuroPanel
10
10.282160
20
94.792000
11
12.582160
21
94.792000
0
LINE
8
EuroPanel
10
12.582160
20
94.792000
11
13.204952
21
94.666264
0
LINE
8
EuroPanel
10
13.204952
20
94.666264
11
13.713531
21
94.323371
0
LINE
8
EuroPanel
10
13.713531
20
94.323371
11
14.056424
21
93.814792
0
LINE
8
EuroPanel
10
14.056424
20
93.814792
11
14.182160
21
93.192000
0
LINE
8
EuroPanel
10
14.182160
20
93.192000
11
14.182160
21
93.192000
0
LINE
8
EuroPanel
10
14.182160
20
93.192000
11
14.056424
21
92.569208
0
LINE
8
EuroPanel
10
14.056424
20
92.569208
11
13.713531
21
92.060629
0
LINE
8
EuroPanel
10
13.713531
20
92.060629
11
13.204952
21
91.717736
0
LINE
8
EuroPanel
10
13.204952
20
91.717736
11
12.582160
21
91.592000
0
LINE
8
EuroPanel
10
12.582160
20
91.592000
11
10.282160
21
91.592000
0
LINE
8
EuroPanel
10
10.282160
20
91.592000
11
9.669867
21
91.713793
0
LINE
8
EuroPanel
10
9.669867
20
91.713793
11
9.150789
21
92.060629
0
LINE
8
EuroPanel
10
9.150789
20
92.060629
11
8.803953
21
92.579707
0
LINE
8
EuroPanel
10
8.803953
20
92.579707
11
8.682160
21
93.192000
0
LINE
8
EuroPanel
10
8.682160
20
93.192000
11
8.682160
21
93.192000
0
LINE
8
EuroPanel
10
8.682160
20
93.192000
11
8.803953
21
93.804293
0
LINE
8
EuroPanel
10
8.803953
20
93.804293
11
9.150789
21
94.323371
0
LINE
8
EuroPanel
10
9.150789
20
94.323371
11
9.669867
21
94.670207
0
LINE
8
EuroPanel
10
9.669867
20
94.670207
11
10.282160
21
94.792000
0
LINE
8
EuroPanel
10
10.282160
20
94.792000
11
10.282160
21
94.792000
0
LINE
8
EuroPanel
10
10.282160
20
217.292000
11
12.582160
21
217.292000
0
LINE
8
EuroPanel
10
12.582160
20
217.292000
11
13.204952
21
217.166264
0
LINE
8
EuroPanel
10
13.204952
20
217.166264
11
13.713531
21
216.823371
0
LINE
8
EuroPanel
10
13.713531
20
216.823371
11
14.056424
21
216.314792
0
LINE
8
EuroPanel
10
14.056424
20
216.314792
11
14.182160
21
215.692000
0
LINE
8
EuroPanel
10
14.182160
20
215.692000
11
14.182160
21
215.692000
0
LINE
8
EuroPanel
10
14.182160
20
215.692000
11
14.056424
21
215.069208
0
LINE
8
EuroPanel
10
14.056424
20
215.069208
11
13.713531
21
214.560629
0
LINE
8
EuroPanel
10
13.713531
20
214.560629
11
13.204952
21
214.217736
0
LINE
8
EuroPanel
10
13.204952
20
214.217736
11
12.582160
21
214.092000
0
LINE
8
EuroPanel
10
12.582160
20
214.092000
11
10.282160
21
214.092000
0
LINE
8
EuroPanel
10
10.282160
20
214.092000
11
9.669867
21
214.213793
0
LINE
8
EuroPanel
10
9.669867
20
214.213793
11
9.150789
21
214.560629
0
LINE
8
EuroPanel
10
9.150789
20
214.560629
11
8.803953
21
215.079707
0
LINE
8
EuroPanel
10
8.803953
20
215.079707
11
8.682160
21
215.692000
0
LINE
8
EuroPanel
10
8.682160
20
215.692000
11
8.682160
21
215.692000
0
LINE
8
EuroPanel
10
8.682160
20
215.692000
11
8.803953
21
216.304293
0
LINE
8
EuroPanel
10
8.803953
20
216.304293
11
9.150789
21
216.823371
0
LINE
8
EuroPanel
10
9.150789
20
216.823371
11
9.669867
21
217.170207
0
LINE
8
EuroPanel
10
9.669867
20
217.170207
11
10.282160
21
217.292000
0
LINE
8
EuroPanel
10
10.282160
20
217.292000
11
10.282160
21
217.292000
0
LINE
8
EuroPanel
10
208.402160
20
94.792000
11
210.702160
21
94.792000
0
LINE
8
EuroPanel
10
210.702160
20
94.792000
11
211.314453
21
94.670207
0
LINE
8
EuroPanel
10
211.314453
20
94.670207
11
211.833531
21
94.323371
0
LINE
8
EuroPanel
10
211.833531
20
94.323371
11
212.180367
21
93.804293
0
LINE
8
EuroPanel
10
212.180367
20
93.804293
11
212.302160
21
93.192000
0
LINE
8
EuroPanel
10
212.302160
20
93.192000
11
212.302160
21
93.192000
0
LINE
8
EuroPanel
10
212.302160
20
93.192000
11
212.180367
21
92.579707
0
LINE
8
EuroPanel
10
212.180367
20
92.579707
11
211.833531
21
92.060629
0
LINE
8
EuroPanel
10
211.833531
20
92.060629
11
211.314453
21
91.713793
0
LINE
8
EuroPanel
10
211.314453
20
91.713793
11
210.702160
21
91.592000
0
LINE
8
EuroPanel
10
210.702160
20
91.592000
11
208.402160
21
91.592000
0
LINE
8
EuroPanel
10
208.402160
20
91.592000
11
207.789867
21
91.713793
0
LINE
8
EuroPanel
10
207.789867
20
91.713793
11
207.270789
21
92.060629
0
LINE
8
EuroPanel
10
207.270789
20
92.060629
11
206.923953
21
92.579707
0
LINE
8
EuroPanel
10
206.923953
20
92.579707
11
206.802160
21
93.192000
0
LINE
8
EuroPanel
10
206.802160
20
93.192000
11
206.802160
21
93.192000
0
LINE
8
EuroPanel
10
206.802160
20
93.192000
11
206.923953
21
93.804293
0
LINE
8
EuroPanel
10
206.923953
20
93.804293
11
207.270789
21
94.323371
0
LINE
8
EuroPanel
10
207.270789
20
94.323371
11
207.789867
21
94.670207
0
LINE
8
EuroPanel
10
207.789867
20
94.670207
11
208.402160
21
94.792000
0
LINE
8
EuroPanel
10
208.402160
20
94.792000
11
208.402160
21
94.792000
0
LINE
8
EuroPanel
10
208.402160
20
217.292000
11
210.702160
21
217.292000
0
LINE
8
EuroPanel
10
210.702160
20
217.292000
11
211.314453
21
217.170207
0
LINE
8
EuroPanel
10
211.314453
20
217.170207
11
211.833531
21
216.823371
0
LINE
8
EuroPanel
10
211.833531
20
216.823371
11
212.180367
21
216.304293
0
LINE
8
EuroPanel
10
212.180367
20
216.304293
11
212.302160
21
215.692000
0
LINE
8
EuroPanel
10
212.302160
20
215.692000
11
212.302160
21
215.692000
0
LINE
8
EuroPanel
10
212.302160
20
215.692000
11
212.180367
21
215.079707
0
LINE
8
EuroPanel
10
212.180367
20
215.079707
11
211.833531
21
214.560629
0
LINE
8
EuroPanel
10
211.833531
20
214.560629
11
211.314453
21
214.213793
0
LINE
8
EuroPanel
10
211.314453
20
214.213793
11
210.702160
21
214.092000
0
LINE
8
EuroPanel
10
210.702160
20
214.092000
11
208.402160
21
214.092000
0
LINE
8
EuroPanel
10
208.402160
20
214.092000
11
207.789867
21
214.213793
0
LINE
8
EuroPanel
10
207.789867
20
214.213793
11
207.270789
21
214.560629
0
LINE
8
EuroPanel
10
207.270789
20
214.560629
11
206.923953
21
215.079707
0
LINE
8
EuroPanel
10
206.923953
20
215.079707
11
206.802160
21
215.692000
0
LINE
8
EuroPanel
10
206.802160
20
215.692000
11
206.802160
21
215.692000
0
LINE
8
EuroPanel
10
206.802160
20
215.692000
11
206.923953
21
216.304293
0
LINE
8
EuroPanel
10
206.923953
20
216.304293
11
207.270789
21
216.823371
0
LINE
8
EuroPanel
10
207.270789
20
216.823371
11
207.789867
21
217.170207
0
LINE
8
EuroPanel
10
207.789867
20
217.170207
11
208.402160
21
217.292000
0
LINE
8
EuroPanel
10
208.402160
20
217.292000
11
208.402160
21
217.292000
 0 
ENDSEC
 0 
EOF