999
"DXF R12 Output" (www.mydxf.blogspot.com)
 0 
SECTION
 2 
HEADER
 9 
$ACADVER
 1 
AC1009
 9 
$EXTMIN
 10 
 0 
 20 
 0 
 9 
$EXTMAX
 10 
 8.5 
 20 
 11 
 0 
ENDSEC
 0 
SECTION
 2 
ENTITIES
0
LINE
8
EuroPanel
10
73.104700
20
240.106000
11
103.104700
21
240.106000
0
LINE
8
EuroPanel
10
103.104700
20
240.106000
11
103.104700
21
111.606000
0
LINE
8
EuroPanel
10
103.104700
20
111.606000
11
73.104700
21
111.606000
0
LINE
8
EuroPanel
10
73.104700
20
111.606000
11
73.104700
21
240.106000
0
LINE
8
EuroPanel
10
79.454700
20
116.206000
11
81.754700
21
116.206000
0
LINE
8
EuroPanel
10
81.754700
20
116.206000
11
82.366993
21
116.084207
0
LINE
8
EuroPanel
10
82.366993
20
116.084207
11
82.886071
21
115.737371
0
LINE
8
EuroPanel
10
82.886071
20
115.737371
11
83.232907
21
115.218293
0
LINE
8
EuroPanel
10
83.232907
20
115.218293
11
83.354700
21
114.606000
0
LINE
8
EuroPanel
10
83.354700
20
114.606000
11
83.354700
21
114.606000
0
LINE
8
EuroPanel
10
83.354700
20
114.606000
11
83.232907
21
113.993707
0
LINE
8
EuroPanel
10
83.232907
20
113.993707
11
82.886071
21
113.474629
0
LINE
8
EuroPanel
10
82.886071
20
113.474629
11
82.366993
21
113.127793
0
LINE
8
EuroPanel
10
82.366993
20
113.127793
11
81.754700
21
113.006000
0
LINE
8
EuroPanel
10
81.754700
20
113.006000
11
79.454700
21
113.006000
0
LINE
8
EuroPanel
10
79.454700
20
113.006000
11
78.842407
21
113.127793
0
LINE
8
EuroPanel
10
78.842407
20
113.127793
11
78.323329
21
113.474629
0
LINE
8
EuroPanel
10
78.323329
20
113.474629
11
77.976493
21
113.993707
0
LINE
8
EuroPanel
10
77.976493
20
113.993707
11
77.854700
21
114.606000
0
LINE
8
EuroPanel
10
77.854700
20
114.606000
11
77.854700
21
114.606000
0
LINE
8
EuroPanel
10
77.854700
20
114.606000
11
77.976493
21
115.218293
0
LINE
8
EuroPanel
10
77.976493
20
115.218293
11
78.323329
21
115.737371
0
LINE
8
EuroPanel
10
78.323329
20
115.737371
11
78.842407
21
116.084207
0
LINE
8
EuroPanel
10
78.842407
20
116.084207
11
79.454700
21
116.206000
0
LINE
8
EuroPanel
10
79.454700
20
116.206000
11
79.454700
21
116.206000
0
LINE
8
EuroPanel
10
79.454700
20
238.706000
11
81.754700
21
238.706000
0
LINE
8
EuroPanel
10
81.754700
20
238.706000
11
82.366993
21
238.584207
0
LINE
8
EuroPanel
10
82.366993
20
238.584207
11
82.886071
21
238.237371
0
LINE
8
EuroPanel
10
82.886071
20
238.237371
11
83.232907
21
237.718293
0
LINE
8
EuroPanel
10
83.232907
20
237.718293
11
83.354700
21
237.106000
0
LINE
8
EuroPanel
10
83.354700
20
237.106000
11
83.354700
21
237.106000
0
LINE
8
EuroPanel
10
83.354700
20
237.106000
11
83.232907
21
236.493707
0
LINE
8
EuroPanel
10
83.232907
20
236.493707
11
82.886071
21
235.974629
0
LINE
8
EuroPanel
10
82.886071
20
235.974629
11
82.366993
21
235.627793
0
LINE
8
EuroPanel
10
82.366993
20
235.627793
11
81.754700
21
235.506000
0
LINE
8
EuroPanel
10
81.754700
20
235.506000
11
79.454700
21
235.506000
0
LINE
8
EuroPanel
10
79.454700
20
235.506000
11
78.842407
21
235.627793
0
LINE
8
EuroPanel
10
78.842407
20
235.627793
11
78.323329
21
235.974629
0
LINE
8
EuroPanel
10
78.323329
20
235.974629
11
77.976493
21
236.493707
0
LINE
8
EuroPanel
10
77.976493
20
236.493707
11
77.854700
21
237.106000
0
LINE
8
EuroPanel
10
77.854700
20
237.106000
11
77.854700
21
237.106000
0
LINE
8
EuroPanel
10
77.854700
20
237.106000
11
77.976493
21
237.718293
0
LINE
8
EuroPanel
10
77.976493
20
237.718293
11
78.323329
21
238.237371
0
LINE
8
EuroPanel
10
78.323329
20
238.237371
11
78.842407
21
238.584207
0
LINE
8
EuroPanel
10
78.842407
20
238.584207
11
79.454700
21
238.706000
0
LINE
8
EuroPanel
10
79.454700
20
238.706000
11
79.454700
21
238.706000
0
LINE
8
EuroPanel
10
94.694700
20
116.206000
11
96.994700
21
116.206000
0
LINE
8
EuroPanel
10
96.994700
20
116.206000
11
97.606993
21
116.084207
0
LINE
8
EuroPanel
10
97.606993
20
116.084207
11
98.126071
21
115.737371
0
LINE
8
EuroPanel
10
98.126071
20
115.737371
11
98.472907
21
115.218293
0
LINE
8
EuroPanel
10
98.472907
20
115.218293
11
98.594700
21
114.606000
0
LINE
8
EuroPanel
10
98.594700
20
114.606000
11
98.594700
21
114.606000
0
LINE
8
EuroPanel
10
98.594700
20
114.606000
11
98.472907
21
113.993707
0
LINE
8
EuroPanel
10
98.472907
20
113.993707
11
98.126071
21
113.474629
0
LINE
8
EuroPanel
10
98.126071
20
113.474629
11
97.606993
21
113.127793
0
LINE
8
EuroPanel
10
97.606993
20
113.127793
11
96.994700
21
113.006000
0
LINE
8
EuroPanel
10
96.994700
20
113.006000
11
94.694700
21
113.006000
0
LINE
8
EuroPanel
10
94.694700
20
113.006000
11
94.082407
21
113.127793
0
LINE
8
EuroPanel
10
94.082407
20
113.127793
11
93.563329
21
113.474629
0
LINE
8
EuroPanel
10
93.563329
20
113.474629
11
93.216493
21
113.993707
0
LINE
8
EuroPanel
10
93.216493
20
113.993707
11
93.094700
21
114.606000
0
LINE
8
EuroPanel
10
93.094700
20
114.606000
11
93.094700
21
114.606000
0
LINE
8
EuroPanel
10
93.094700
20
114.606000
11
93.216493
21
115.218293
0
LINE
8
EuroPanel
10
93.216493
20
115.218293
11
93.563329
21
115.737371
0
LINE
8
EuroPanel
10
93.563329
20
115.737371
11
94.082407
21
116.084207
0
LINE
8
EuroPanel
10
94.082407
20
116.084207
11
94.694700
21
116.206000
0
LINE
8
EuroPanel
10
94.694700
20
116.206000
11
94.694700
21
116.206000
0
LINE
8
EuroPanel
10
94.694700
20
238.706000
11
96.994700
21
238.706000
0
LINE
8
EuroPanel
10
96.994700
20
238.706000
11
97.606993
21
238.584207
0
LINE
8
EuroPanel
10
97.606993
20
238.584207
11
98.126071
21
238.237371
0
LINE
8
EuroPanel
10
98.126071
20
238.237371
11
98.472907
21
237.718293
0
LINE
8
EuroPanel
10
98.472907
20
237.718293
11
98.594700
21
237.106000
0
LINE
8
EuroPanel
10
98.594700
20
237.106000
11
98.594700
21
237.106000
0
LINE
8
EuroPanel
10
98.594700
20
237.106000
11
98.472907
21
236.493707
0
LINE
8
EuroPanel
10
98.472907
20
236.493707
11
98.126071
21
235.974629
0
LINE
8
EuroPanel
10
98.126071
20
235.974629
11
97.606993
21
235.627793
0
LINE
8
EuroPanel
10
97.606993
20
235.627793
11
96.994700
21
235.506000
0
LINE
8
EuroPanel
10
96.994700
20
235.506000
11
94.694700
21
235.506000
0
LINE
8
EuroPanel
10
94.694700
20
235.506000
11
94.082407
21
235.627793
0
LINE
8
EuroPanel
10
94.082407
20
235.627793
11
93.563329
21
235.974629
0
LINE
8
EuroPanel
10
93.563329
20
235.974629
11
93.216493
21
236.493707
0
LINE
8
EuroPanel
10
93.216493
20
236.493707
11
93.094700
21
237.106000
0
LINE
8
EuroPanel
10
93.094700
20
237.106000
11
93.094700
21
237.106000
0
LINE
8
EuroPanel
10
93.094700
20
237.106000
11
93.216493
21
237.718293
0
LINE
8
EuroPanel
10
93.216493
20
237.718293
11
93.563329
21
238.237371
0
LINE
8
EuroPanel
10
93.563329
20
238.237371
11
94.082407
21
238.584207
0
LINE
8
EuroPanel
10
94.082407
20
238.584207
11
94.694700
21
238.706000
0
LINE
8
EuroPanel
10
94.694700
20
238.706000
11
94.694700
21
238.706000
 0 
ENDSEC
 0 
EOF