999
"DXF R12 Output" (www.mydxf.blogspot.com)
 0 
SECTION
 2 
HEADER
 9 
$ACADVER
 1 
AC1009
 9 
$EXTMIN
 10 
 0 
 20 
 0 
 9 
$EXTMAX
 10 
 8.5 
 20 
 11 
 0 
ENDSEC
 0 
SECTION
 2 
ENTITIES
0
LINE
8
EuroPanel
10
37.454700
20
240.106000
11
138.754700
21
240.106000
0
LINE
8
EuroPanel
10
138.754700
20
240.106000
11
138.754700
21
111.606000
0
LINE
8
EuroPanel
10
138.754700
20
111.606000
11
37.454700
21
111.606000
0
LINE
8
EuroPanel
10
37.454700
20
111.606000
11
37.454700
21
240.106000
0
LINE
8
EuroPanel
10
43.804700
20
116.206000
11
46.104700
21
116.206000
0
LINE
8
EuroPanel
10
46.104700
20
116.206000
11
46.716993
21
116.084207
0
LINE
8
EuroPanel
10
46.716993
20
116.084207
11
47.236071
21
115.737371
0
LINE
8
EuroPanel
10
47.236071
20
115.737371
11
47.582907
21
115.218293
0
LINE
8
EuroPanel
10
47.582907
20
115.218293
11
47.704700
21
114.606000
0
LINE
8
EuroPanel
10
47.704700
20
114.606000
11
47.704700
21
114.606000
0
LINE
8
EuroPanel
10
47.704700
20
114.606000
11
47.582907
21
113.993707
0
LINE
8
EuroPanel
10
47.582907
20
113.993707
11
47.236071
21
113.474629
0
LINE
8
EuroPanel
10
47.236071
20
113.474629
11
46.716993
21
113.127793
0
LINE
8
EuroPanel
10
46.716993
20
113.127793
11
46.104700
21
113.006000
0
LINE
8
EuroPanel
10
46.104700
20
113.006000
11
43.804700
21
113.006000
0
LINE
8
EuroPanel
10
43.804700
20
113.006000
11
43.192407
21
113.127793
0
LINE
8
EuroPanel
10
43.192407
20
113.127793
11
42.673329
21
113.474629
0
LINE
8
EuroPanel
10
42.673329
20
113.474629
11
42.326493
21
113.993707
0
LINE
8
EuroPanel
10
42.326493
20
113.993707
11
42.204700
21
114.606000
0
LINE
8
EuroPanel
10
42.204700
20
114.606000
11
42.204700
21
114.606000
0
LINE
8
EuroPanel
10
42.204700
20
114.606000
11
42.326493
21
115.218293
0
LINE
8
EuroPanel
10
42.326493
20
115.218293
11
42.673329
21
115.737371
0
LINE
8
EuroPanel
10
42.673329
20
115.737371
11
43.192407
21
116.084207
0
LINE
8
EuroPanel
10
43.192407
20
116.084207
11
43.804700
21
116.206000
0
LINE
8
EuroPanel
10
43.804700
20
116.206000
11
43.804700
21
116.206000
0
LINE
8
EuroPanel
10
43.804700
20
238.706000
11
46.104700
21
238.706000
0
LINE
8
EuroPanel
10
46.104700
20
238.706000
11
46.716993
21
238.584207
0
LINE
8
EuroPanel
10
46.716993
20
238.584207
11
47.236071
21
238.237371
0
LINE
8
EuroPanel
10
47.236071
20
238.237371
11
47.582907
21
237.718293
0
LINE
8
EuroPanel
10
47.582907
20
237.718293
11
47.704700
21
237.106000
0
LINE
8
EuroPanel
10
47.704700
20
237.106000
11
47.704700
21
237.106000
0
LINE
8
EuroPanel
10
47.704700
20
237.106000
11
47.582907
21
236.493707
0
LINE
8
EuroPanel
10
47.582907
20
236.493707
11
47.236071
21
235.974629
0
LINE
8
EuroPanel
10
47.236071
20
235.974629
11
46.716993
21
235.627793
0
LINE
8
EuroPanel
10
46.716993
20
235.627793
11
46.104700
21
235.506000
0
LINE
8
EuroPanel
10
46.104700
20
235.506000
11
43.804700
21
235.506000
0
LINE
8
EuroPanel
10
43.804700
20
235.506000
11
43.192407
21
235.627793
0
LINE
8
EuroPanel
10
43.192407
20
235.627793
11
42.673329
21
235.974629
0
LINE
8
EuroPanel
10
42.673329
20
235.974629
11
42.326493
21
236.493707
0
LINE
8
EuroPanel
10
42.326493
20
236.493707
11
42.204700
21
237.106000
0
LINE
8
EuroPanel
10
42.204700
20
237.106000
11
42.204700
21
237.106000
0
LINE
8
EuroPanel
10
42.204700
20
237.106000
11
42.326493
21
237.718293
0
LINE
8
EuroPanel
10
42.326493
20
237.718293
11
42.673329
21
238.237371
0
LINE
8
EuroPanel
10
42.673329
20
238.237371
11
43.192407
21
238.584207
0
LINE
8
EuroPanel
10
43.192407
20
238.584207
11
43.804700
21
238.706000
0
LINE
8
EuroPanel
10
43.804700
20
238.706000
11
43.804700
21
238.706000
0
LINE
8
EuroPanel
10
130.164700
20
116.206000
11
132.464700
21
116.206000
0
LINE
8
EuroPanel
10
132.464700
20
116.206000
11
133.076993
21
116.084207
0
LINE
8
EuroPanel
10
133.076993
20
116.084207
11
133.596071
21
115.737371
0
LINE
8
EuroPanel
10
133.596071
20
115.737371
11
133.942907
21
115.218293
0
LINE
8
EuroPanel
10
133.942907
20
115.218293
11
134.064700
21
114.606000
0
LINE
8
EuroPanel
10
134.064700
20
114.606000
11
134.064700
21
114.606000
0
LINE
8
EuroPanel
10
134.064700
20
114.606000
11
133.942907
21
113.993707
0
LINE
8
EuroPanel
10
133.942907
20
113.993707
11
133.596071
21
113.474629
0
LINE
8
EuroPanel
10
133.596071
20
113.474629
11
133.076993
21
113.127793
0
LINE
8
EuroPanel
10
133.076993
20
113.127793
11
132.464700
21
113.006000
0
LINE
8
EuroPanel
10
132.464700
20
113.006000
11
130.164700
21
113.006000
0
LINE
8
EuroPanel
10
130.164700
20
113.006000
11
129.552407
21
113.127793
0
LINE
8
EuroPanel
10
129.552407
20
113.127793
11
129.033329
21
113.474629
0
LINE
8
EuroPanel
10
129.033329
20
113.474629
11
128.686493
21
113.993707
0
LINE
8
EuroPanel
10
128.686493
20
113.993707
11
128.564700
21
114.606000
0
LINE
8
EuroPanel
10
128.564700
20
114.606000
11
128.564700
21
114.606000
0
LINE
8
EuroPanel
10
128.564700
20
114.606000
11
128.686493
21
115.218293
0
LINE
8
EuroPanel
10
128.686493
20
115.218293
11
129.033329
21
115.737371
0
LINE
8
EuroPanel
10
129.033329
20
115.737371
11
129.552407
21
116.084207
0
LINE
8
EuroPanel
10
129.552407
20
116.084207
11
130.164700
21
116.206000
0
LINE
8
EuroPanel
10
130.164700
20
116.206000
11
130.164700
21
116.206000
0
LINE
8
EuroPanel
10
130.164700
20
238.706000
11
132.464700
21
238.706000
0
LINE
8
EuroPanel
10
132.464700
20
238.706000
11
133.076993
21
238.584207
0
LINE
8
EuroPanel
10
133.076993
20
238.584207
11
133.596071
21
238.237371
0
LINE
8
EuroPanel
10
133.596071
20
238.237371
11
133.942907
21
237.718293
0
LINE
8
EuroPanel
10
133.942907
20
237.718293
11
134.064700
21
237.106000
0
LINE
8
EuroPanel
10
134.064700
20
237.106000
11
134.064700
21
237.106000
0
LINE
8
EuroPanel
10
134.064700
20
237.106000
11
133.942907
21
236.493707
0
LINE
8
EuroPanel
10
133.942907
20
236.493707
11
133.596071
21
235.974629
0
LINE
8
EuroPanel
10
133.596071
20
235.974629
11
133.076993
21
235.627793
0
LINE
8
EuroPanel
10
133.076993
20
235.627793
11
132.464700
21
235.506000
0
LINE
8
EuroPanel
10
132.464700
20
235.506000
11
130.164700
21
235.506000
0
LINE
8
EuroPanel
10
130.164700
20
235.506000
11
129.552407
21
235.627793
0
LINE
8
EuroPanel
10
129.552407
20
235.627793
11
129.033329
21
235.974629
0
LINE
8
EuroPanel
10
129.033329
20
235.974629
11
128.686493
21
236.493707
0
LINE
8
EuroPanel
10
128.686493
20
236.493707
11
128.564700
21
237.106000
0
LINE
8
EuroPanel
10
128.564700
20
237.106000
11
128.564700
21
237.106000
0
LINE
8
EuroPanel
10
128.564700
20
237.106000
11
128.686493
21
237.718293
0
LINE
8
EuroPanel
10
128.686493
20
237.718293
11
129.033329
21
238.237371
0
LINE
8
EuroPanel
10
129.033329
20
238.237371
11
129.552407
21
238.584207
0
LINE
8
EuroPanel
10
129.552407
20
238.584207
11
130.164700
21
238.706000
0
LINE
8
EuroPanel
10
130.164700
20
238.706000
11
130.164700
21
238.706000
 0 
ENDSEC
 0 
EOF