999
"DXF R12 Output" (www.mydxf.blogspot.com)
 0 
SECTION
 2 
HEADER
 9 
$ACADVER
 1 
AC1009
 9 
$EXTMIN
 10 
 0 
 20 
 0 
 9 
$EXTMAX
 10 
 8.5 
 20 
 11 
 0 
ENDSEC
 0 
SECTION
 2 
ENTITIES
0
LINE
8
EuroPanel
10
57.804700
20
195.681000
11
118.404700
21
195.681000
0
LINE
8
EuroPanel
10
118.404700
20
195.681000
11
118.404700
21
156.031000
0
LINE
8
EuroPanel
10
118.404700
20
156.031000
11
57.804700
21
156.031000
0
LINE
8
EuroPanel
10
57.804700
20
156.031000
11
57.804700
21
195.681000
0
LINE
8
EuroPanel
10
64.154700
20
160.631000
11
66.454700
21
160.631000
0
LINE
8
EuroPanel
10
66.454700
20
160.631000
11
67.066993
21
160.509207
0
LINE
8
EuroPanel
10
67.066993
20
160.509207
11
67.586071
21
160.162371
0
LINE
8
EuroPanel
10
67.586071
20
160.162371
11
67.932907
21
159.643293
0
LINE
8
EuroPanel
10
67.932907
20
159.643293
11
68.054700
21
159.031000
0
LINE
8
EuroPanel
10
68.054700
20
159.031000
11
68.054700
21
159.031000
0
LINE
8
EuroPanel
10
68.054700
20
159.031000
11
67.932907
21
158.418707
0
LINE
8
EuroPanel
10
67.932907
20
158.418707
11
67.586071
21
157.899629
0
LINE
8
EuroPanel
10
67.586071
20
157.899629
11
67.066993
21
157.552793
0
LINE
8
EuroPanel
10
67.066993
20
157.552793
11
66.454700
21
157.431000
0
LINE
8
EuroPanel
10
66.454700
20
157.431000
11
64.154700
21
157.431000
0
LINE
8
EuroPanel
10
64.154700
20
157.431000
11
63.531908
21
157.556736
0
LINE
8
EuroPanel
10
63.531908
20
157.556736
11
63.023329
21
157.899629
0
LINE
8
EuroPanel
10
63.023329
20
157.899629
11
62.680436
21
158.408208
0
LINE
8
EuroPanel
10
62.680436
20
158.408208
11
62.554700
21
159.031000
0
LINE
8
EuroPanel
10
62.554700
20
159.031000
11
62.554700
21
159.031000
0
LINE
8
EuroPanel
10
62.554700
20
159.031000
11
62.680436
21
159.653792
0
LINE
8
EuroPanel
10
62.680436
20
159.653792
11
63.023329
21
160.162371
0
LINE
8
EuroPanel
10
63.023329
20
160.162371
11
63.531908
21
160.505264
0
LINE
8
EuroPanel
10
63.531908
20
160.505264
11
64.154700
21
160.631000
0
LINE
8
EuroPanel
10
64.154700
20
160.631000
11
64.154700
21
160.631000
0
LINE
8
EuroPanel
10
64.154700
20
194.281000
11
66.454700
21
194.281000
0
LINE
8
EuroPanel
10
66.454700
20
194.281000
11
67.066993
21
194.159207
0
LINE
8
EuroPanel
10
67.066993
20
194.159207
11
67.586071
21
193.812371
0
LINE
8
EuroPanel
10
67.586071
20
193.812371
11
67.932907
21
193.293293
0
LINE
8
EuroPanel
10
67.932907
20
193.293293
11
68.054700
21
192.681000
0
LINE
8
EuroPanel
10
68.054700
20
192.681000
11
68.054700
21
192.681000
0
LINE
8
EuroPanel
10
68.054700
20
192.681000
11
67.932907
21
192.068707
0
LINE
8
EuroPanel
10
67.932907
20
192.068707
11
67.586071
21
191.549629
0
LINE
8
EuroPanel
10
67.586071
20
191.549629
11
67.066993
21
191.202793
0
LINE
8
EuroPanel
10
67.066993
20
191.202793
11
66.454700
21
191.081000
0
LINE
8
EuroPanel
10
66.454700
20
191.081000
11
64.154700
21
191.081000
0
LINE
8
EuroPanel
10
64.154700
20
191.081000
11
63.531908
21
191.206736
0
LINE
8
EuroPanel
10
63.531908
20
191.206736
11
63.023329
21
191.549629
0
LINE
8
EuroPanel
10
63.023329
20
191.549629
11
62.680436
21
192.058208
0
LINE
8
EuroPanel
10
62.680436
20
192.058208
11
62.554700
21
192.681000
0
LINE
8
EuroPanel
10
62.554700
20
192.681000
11
62.554700
21
192.681000
0
LINE
8
EuroPanel
10
62.554700
20
192.681000
11
62.680436
21
193.303792
0
LINE
8
EuroPanel
10
62.680436
20
193.303792
11
63.023329
21
193.812371
0
LINE
8
EuroPanel
10
63.023329
20
193.812371
11
63.531908
21
194.155264
0
LINE
8
EuroPanel
10
63.531908
20
194.155264
11
64.154700
21
194.281000
0
LINE
8
EuroPanel
10
64.154700
20
194.281000
11
64.154700
21
194.281000
0
LINE
8
EuroPanel
10
109.874700
20
160.631000
11
112.174700
21
160.631000
0
LINE
8
EuroPanel
10
112.174700
20
160.631000
11
112.797492
21
160.505264
0
LINE
8
EuroPanel
10
112.797492
20
160.505264
11
113.306071
21
160.162371
0
LINE
8
EuroPanel
10
113.306071
20
160.162371
11
113.648964
21
159.653792
0
LINE
8
EuroPanel
10
113.648964
20
159.653792
11
113.774700
21
159.031000
0
LINE
8
EuroPanel
10
113.774700
20
159.031000
11
113.774700
21
159.031000
0
LINE
8
EuroPanel
10
113.774700
20
159.031000
11
113.648964
21
158.408208
0
LINE
8
EuroPanel
10
113.648964
20
158.408208
11
113.306071
21
157.899629
0
LINE
8
EuroPanel
10
113.306071
20
157.899629
11
112.797492
21
157.556736
0
LINE
8
EuroPanel
10
112.797492
20
157.556736
11
112.174700
21
157.431000
0
LINE
8
EuroPanel
10
112.174700
20
157.431000
11
109.874700
21
157.431000
0
LINE
8
EuroPanel
10
109.874700
20
157.431000
11
109.262407
21
157.552793
0
LINE
8
EuroPanel
10
109.262407
20
157.552793
11
108.743329
21
157.899629
0
LINE
8
EuroPanel
10
108.743329
20
157.899629
11
108.396493
21
158.418707
0
LINE
8
EuroPanel
10
108.396493
20
158.418707
11
108.274700
21
159.031000
0
LINE
8
EuroPanel
10
108.274700
20
159.031000
11
108.274700
21
159.031000
0
LINE
8
EuroPanel
10
108.274700
20
159.031000
11
108.396493
21
159.643293
0
LINE
8
EuroPanel
10
108.396493
20
159.643293
11
108.743329
21
160.162371
0
LINE
8
EuroPanel
10
108.743329
20
160.162371
11
109.262407
21
160.509207
0
LINE
8
EuroPanel
10
109.262407
20
160.509207
11
109.874700
21
160.631000
0
LINE
8
EuroPanel
10
109.874700
20
160.631000
11
109.874700
21
160.631000
0
LINE
8
EuroPanel
10
109.874700
20
194.281000
11
112.174700
21
194.281000
0
LINE
8
EuroPanel
10
112.174700
20
194.281000
11
112.797492
21
194.155264
0
LINE
8
EuroPanel
10
112.797492
20
194.155264
11
113.306071
21
193.812371
0
LINE
8
EuroPanel
10
113.306071
20
193.812371
11
113.648964
21
193.303792
0
LINE
8
EuroPanel
10
113.648964
20
193.303792
11
113.774700
21
192.681000
0
LINE
8
EuroPanel
10
113.774700
20
192.681000
11
113.774700
21
192.681000
0
LINE
8
EuroPanel
10
113.774700
20
192.681000
11
113.648964
21
192.058208
0
LINE
8
EuroPanel
10
113.648964
20
192.058208
11
113.306071
21
191.549629
0
LINE
8
EuroPanel
10
113.306071
20
191.549629
11
112.797492
21
191.206736
0
LINE
8
EuroPanel
10
112.797492
20
191.206736
11
112.174700
21
191.081000
0
LINE
8
EuroPanel
10
112.174700
20
191.081000
11
109.874700
21
191.081000
0
LINE
8
EuroPanel
10
109.874700
20
191.081000
11
109.262407
21
191.202793
0
LINE
8
EuroPanel
10
109.262407
20
191.202793
11
108.743329
21
191.549629
0
LINE
8
EuroPanel
10
108.743329
20
191.549629
11
108.396493
21
192.068707
0
LINE
8
EuroPanel
10
108.396493
20
192.068707
11
108.274700
21
192.681000
0
LINE
8
EuroPanel
10
108.274700
20
192.681000
11
108.274700
21
192.681000
0
LINE
8
EuroPanel
10
108.274700
20
192.681000
11
108.396493
21
193.293293
0
LINE
8
EuroPanel
10
108.396493
20
193.293293
11
108.743329
21
193.812371
0
LINE
8
EuroPanel
10
108.743329
20
193.812371
11
109.262407
21
194.159207
0
LINE
8
EuroPanel
10
109.262407
20
194.159207
11
109.874700
21
194.281000
0
LINE
8
EuroPanel
10
109.874700
20
194.281000
11
109.874700
21
194.281000
 0 
ENDSEC
 0 
EOF