999
"DXF R12 Output" (www.mydxf.blogspot.com)
 0 
SECTION
 2 
HEADER
 9 
$ACADVER
 1 
AC1009
 9 
$EXTMIN
 10 
 0 
 20 
 0 
 9 
$EXTMAX
 10 
 8.5 
 20 
 11 
 0 
ENDSEC
 0 
SECTION
 2 
ENTITIES
0
LINE
8
EuroPanel
10
47.654700
20
195.681000
11
128.554700
21
195.681000
0
LINE
8
EuroPanel
10
128.554700
20
195.681000
11
128.554700
21
156.031000
0
LINE
8
EuroPanel
10
128.554700
20
156.031000
11
47.654700
21
156.031000
0
LINE
8
EuroPanel
10
47.654700
20
156.031000
11
47.654700
21
195.681000
0
LINE
8
EuroPanel
10
54.004700
20
160.631000
11
56.304700
21
160.631000
0
LINE
8
EuroPanel
10
56.304700
20
160.631000
11
56.916993
21
160.509207
0
LINE
8
EuroPanel
10
56.916993
20
160.509207
11
57.436071
21
160.162371
0
LINE
8
EuroPanel
10
57.436071
20
160.162371
11
57.782907
21
159.643293
0
LINE
8
EuroPanel
10
57.782907
20
159.643293
11
57.904700
21
159.031000
0
LINE
8
EuroPanel
10
57.904700
20
159.031000
11
57.904700
21
159.031000
0
LINE
8
EuroPanel
10
57.904700
20
159.031000
11
57.782907
21
158.418707
0
LINE
8
EuroPanel
10
57.782907
20
158.418707
11
57.436071
21
157.899629
0
LINE
8
EuroPanel
10
57.436071
20
157.899629
11
56.916993
21
157.552793
0
LINE
8
EuroPanel
10
56.916993
20
157.552793
11
56.304700
21
157.431000
0
LINE
8
EuroPanel
10
56.304700
20
157.431000
11
54.004700
21
157.431000
0
LINE
8
EuroPanel
10
54.004700
20
157.431000
11
53.392407
21
157.552793
0
LINE
8
EuroPanel
10
53.392407
20
157.552793
11
52.873329
21
157.899629
0
LINE
8
EuroPanel
10
52.873329
20
157.899629
11
52.526493
21
158.418707
0
LINE
8
EuroPanel
10
52.526493
20
158.418707
11
52.404700
21
159.031000
0
LINE
8
EuroPanel
10
52.404700
20
159.031000
11
52.404700
21
159.031000
0
LINE
8
EuroPanel
10
52.404700
20
159.031000
11
52.526493
21
159.643293
0
LINE
8
EuroPanel
10
52.526493
20
159.643293
11
52.873329
21
160.162371
0
LINE
8
EuroPanel
10
52.873329
20
160.162371
11
53.392407
21
160.509207
0
LINE
8
EuroPanel
10
53.392407
20
160.509207
11
54.004700
21
160.631000
0
LINE
8
EuroPanel
10
54.004700
20
160.631000
11
54.004700
21
160.631000
0
LINE
8
EuroPanel
10
54.004700
20
194.281000
11
56.304700
21
194.281000
0
LINE
8
EuroPanel
10
56.304700
20
194.281000
11
56.916993
21
194.159207
0
LINE
8
EuroPanel
10
56.916993
20
194.159207
11
57.436071
21
193.812371
0
LINE
8
EuroPanel
10
57.436071
20
193.812371
11
57.782907
21
193.293293
0
LINE
8
EuroPanel
10
57.782907
20
193.293293
11
57.904700
21
192.681000
0
LINE
8
EuroPanel
10
57.904700
20
192.681000
11
57.904700
21
192.681000
0
LINE
8
EuroPanel
10
57.904700
20
192.681000
11
57.782907
21
192.068707
0
LINE
8
EuroPanel
10
57.782907
20
192.068707
11
57.436071
21
191.549629
0
LINE
8
EuroPanel
10
57.436071
20
191.549629
11
56.916993
21
191.202793
0
LINE
8
EuroPanel
10
56.916993
20
191.202793
11
56.304700
21
191.081000
0
LINE
8
EuroPanel
10
56.304700
20
191.081000
11
54.004700
21
191.081000
0
LINE
8
EuroPanel
10
54.004700
20
191.081000
11
53.392407
21
191.202793
0
LINE
8
EuroPanel
10
53.392407
20
191.202793
11
52.873329
21
191.549629
0
LINE
8
EuroPanel
10
52.873329
20
191.549629
11
52.526493
21
192.068707
0
LINE
8
EuroPanel
10
52.526493
20
192.068707
11
52.404700
21
192.681000
0
LINE
8
EuroPanel
10
52.404700
20
192.681000
11
52.404700
21
192.681000
0
LINE
8
EuroPanel
10
52.404700
20
192.681000
11
52.526493
21
193.293293
0
LINE
8
EuroPanel
10
52.526493
20
193.293293
11
52.873329
21
193.812371
0
LINE
8
EuroPanel
10
52.873329
20
193.812371
11
53.392407
21
194.159207
0
LINE
8
EuroPanel
10
53.392407
20
194.159207
11
54.004700
21
194.281000
0
LINE
8
EuroPanel
10
54.004700
20
194.281000
11
54.004700
21
194.281000
0
LINE
8
EuroPanel
10
120.044700
20
160.631000
11
122.344700
21
160.631000
0
LINE
8
EuroPanel
10
122.344700
20
160.631000
11
122.956993
21
160.509207
0
LINE
8
EuroPanel
10
122.956993
20
160.509207
11
123.476071
21
160.162371
0
LINE
8
EuroPanel
10
123.476071
20
160.162371
11
123.822907
21
159.643293
0
LINE
8
EuroPanel
10
123.822907
20
159.643293
11
123.944700
21
159.031000
0
LINE
8
EuroPanel
10
123.944700
20
159.031000
11
123.944700
21
159.031000
0
LINE
8
EuroPanel
10
123.944700
20
159.031000
11
123.822907
21
158.418707
0
LINE
8
EuroPanel
10
123.822907
20
158.418707
11
123.476071
21
157.899629
0
LINE
8
EuroPanel
10
123.476071
20
157.899629
11
122.956993
21
157.552793
0
LINE
8
EuroPanel
10
122.956993
20
157.552793
11
122.344700
21
157.431000
0
LINE
8
EuroPanel
10
122.344700
20
157.431000
11
120.044700
21
157.431000
0
LINE
8
EuroPanel
10
120.044700
20
157.431000
11
119.432407
21
157.552793
0
LINE
8
EuroPanel
10
119.432407
20
157.552793
11
118.913329
21
157.899629
0
LINE
8
EuroPanel
10
118.913329
20
157.899629
11
118.566493
21
158.418707
0
LINE
8
EuroPanel
10
118.566493
20
158.418707
11
118.444700
21
159.031000
0
LINE
8
EuroPanel
10
118.444700
20
159.031000
11
118.444700
21
159.031000
0
LINE
8
EuroPanel
10
118.444700
20
159.031000
11
118.566493
21
159.643293
0
LINE
8
EuroPanel
10
118.566493
20
159.643293
11
118.913329
21
160.162371
0
LINE
8
EuroPanel
10
118.913329
20
160.162371
11
119.432407
21
160.509207
0
LINE
8
EuroPanel
10
119.432407
20
160.509207
11
120.044700
21
160.631000
0
LINE
8
EuroPanel
10
120.044700
20
160.631000
11
120.044700
21
160.631000
0
LINE
8
EuroPanel
10
120.044700
20
194.281000
11
122.344700
21
194.281000
0
LINE
8
EuroPanel
10
122.344700
20
194.281000
11
122.956993
21
194.159207
0
LINE
8
EuroPanel
10
122.956993
20
194.159207
11
123.476071
21
193.812371
0
LINE
8
EuroPanel
10
123.476071
20
193.812371
11
123.822907
21
193.293293
0
LINE
8
EuroPanel
10
123.822907
20
193.293293
11
123.944700
21
192.681000
0
LINE
8
EuroPanel
10
123.944700
20
192.681000
11
123.944700
21
192.681000
0
LINE
8
EuroPanel
10
123.944700
20
192.681000
11
123.822907
21
192.068707
0
LINE
8
EuroPanel
10
123.822907
20
192.068707
11
123.476071
21
191.549629
0
LINE
8
EuroPanel
10
123.476071
20
191.549629
11
122.956993
21
191.202793
0
LINE
8
EuroPanel
10
122.956993
20
191.202793
11
122.344700
21
191.081000
0
LINE
8
EuroPanel
10
122.344700
20
191.081000
11
120.044700
21
191.081000
0
LINE
8
EuroPanel
10
120.044700
20
191.081000
11
119.432407
21
191.202793
0
LINE
8
EuroPanel
10
119.432407
20
191.202793
11
118.913329
21
191.549629
0
LINE
8
EuroPanel
10
118.913329
20
191.549629
11
118.566493
21
192.068707
0
LINE
8
EuroPanel
10
118.566493
20
192.068707
11
118.444700
21
192.681000
0
LINE
8
EuroPanel
10
118.444700
20
192.681000
11
118.444700
21
192.681000
0
LINE
8
EuroPanel
10
118.444700
20
192.681000
11
118.566493
21
193.293293
0
LINE
8
EuroPanel
10
118.566493
20
193.293293
11
118.913329
21
193.812371
0
LINE
8
EuroPanel
10
118.913329
20
193.812371
11
119.432407
21
194.159207
0
LINE
8
EuroPanel
10
119.432407
20
194.159207
11
120.044700
21
194.281000
0
LINE
8
EuroPanel
10
120.044700
20
194.281000
11
120.044700
21
194.281000
 0 
ENDSEC
 0 
EOF