(footprint "Jack_3.5mm_QingPu_WQP-PJ398SM_Vertical"
	(version 20240108)
	(generator "pcbnew")
	(generator_version "8.0")
	(layer "F.Cu")
	(descr "T-S-SN Vertical mount jack AKA WQP-WQP518MA or Thonkiconn")
	(tags "WQP-WQP518MA, Thonkiconn")
	(property "Reference" "REF**"
		(at -2.5 -6.8 0)
		(layer "F.SilkS")
		(uuid "0a0104ad-8a10-4955-b4de-9e999b8baaa2")
		(effects
			(font
				(size 1 1)
				(thickness 0.15)
			)
		)
	)
	(property "Value" "PJ398SM"
		(at 0 -5 0)
		(layer "F.Fab")
		(uuid "5583915d-bfdc-4447-ac1b-bb2e11ac745a")
		(effects
			(font
				(size 1 1)
				(thickness 0.15)
			)
		)
	)
	(property "Footprint" ""
		(at 0 0 0)
		(unlocked yes)
		(layer "F.Fab")
		(hide yes)
		(uuid "a78aef50-b62c-4a33-a6e8-ec436bf25057")
		(effects
			(font
				(size 1.27 1.27)
			)
		)
	)
	(property "Datasheet" ""
		(at 0 0 0)
		(unlocked yes)
		(layer "F.Fab")
		(hide yes)
		(uuid "d18b876d-c05e-4fa3-8bc4-9c3533d70b18")
		(effects
			(font
				(size 1.27 1.27)
			)
		)
	)
	(property "Description" ""
		(at 0 0 0)
		(unlocked yes)
		(layer "F.Fab")
		(hide yes)
		(uuid "49ef1b1b-6ac4-4af1-a468-ddc1495459c7")
		(effects
			(font
				(size 1.27 1.27)
			)
		)
	)
	(attr through_hole)
	(fp_line
		(start -4.5 -6)
		(end -1.6 -6)
		(stroke
			(width 0.2)
			(type solid)
		)
		(layer "F.SilkS")
		(uuid "92a222eb-01dd-4f3f-84fb-d81652b74e38")
	)
	(fp_line
		(start -4.5 4.5)
		(end -4.5 -6)
		(stroke
			(width 0.2)
			(type solid)
		)
		(layer "F.SilkS")
		(uuid "f6f1e210-025a-4f52-8184-5850dea5f1d7")
	)
	(fp_line
		(start -4.5 4.5)
		(end -1.5 4.5)
		(stroke
			(width 0.2)
			(type solid)
		)
		(layer "F.SilkS")
		(uuid "b216477e-d466-47aa-927e-add9235fe7bd")
	)
	(fp_line
		(start 1.5 4.5)
		(end 4.5 4.5)
		(stroke
			(width 0.2)
			(type solid)
		)
		(layer "F.SilkS")
		(uuid "18d398a8-dd42-455d-9fc2-ab19cca55981")
	)
	(fp_line
		(start 1.6 -6)
		(end 4.5 -6)
		(stroke
			(width 0.2)
			(type solid)
		)
		(layer "F.SilkS")
		(uuid "9483000f-b71d-480b-881c-876aed554c41")
	)
	(fp_line
		(start 4.5 4.5)
		(end 4.5 -6)
		(stroke
			(width 0.2)
			(type solid)
		)
		(layer "F.SilkS")
		(uuid "389d6a35-b60a-4738-8703-2a1727dfd6da")
	)
	(fp_arc
		(start -1.35 2.549999)
		(mid -2.800225 -0.695509)
		(end 0 -2.885307)
		(stroke
			(width 0.12)
			(type solid)
		)
		(layer "F.SilkS")
		(uuid "94097523-3156-40a8-be2d-7061ace15d76")
	)
	(fp_arc
		(start 0 -2.885307)
		(mid 2.800226 -0.695509)
		(end 1.35 2.549999)
		(stroke
			(width 0.12)
			(type solid)
		)
		(layer "F.SilkS")
		(uuid "64e6b6eb-2ab1-4cc8-8ef0-09d4bcbea5dd")
	)
	(fp_circle
		(center 0 0)
		(end -1.8 0)
		(stroke
			(width 0.12)
			(type solid)
		)
		(fill none)
		(layer "F.SilkS")
		(uuid "793c77fc-1bca-4bca-a674-d594562d3450")
	)
	(fp_line
		(start -0.09 -1.48)
		(end -1.48 -0.09)
		(stroke
			(width 0.12)
			(type solid)
		)
		(layer "Dwgs.User")
		(uuid "696bfd96-a0de-42ff-aa01-cb54d6f4009d")
	)
	(fp_line
		(start 0.58 -1.35)
		(end -1.36 0.59)
		(stroke
			(width 0.12)
			(type solid)
		)
		(layer "Dwgs.User")
		(uuid "125884d4-0733-413f-9986-2c9b1552a7d4")
	)
	(fp_line
		(start 1.07 -1.01)
		(end -1.01 1.07)
		(stroke
			(width 0.12)
			(type solid)
		)
		(layer "Dwgs.User")
		(uuid "86e85bd3-4dd7-47e0-b21e-0aa2e5823c3b")
	)
	(fp_line
		(start 1.41 0.46)
		(end 0.46 1.41)
		(stroke
			(width 0.12)
			(type solid)
		)
		(layer "Dwgs.User")
		(uuid "5d543602-2620-4729-bb1f-ba8232605070")
	)
	(fp_line
		(start 1.42 -0.395)
		(end -0.4 1.42)
		(stroke
			(width 0.12)
			(type solid)
		)
		(layer "Dwgs.User")
		(uuid "075341a3-4ac4-49a6-99a1-c6cd15abf752")
	)
	(fp_circle
		(center 0 0)
		(end -1.5 0)
		(stroke
			(width 0.12)
			(type solid)
		)
		(fill none)
		(layer "Dwgs.User")
		(uuid "64a13172-3524-4273-8cf1-07cc9a3eb6d6")
	)
	(fp_line
		(start -5 -7.25)
		(end -5 7.58)
		(stroke
			(width 0.05)
			(type solid)
		)
		(layer "F.CrtYd")
		(uuid "cd8a4e37-d053-470d-8d71-46b5667c62e3")
	)
	(fp_line
		(start -5 -7.25)
		(end 5 -7.25)
		(stroke
			(width 0.05)
			(type solid)
		)
		(layer "F.CrtYd")
		(uuid "f92b1921-2898-4c58-9bea-e3c19cb6bc39")
	)
	(fp_line
		(start -5 7.58)
		(end 5 7.58)
		(stroke
			(width 0.05)
			(type solid)
		)
		(layer "F.CrtYd")
		(uuid "3e29dc0f-7e5a-4ffb-a4f7-0e350acaf4cb")
	)
	(fp_line
		(start 5 -7.25)
		(end 5 7.58)
		(stroke
			(width 0.05)
			(type solid)
		)
		(layer "F.CrtYd")
		(uuid "2d4c5432-ffe6-4e59-beeb-b543be0396aa")
	)
	(fp_line
		(start -4.5 -5.98)
		(end -4.5 4.42)
		(stroke
			(width 0.1)
			(type solid)
		)
		(layer "F.Fab")
		(uuid "f88bdc59-9e43-4132-8e37-d6f872323ae0")
	)
	(fp_line
		(start -4.5 -5.98)
		(end 4.5 -5.98)
		(stroke
			(width 0.1)
			(type solid)
		)
		(layer "F.Fab")
		(uuid "211c820b-5e64-4b5a-bf33-4e76333e34a4")
	)
	(fp_line
		(start -4.5 4.47)
		(end 4.5 4.47)
		(stroke
			(width 0.1)
			(type solid)
		)
		(layer "F.Fab")
		(uuid "205dee68-5085-41a1-8e9b-265b018d91a2")
	)
	(fp_line
		(start 0 0)
		(end 0 -2.03)
		(stroke
			(width 0.1)
			(type solid)
		)
		(layer "F.Fab")
		(uuid "555094a5-e1fa-487f-8eb6-70fa252579cd")
	)
	(fp_line
		(start 4.5 -5.98)
		(end 4.5 4.42)
		(stroke
			(width 0.1)
			(type solid)
		)
		(layer "F.Fab")
		(uuid "d9f07e63-10b3-45d6-9bb0-9c3b7923a25b")
	)
	(fp_circle
		(center 0 0.02)
		(end -1.8 0.02)
		(stroke
			(width 0.1)
			(type solid)
		)
		(fill none)
		(layer "F.Fab")
		(uuid "d4a0e73c-e33e-4364-802f-8e544204bb5b")
	)
	(fp_text user "KEEPOUT"
		(at 0 0 180)
		(layer "Cmts.User")
		(uuid "e14152e1-088a-4d2f-8891-f69c9409639e")
		(effects
			(font
				(size 0.4 0.4)
				(thickness 0.051)
			)
		)
	)
	(fp_text user "${REFERENCE}"
		(at 4.5 -9.5 0)
		(layer "F.Fab")
		(uuid "c0aea212-c712-4a8a-a2d1-01baf97ef40f")
		(effects
			(font
				(size 1 1)
				(thickness 0.15)
			)
		)
	)
	(pad "S" thru_hole oval
		(at 0 6.48)
		(size 3.1 2.3)
		(drill oval 1.6 0.6)
		(layers "*.Cu" "*.Mask")
		(remove_unused_layers no)
		(uuid "a981976a-2b0e-4aca-b811-324d98bd52ca")
	)
	(pad "T" thru_hole roundrect
		(at 0 -4.92)
		(size 2.6 2.6)
		(drill oval 1.6 0.6)
		(layers "*.Cu" "*.Mask")
		(remove_unused_layers no)
		(roundrect_rratio 0.25)
		(uuid "7640b3d3-d845-4eae-8bfa-92cd6cf977f2")
	)
	(pad "TN" thru_hole roundrect
		(at 0 3.38)
		(size 2.6 2.6)
		(drill oval 1.6 0.6)
		(layers "*.Cu" "*.Mask")
		(remove_unused_layers no)
		(roundrect_rratio 0.25)
		(uuid "c2c264cb-7066-461c-a48c-0cc4e0ea0c1d")
	)
	(model "${KIPRJMOD}/lib/AudioJacks/3d/WQP-PJ398SM.step"
		(offset
			(xyz 0 0 0)
		)
		(scale
			(xyz 1 1 1)
		)
		(rotate
			(xyz 0 0 0)
		)
	)
)