999
"DXF R12 Output" (www.mydxf.blogspot.com)
 0 
SECTION
 2 
HEADER
 9 
$ACADVER
 1 
AC1009
 9 
$EXTMIN
 10 
 0 
 20 
 0 
 9 
$EXTMAX
 10 
 8.5 
 20 
 11 
 0 
ENDSEC
 0 
SECTION
 2 
ENTITIES
0
LINE
8
EuroPanel
10
78.104700
20
195.681000
11
98.104700
21
195.681000
0
LINE
8
EuroPanel
10
98.104700
20
195.681000
11
98.104700
21
156.031000
0
LINE
8
EuroPanel
10
98.104700
20
156.031000
11
78.104700
21
156.031000
0
LINE
8
EuroPanel
10
78.104700
20
156.031000
11
78.104700
21
195.681000
0
LINE
8
EuroPanel
10
84.454700
20
160.631000
11
86.754700
21
160.631000
0
LINE
8
EuroPanel
10
86.754700
20
160.631000
11
87.366993
21
160.509207
0
LINE
8
EuroPanel
10
87.366993
20
160.509207
11
87.886071
21
160.162371
0
LINE
8
EuroPanel
10
87.886071
20
160.162371
11
88.232907
21
159.643293
0
LINE
8
EuroPanel
10
88.232907
20
159.643293
11
88.354700
21
159.031000
0
LINE
8
EuroPanel
10
88.354700
20
159.031000
11
88.354700
21
159.031000
0
LINE
8
EuroPanel
10
88.354700
20
159.031000
11
88.232907
21
158.418707
0
LINE
8
EuroPanel
10
88.232907
20
158.418707
11
87.886071
21
157.899629
0
LINE
8
EuroPanel
10
87.886071
20
157.899629
11
87.366993
21
157.552793
0
LINE
8
EuroPanel
10
87.366993
20
157.552793
11
86.754700
21
157.431000
0
LINE
8
EuroPanel
10
86.754700
20
157.431000
11
84.454700
21
157.431000
0
LINE
8
EuroPanel
10
84.454700
20
157.431000
11
83.842407
21
157.552793
0
LINE
8
EuroPanel
10
83.842407
20
157.552793
11
83.323329
21
157.899629
0
LINE
8
EuroPanel
10
83.323329
20
157.899629
11
82.976493
21
158.418707
0
LINE
8
EuroPanel
10
82.976493
20
158.418707
11
82.854700
21
159.031000
0
LINE
8
EuroPanel
10
82.854700
20
159.031000
11
82.854700
21
159.031000
0
LINE
8
EuroPanel
10
82.854700
20
159.031000
11
82.976493
21
159.643293
0
LINE
8
EuroPanel
10
82.976493
20
159.643293
11
83.323329
21
160.162371
0
LINE
8
EuroPanel
10
83.323329
20
160.162371
11
83.842407
21
160.509207
0
LINE
8
EuroPanel
10
83.842407
20
160.509207
11
84.454700
21
160.631000
0
LINE
8
EuroPanel
10
84.454700
20
160.631000
11
84.454700
21
160.631000
0
LINE
8
EuroPanel
10
84.454700
20
194.281000
11
86.754700
21
194.281000
0
LINE
8
EuroPanel
10
86.754700
20
194.281000
11
87.366993
21
194.159207
0
LINE
8
EuroPanel
10
87.366993
20
194.159207
11
87.886071
21
193.812371
0
LINE
8
EuroPanel
10
87.886071
20
193.812371
11
88.232907
21
193.293293
0
LINE
8
EuroPanel
10
88.232907
20
193.293293
11
88.354700
21
192.681000
0
LINE
8
EuroPanel
10
88.354700
20
192.681000
11
88.354700
21
192.681000
0
LINE
8
EuroPanel
10
88.354700
20
192.681000
11
88.232907
21
192.068707
0
LINE
8
EuroPanel
10
88.232907
20
192.068707
11
87.886071
21
191.549629
0
LINE
8
EuroPanel
10
87.886071
20
191.549629
11
87.366993
21
191.202793
0
LINE
8
EuroPanel
10
87.366993
20
191.202793
11
86.754700
21
191.081000
0
LINE
8
EuroPanel
10
86.754700
20
191.081000
11
84.454700
21
191.081000
0
LINE
8
EuroPanel
10
84.454700
20
191.081000
11
83.842407
21
191.202793
0
LINE
8
EuroPanel
10
83.842407
20
191.202793
11
83.323329
21
191.549629
0
LINE
8
EuroPanel
10
83.323329
20
191.549629
11
82.976493
21
192.068707
0
LINE
8
EuroPanel
10
82.976493
20
192.068707
11
82.854700
21
192.681000
0
LINE
8
EuroPanel
10
82.854700
20
192.681000
11
82.854700
21
192.681000
0
LINE
8
EuroPanel
10
82.854700
20
192.681000
11
82.976493
21
193.293293
0
LINE
8
EuroPanel
10
82.976493
20
193.293293
11
83.323329
21
193.812371
0
LINE
8
EuroPanel
10
83.323329
20
193.812371
11
83.842407
21
194.159207
0
LINE
8
EuroPanel
10
83.842407
20
194.159207
11
84.454700
21
194.281000
0
LINE
8
EuroPanel
10
84.454700
20
194.281000
11
84.454700
21
194.281000
 0 
ENDSEC
 0 
EOF