(footprint "Dailywell 2TES1M2RES"
	(version 20240108)
	(generator "pcbnew")
	(generator_version "8.0")
	(layer "F.Cu")
	(property "Reference" "REF**"
		(at 0 7 0)
		(unlocked yes)
		(layer "F.SilkS")
		(uuid "19656664-db05-4dca-820c-8781282db469")
		(effects
			(font
				(size 1 1)
				(thickness 0.1)
			)
		)
	)
	(property "Value" "Dailywell 2TES1M2RES"
		(at 0 8.5 0)
		(unlocked yes)
		(layer "F.Fab")
		(uuid "673f0b18-4f16-4de7-8327-903c2b519b3c")
		(effects
			(font
				(size 1 1)
				(thickness 0.15)
			)
		)
	)
	(property "Footprint" ""
		(at 0 7.5 0)
		(unlocked yes)
		(layer "F.Fab")
		(hide yes)
		(uuid "c62b5183-3cb4-4666-ae8f-efdbe3b499a3")
		(effects
			(font
				(size 1 1)
				(thickness 0.15)
			)
		)
	)
	(property "Datasheet" ""
		(at 0 7.5 0)
		(unlocked yes)
		(layer "F.Fab")
		(hide yes)
		(uuid "a933a2e6-f764-470a-84f7-4b8b031be92a")
		(effects
			(font
				(size 1 1)
				(thickness 0.15)
			)
		)
	)
	(property "Description" ""
		(at 0 7.5 0)
		(unlocked yes)
		(layer "F.Fab")
		(hide yes)
		(uuid "b87b8da7-52ce-4603-bf15-30117af760cd")
		(effects
			(font
				(size 1 1)
				(thickness 0.15)
			)
		)
	)
	(attr through_hole)
	(fp_rect
		(start -2.5 -4.55)
		(end 2.5 4.45)
		(stroke
			(width 0.1)
			(type default)
		)
		(fill none)
		(layer "F.SilkS")
		(uuid "f65f7d54-6504-45c8-9c20-63f3782adcd7")
	)
	(fp_rect
		(start -2.5 -4.55)
		(end 0 4.45)
		(stroke
			(width 0.05)
			(type default)
		)
		(fill none)
		(layer "B.CrtYd")
		(uuid "f6eae805-4d7e-4ca5-88be-bc4bc37d4cae")
	)
	(fp_rect
		(start -2.5 -4.55)
		(end 2.5 4.45)
		(stroke
			(width 0.05)
			(type default)
		)
		(fill none)
		(layer "F.CrtYd")
		(uuid "261f4bf5-bd53-481a-bedb-8b44362f8b54")
	)
	(fp_text user "${REFERENCE}"
		(at 0 10 0)
		(unlocked yes)
		(layer "F.Fab")
		(uuid "87e395d2-5a5b-4ca8-9e58-ce0d67a77094")
		(effects
			(font
				(size 1 1)
				(thickness 0.15)
			)
		)
	)
	(pad "1" thru_hole rect
		(at -1.27 -2.54)
		(size 2 2)
		(drill 1)
		(layers "*.Cu" "*.Mask")
		(remove_unused_layers no)
		(uuid "6137210c-d397-4bb9-8ddb-d2416e2a7613")
	)
	(pad "2" thru_hole circle
		(at -1.27 0)
		(size 2 2)
		(drill 1)
		(layers "*.Cu" "*.Mask")
		(remove_unused_layers no)
		(uuid "f251d15d-39bc-4840-82a7-9d50ebdf96e5")
	)
	(pad "3" thru_hole circle
		(at -1.27 2.54)
		(size 2 2)
		(drill 1)
		(layers "*.Cu" "*.Mask")
		(remove_unused_layers no)
		(uuid "c6279318-f06b-4d18-89d5-66d68d853262")
	)
	(model "${KIPRJMOD}/lib/Switches/3d/toggle_switch_2tes1m2res.stp"
		(offset
			(xyz 0 0 8)
		)
		(scale
			(xyz 1 1 1)
		)
		(rotate
			(xyz -90 0 -90)
		)
	)
)