(kicad_sch
	(version 20231120)
	(generator "eeschema")
	(generator_version "8.0")
	(uuid "56a734b2-ee54-4c43-987e-7a0268cf7282")
	(paper "A4")
	(lib_symbols
		(symbol "Amplifier_Operational:TL074"
			(pin_names
				(offset 0.127)
			)
			(exclude_from_sim no)
			(in_bom yes)
			(on_board yes)
			(property "Reference" "U"
				(at 0 5.08 0)
				(effects
					(font
						(size 1.27 1.27)
					)
					(justify left)
				)
			)
			(property "Value" "TL074"
				(at 0 -5.08 0)
				(effects
					(font
						(size 1.27 1.27)
					)
					(justify left)
				)
			)
			(property "Footprint" ""
				(at -1.27 2.54 0)
				(effects
					(font
						(size 1.27 1.27)
					)
					(hide yes)
				)
			)
			(property "Datasheet" "http://www.ti.com/lit/ds/symlink/tl071.pdf"
				(at 1.27 5.08 0)
				(effects
					(font
						(size 1.27 1.27)
					)
					(hide yes)
				)
			)
			(property "Description" "Quad Low-Noise JFET-Input Operational Amplifiers, DIP-14/SOIC-14"
				(at 0 0 0)
				(effects
					(font
						(size 1.27 1.27)
					)
					(hide yes)
				)
			)
			(property "ki_locked" ""
				(at 0 0 0)
				(effects
					(font
						(size 1.27 1.27)
					)
				)
			)
			(property "ki_keywords" "quad opamp"
				(at 0 0 0)
				(effects
					(font
						(size 1.27 1.27)
					)
					(hide yes)
				)
			)
			(property "ki_fp_filters" "SOIC*3.9x8.7mm*P1.27mm* DIP*W7.62mm* TSSOP*4.4x5mm*P0.65mm* SSOP*5.3x6.2mm*P0.65mm* MSOP*3x3mm*P0.5mm*"
				(at 0 0 0)
				(effects
					(font
						(size 1.27 1.27)
					)
					(hide yes)
				)
			)
			(symbol "TL074_1_1"
				(polyline
					(pts
						(xy -5.08 5.08) (xy 5.08 0) (xy -5.08 -5.08) (xy -5.08 5.08)
					)
					(stroke
						(width 0.254)
						(type default)
					)
					(fill
						(type background)
					)
				)
				(pin output line
					(at 7.62 0 180)
					(length 2.54)
					(name "~"
						(effects
							(font
								(size 1.27 1.27)
							)
						)
					)
					(number "1"
						(effects
							(font
								(size 1.27 1.27)
							)
						)
					)
				)
				(pin input line
					(at -7.62 -2.54 0)
					(length 2.54)
					(name "-"
						(effects
							(font
								(size 1.27 1.27)
							)
						)
					)
					(number "2"
						(effects
							(font
								(size 1.27 1.27)
							)
						)
					)
				)
				(pin input line
					(at -7.62 2.54 0)
					(length 2.54)
					(name "+"
						(effects
							(font
								(size 1.27 1.27)
							)
						)
					)
					(number "3"
						(effects
							(font
								(size 1.27 1.27)
							)
						)
					)
				)
			)
			(symbol "TL074_2_1"
				(polyline
					(pts
						(xy -5.08 5.08) (xy 5.08 0) (xy -5.08 -5.08) (xy -5.08 5.08)
					)
					(stroke
						(width 0.254)
						(type default)
					)
					(fill
						(type background)
					)
				)
				(pin input line
					(at -7.62 2.54 0)
					(length 2.54)
					(name "+"
						(effects
							(font
								(size 1.27 1.27)
							)
						)
					)
					(number "5"
						(effects
							(font
								(size 1.27 1.27)
							)
						)
					)
				)
				(pin input line
					(at -7.62 -2.54 0)
					(length 2.54)
					(name "-"
						(effects
							(font
								(size 1.27 1.27)
							)
						)
					)
					(number "6"
						(effects
							(font
								(size 1.27 1.27)
							)
						)
					)
				)
				(pin output line
					(at 7.62 0 180)
					(length 2.54)
					(name "~"
						(effects
							(font
								(size 1.27 1.27)
							)
						)
					)
					(number "7"
						(effects
							(font
								(size 1.27 1.27)
							)
						)
					)
				)
			)
			(symbol "TL074_3_1"
				(polyline
					(pts
						(xy -5.08 5.08) (xy 5.08 0) (xy -5.08 -5.08) (xy -5.08 5.08)
					)
					(stroke
						(width 0.254)
						(type default)
					)
					(fill
						(type background)
					)
				)
				(pin input line
					(at -7.62 2.54 0)
					(length 2.54)
					(name "+"
						(effects
							(font
								(size 1.27 1.27)
							)
						)
					)
					(number "10"
						(effects
							(font
								(size 1.27 1.27)
							)
						)
					)
				)
				(pin output line
					(at 7.62 0 180)
					(length 2.54)
					(name "~"
						(effects
							(font
								(size 1.27 1.27)
							)
						)
					)
					(number "8"
						(effects
							(font
								(size 1.27 1.27)
							)
						)
					)
				)
				(pin input line
					(at -7.62 -2.54 0)
					(length 2.54)
					(name "-"
						(effects
							(font
								(size 1.27 1.27)
							)
						)
					)
					(number "9"
						(effects
							(font
								(size 1.27 1.27)
							)
						)
					)
				)
			)
			(symbol "TL074_4_1"
				(polyline
					(pts
						(xy -5.08 5.08) (xy 5.08 0) (xy -5.08 -5.08) (xy -5.08 5.08)
					)
					(stroke
						(width 0.254)
						(type default)
					)
					(fill
						(type background)
					)
				)
				(pin input line
					(at -7.62 2.54 0)
					(length 2.54)
					(name "+"
						(effects
							(font
								(size 1.27 1.27)
							)
						)
					)
					(number "12"
						(effects
							(font
								(size 1.27 1.27)
							)
						)
					)
				)
				(pin input line
					(at -7.62 -2.54 0)
					(length 2.54)
					(name "-"
						(effects
							(font
								(size 1.27 1.27)
							)
						)
					)
					(number "13"
						(effects
							(font
								(size 1.27 1.27)
							)
						)
					)
				)
				(pin output line
					(at 7.62 0 180)
					(length 2.54)
					(name "~"
						(effects
							(font
								(size 1.27 1.27)
							)
						)
					)
					(number "14"
						(effects
							(font
								(size 1.27 1.27)
							)
						)
					)
				)
			)
			(symbol "TL074_5_1"
				(pin power_in line
					(at -2.54 -7.62 90)
					(length 3.81)
					(name "V-"
						(effects
							(font
								(size 1.27 1.27)
							)
						)
					)
					(number "11"
						(effects
							(font
								(size 1.27 1.27)
							)
						)
					)
				)
				(pin power_in line
					(at -2.54 7.62 270)
					(length 3.81)
					(name "V+"
						(effects
							(font
								(size 1.27 1.27)
							)
						)
					)
					(number "4"
						(effects
							(font
								(size 1.27 1.27)
							)
						)
					)
				)
			)
		)
		(symbol "Device:C"
			(pin_numbers hide)
			(pin_names
				(offset 0.254)
			)
			(exclude_from_sim no)
			(in_bom yes)
			(on_board yes)
			(property "Reference" "C"
				(at 0.635 2.54 0)
				(effects
					(font
						(size 1.27 1.27)
					)
					(justify left)
				)
			)
			(property "Value" "C"
				(at 0.635 -2.54 0)
				(effects
					(font
						(size 1.27 1.27)
					)
					(justify left)
				)
			)
			(property "Footprint" ""
				(at 0.9652 -3.81 0)
				(effects
					(font
						(size 1.27 1.27)
					)
					(hide yes)
				)
			)
			(property "Datasheet" "~"
				(at 0 0 0)
				(effects
					(font
						(size 1.27 1.27)
					)
					(hide yes)
				)
			)
			(property "Description" "Unpolarized capacitor"
				(at 0 0 0)
				(effects
					(font
						(size 1.27 1.27)
					)
					(hide yes)
				)
			)
			(property "ki_keywords" "cap capacitor"
				(at 0 0 0)
				(effects
					(font
						(size 1.27 1.27)
					)
					(hide yes)
				)
			)
			(property "ki_fp_filters" "C_*"
				(at 0 0 0)
				(effects
					(font
						(size 1.27 1.27)
					)
					(hide yes)
				)
			)
			(symbol "C_0_1"
				(polyline
					(pts
						(xy -2.032 -0.762) (xy 2.032 -0.762)
					)
					(stroke
						(width 0.508)
						(type default)
					)
					(fill
						(type none)
					)
				)
				(polyline
					(pts
						(xy -2.032 0.762) (xy 2.032 0.762)
					)
					(stroke
						(width 0.508)
						(type default)
					)
					(fill
						(type none)
					)
				)
			)
			(symbol "C_1_1"
				(pin passive line
					(at 0 3.81 270)
					(length 2.794)
					(name "~"
						(effects
							(font
								(size 1.27 1.27)
							)
						)
					)
					(number "1"
						(effects
							(font
								(size 1.27 1.27)
							)
						)
					)
				)
				(pin passive line
					(at 0 -3.81 90)
					(length 2.794)
					(name "~"
						(effects
							(font
								(size 1.27 1.27)
							)
						)
					)
					(number "2"
						(effects
							(font
								(size 1.27 1.27)
							)
						)
					)
				)
			)
		)
		(symbol "Device:R"
			(pin_numbers hide)
			(pin_names
				(offset 0)
			)
			(exclude_from_sim no)
			(in_bom yes)
			(on_board yes)
			(property "Reference" "R"
				(at 2.032 0 90)
				(effects
					(font
						(size 1.27 1.27)
					)
				)
			)
			(property "Value" "R"
				(at 0 0 90)
				(effects
					(font
						(size 1.27 1.27)
					)
				)
			)
			(property "Footprint" ""
				(at -1.778 0 90)
				(effects
					(font
						(size 1.27 1.27)
					)
					(hide yes)
				)
			)
			(property "Datasheet" "~"
				(at 0 0 0)
				(effects
					(font
						(size 1.27 1.27)
					)
					(hide yes)
				)
			)
			(property "Description" "Resistor"
				(at 0 0 0)
				(effects
					(font
						(size 1.27 1.27)
					)
					(hide yes)
				)
			)
			(property "ki_keywords" "R res resistor"
				(at 0 0 0)
				(effects
					(font
						(size 1.27 1.27)
					)
					(hide yes)
				)
			)
			(property "ki_fp_filters" "R_*"
				(at 0 0 0)
				(effects
					(font
						(size 1.27 1.27)
					)
					(hide yes)
				)
			)
			(symbol "R_0_1"
				(rectangle
					(start -1.016 -2.54)
					(end 1.016 2.54)
					(stroke
						(width 0.254)
						(type default)
					)
					(fill
						(type none)
					)
				)
			)
			(symbol "R_1_1"
				(pin passive line
					(at 0 3.81 270)
					(length 1.27)
					(name "~"
						(effects
							(font
								(size 1.27 1.27)
							)
						)
					)
					(number "1"
						(effects
							(font
								(size 1.27 1.27)
							)
						)
					)
				)
				(pin passive line
					(at 0 -3.81 90)
					(length 1.27)
					(name "~"
						(effects
							(font
								(size 1.27 1.27)
							)
						)
					)
					(number "2"
						(effects
							(font
								(size 1.27 1.27)
							)
						)
					)
				)
			)
		)
		(symbol "GND_2"
			(power)
			(pin_numbers hide)
			(pin_names
				(offset 0) hide)
			(exclude_from_sim no)
			(in_bom yes)
			(on_board yes)
			(property "Reference" "#PWR"
				(at 0 -6.35 0)
				(effects
					(font
						(size 1.27 1.27)
					)
					(hide yes)
				)
			)
			(property "Value" "GND"
				(at 0 -3.81 0)
				(effects
					(font
						(size 1.27 1.27)
					)
				)
			)
			(property "Footprint" ""
				(at 0 0 0)
				(effects
					(font
						(size 1.27 1.27)
					)
					(hide yes)
				)
			)
			(property "Datasheet" ""
				(at 0 0 0)
				(effects
					(font
						(size 1.27 1.27)
					)
					(hide yes)
				)
			)
			(property "Description" "Power symbol creates a global label with name \"GND\" , ground"
				(at 0 0 0)
				(effects
					(font
						(size 1.27 1.27)
					)
					(hide yes)
				)
			)
			(property "ki_keywords" "global power"
				(at 0 0 0)
				(effects
					(font
						(size 1.27 1.27)
					)
					(hide yes)
				)
			)
			(symbol "GND_2_0_1"
				(polyline
					(pts
						(xy 0 0) (xy 0 -1.27) (xy 1.27 -1.27) (xy 0 -2.54) (xy -1.27 -1.27) (xy 0 -1.27)
					)
					(stroke
						(width 0)
						(type default)
					)
					(fill
						(type none)
					)
				)
			)
			(symbol "GND_2_1_1"
				(pin power_in line
					(at 0 0 270)
					(length 0)
					(name "~"
						(effects
							(font
								(size 1.27 1.27)
							)
						)
					)
					(number "1"
						(effects
							(font
								(size 1.27 1.27)
							)
						)
					)
				)
			)
		)
		(symbol "GND_5"
			(power)
			(pin_numbers hide)
			(pin_names
				(offset 0) hide)
			(exclude_from_sim no)
			(in_bom yes)
			(on_board yes)
			(property "Reference" "#PWR"
				(at 0 -6.35 0)
				(effects
					(font
						(size 1.27 1.27)
					)
					(hide yes)
				)
			)
			(property "Value" "GND"
				(at 0 -3.81 0)
				(effects
					(font
						(size 1.27 1.27)
					)
				)
			)
			(property "Footprint" ""
				(at 0 0 0)
				(effects
					(font
						(size 1.27 1.27)
					)
					(hide yes)
				)
			)
			(property "Datasheet" ""
				(at 0 0 0)
				(effects
					(font
						(size 1.27 1.27)
					)
					(hide yes)
				)
			)
			(property "Description" "Power symbol creates a global label with name \"GND\" , ground"
				(at 0 0 0)
				(effects
					(font
						(size 1.27 1.27)
					)
					(hide yes)
				)
			)
			(property "ki_keywords" "global power"
				(at 0 0 0)
				(effects
					(font
						(size 1.27 1.27)
					)
					(hide yes)
				)
			)
			(symbol "GND_5_0_1"
				(polyline
					(pts
						(xy 0 0) (xy 0 -1.27) (xy 1.27 -1.27) (xy 0 -2.54) (xy -1.27 -1.27) (xy 0 -1.27)
					)
					(stroke
						(width 0)
						(type default)
					)
					(fill
						(type none)
					)
				)
			)
			(symbol "GND_5_1_1"
				(pin power_in line
					(at 0 0 270)
					(length 0)
					(name "~"
						(effects
							(font
								(size 1.27 1.27)
							)
						)
					)
					(number "1"
						(effects
							(font
								(size 1.27 1.27)
							)
						)
					)
				)
			)
		)
		(symbol "GND_7"
			(power)
			(pin_numbers hide)
			(pin_names
				(offset 0) hide)
			(exclude_from_sim no)
			(in_bom yes)
			(on_board yes)
			(property "Reference" "#PWR"
				(at 0 -6.35 0)
				(effects
					(font
						(size 1.27 1.27)
					)
					(hide yes)
				)
			)
			(property "Value" "GND"
				(at 0 -3.81 0)
				(effects
					(font
						(size 1.27 1.27)
					)
				)
			)
			(property "Footprint" ""
				(at 0 0 0)
				(effects
					(font
						(size 1.27 1.27)
					)
					(hide yes)
				)
			)
			(property "Datasheet" ""
				(at 0 0 0)
				(effects
					(font
						(size 1.27 1.27)
					)
					(hide yes)
				)
			)
			(property "Description" "Power symbol creates a global label with name \"GND\" , ground"
				(at 0 0 0)
				(effects
					(font
						(size 1.27 1.27)
					)
					(hide yes)
				)
			)
			(property "ki_keywords" "global power"
				(at 0 0 0)
				(effects
					(font
						(size 1.27 1.27)
					)
					(hide yes)
				)
			)
			(symbol "GND_7_0_1"
				(polyline
					(pts
						(xy 0 0) (xy 0 -1.27) (xy 1.27 -1.27) (xy 0 -2.54) (xy -1.27 -1.27) (xy 0 -1.27)
					)
					(stroke
						(width 0)
						(type default)
					)
					(fill
						(type none)
					)
				)
			)
			(symbol "GND_7_1_1"
				(pin power_in line
					(at 0 0 270)
					(length 0)
					(name "~"
						(effects
							(font
								(size 1.27 1.27)
							)
						)
					)
					(number "1"
						(effects
							(font
								(size 1.27 1.27)
							)
						)
					)
				)
			)
		)
		(symbol "GND_8"
			(power)
			(pin_numbers hide)
			(pin_names
				(offset 0) hide)
			(exclude_from_sim no)
			(in_bom yes)
			(on_board yes)
			(property "Reference" "#PWR"
				(at 0 -6.35 0)
				(effects
					(font
						(size 1.27 1.27)
					)
					(hide yes)
				)
			)
			(property "Value" "GND"
				(at 0 -3.81 0)
				(effects
					(font
						(size 1.27 1.27)
					)
				)
			)
			(property "Footprint" ""
				(at 0 0 0)
				(effects
					(font
						(size 1.27 1.27)
					)
					(hide yes)
				)
			)
			(property "Datasheet" ""
				(at 0 0 0)
				(effects
					(font
						(size 1.27 1.27)
					)
					(hide yes)
				)
			)
			(property "Description" "Power symbol creates a global label with name \"GND\" , ground"
				(at 0 0 0)
				(effects
					(font
						(size 1.27 1.27)
					)
					(hide yes)
				)
			)
			(property "ki_keywords" "global power"
				(at 0 0 0)
				(effects
					(font
						(size 1.27 1.27)
					)
					(hide yes)
				)
			)
			(symbol "GND_8_0_1"
				(polyline
					(pts
						(xy 0 0) (xy 0 -1.27) (xy 1.27 -1.27) (xy 0 -2.54) (xy -1.27 -1.27) (xy 0 -1.27)
					)
					(stroke
						(width 0)
						(type default)
					)
					(fill
						(type none)
					)
				)
			)
			(symbol "GND_8_1_1"
				(pin power_in line
					(at 0 0 270)
					(length 0)
					(name "~"
						(effects
							(font
								(size 1.27 1.27)
							)
						)
					)
					(number "1"
						(effects
							(font
								(size 1.27 1.27)
							)
						)
					)
				)
			)
		)
		(symbol "Switch:SW_SPDT"
			(pin_names
				(offset 0) hide)
			(exclude_from_sim no)
			(in_bom yes)
			(on_board yes)
			(property "Reference" "SW"
				(at 0 5.08 0)
				(effects
					(font
						(size 1.27 1.27)
					)
				)
			)
			(property "Value" "SW_SPDT"
				(at 0 -5.08 0)
				(effects
					(font
						(size 1.27 1.27)
					)
				)
			)
			(property "Footprint" ""
				(at 0 0 0)
				(effects
					(font
						(size 1.27 1.27)
					)
					(hide yes)
				)
			)
			(property "Datasheet" "~"
				(at 0 -7.62 0)
				(effects
					(font
						(size 1.27 1.27)
					)
					(hide yes)
				)
			)
			(property "Description" "Switch, single pole double throw"
				(at 0 0 0)
				(effects
					(font
						(size 1.27 1.27)
					)
					(hide yes)
				)
			)
			(property "ki_keywords" "switch single-pole double-throw spdt ON-ON"
				(at 0 0 0)
				(effects
					(font
						(size 1.27 1.27)
					)
					(hide yes)
				)
			)
			(symbol "SW_SPDT_0_1"
				(circle
					(center -2.032 0)
					(radius 0.4572)
					(stroke
						(width 0)
						(type default)
					)
					(fill
						(type none)
					)
				)
				(polyline
					(pts
						(xy -1.651 0.254) (xy 1.651 2.286)
					)
					(stroke
						(width 0)
						(type default)
					)
					(fill
						(type none)
					)
				)
				(circle
					(center 2.032 -2.54)
					(radius 0.4572)
					(stroke
						(width 0)
						(type default)
					)
					(fill
						(type none)
					)
				)
				(circle
					(center 2.032 2.54)
					(radius 0.4572)
					(stroke
						(width 0)
						(type default)
					)
					(fill
						(type none)
					)
				)
			)
			(symbol "SW_SPDT_1_1"
				(rectangle
					(start -3.175 3.81)
					(end 3.175 -3.81)
					(stroke
						(width 0)
						(type default)
					)
					(fill
						(type background)
					)
				)
				(pin passive line
					(at 5.08 2.54 180)
					(length 2.54)
					(name "A"
						(effects
							(font
								(size 1.27 1.27)
							)
						)
					)
					(number "1"
						(effects
							(font
								(size 1.27 1.27)
							)
						)
					)
				)
				(pin passive line
					(at -5.08 0 0)
					(length 2.54)
					(name "B"
						(effects
							(font
								(size 1.27 1.27)
							)
						)
					)
					(number "2"
						(effects
							(font
								(size 1.27 1.27)
							)
						)
					)
				)
				(pin passive line
					(at 5.08 -2.54 180)
					(length 2.54)
					(name "C"
						(effects
							(font
								(size 1.27 1.27)
							)
						)
					)
					(number "3"
						(effects
							(font
								(size 1.27 1.27)
							)
						)
					)
				)
			)
		)
	)
	(junction
		(at 109.22 114.3)
		(diameter 0)
		(color 0 0 0 0)
		(uuid "0e598d48-05af-4714-b6b3-3fd7a917928f")
	)
	(junction
		(at 50.8 78.74)
		(diameter 0)
		(color 0 0 0 0)
		(uuid "11d2f7da-893c-4b36-9226-6cb829be6bdf")
	)
	(junction
		(at 80.01 67.31)
		(diameter 0)
		(color 0 0 0 0)
		(uuid "2c9ac0ba-35f1-416a-81b1-4a85dd04974b")
	)
	(junction
		(at 87.63 114.3)
		(diameter 0)
		(color 0 0 0 0)
		(uuid "2d265a6c-037b-4520-9a46-3493b217acc9")
	)
	(junction
		(at 109.22 81.28)
		(diameter 0)
		(color 0 0 0 0)
		(uuid "4f4db346-9cfb-4ba6-8566-a0cc5ffaee3a")
	)
	(junction
		(at 80.01 81.28)
		(diameter 0)
		(color 0 0 0 0)
		(uuid "a43f3bb8-fdab-457b-afb5-22445edc0a97")
	)
	(junction
		(at 80.01 52.07)
		(diameter 0)
		(color 0 0 0 0)
		(uuid "af781964-c1d5-424d-8c8a-a115da30976a")
	)
	(junction
		(at 57.15 67.31)
		(diameter 0)
		(color 0 0 0 0)
		(uuid "afbc3423-cf49-479d-b1f6-c0bcbd275f5c")
	)
	(junction
		(at 129.54 116.84)
		(diameter 0)
		(color 0 0 0 0)
		(uuid "b81eb90c-8f77-4459-a158-a74015d3528c")
	)
	(junction
		(at 129.54 83.82)
		(diameter 0)
		(color 0 0 0 0)
		(uuid "cbefc063-4aee-48bc-9c80-b4d05bb70713")
	)
	(junction
		(at 109.22 148.59)
		(diameter 0)
		(color 0 0 0 0)
		(uuid "cda9bf8e-4cb4-4a22-bc4e-c5006bf8d73e")
	)
	(junction
		(at 87.63 81.28)
		(diameter 0)
		(color 0 0 0 0)
		(uuid "cf5013c2-23b6-482a-b765-eff5d50c402f")
	)
	(junction
		(at 129.54 151.13)
		(diameter 0)
		(color 0 0 0 0)
		(uuid "e8250022-34c6-4501-8616-ab46fbf5afb3")
	)
	(junction
		(at 57.15 78.74)
		(diameter 0)
		(color 0 0 0 0)
		(uuid "ece377b2-e5a2-4179-8b75-e412e7ca8faa")
	)
	(junction
		(at 57.15 52.07)
		(diameter 0)
		(color 0 0 0 0)
		(uuid "ee0c83c0-e012-4cf6-beb6-63b587d4f794")
	)
	(no_connect
		(at 73.66 40.64)
		(uuid "7ede2308-fd26-4849-bea8-09fa98c5cbe2")
	)
	(wire
		(pts
			(xy 30.48 113.03) (xy 35.56 113.03)
		)
		(stroke
			(width 0)
			(type default)
		)
		(uuid "0682c45d-f963-4d98-9426-331cb3c09345")
	)
	(wire
		(pts
			(xy 80.01 52.07) (xy 80.01 35.56)
		)
		(stroke
			(width 0)
			(type default)
		)
		(uuid "0ab9ceb8-8265-4fd5-bfc9-0b2389c75edb")
	)
	(wire
		(pts
			(xy 57.15 83.82) (xy 57.15 90.17)
		)
		(stroke
			(width 0)
			(type default)
		)
		(uuid "0f6e992f-48c8-4214-b041-5cc59c0ead24")
	)
	(wire
		(pts
			(xy 127 151.13) (xy 129.54 151.13)
		)
		(stroke
			(width 0)
			(type default)
		)
		(uuid "0fd0aad2-4576-41be-b5ee-bf2b5ccc1d48")
	)
	(wire
		(pts
			(xy 87.63 148.59) (xy 93.98 148.59)
		)
		(stroke
			(width 0)
			(type default)
		)
		(uuid "12f75776-8965-4c37-8ff6-9fda461a63ba")
	)
	(wire
		(pts
			(xy 43.18 78.74) (xy 50.8 78.74)
		)
		(stroke
			(width 0)
			(type default)
		)
		(uuid "13dab10b-b5f2-4ffe-a5f9-c7f281e4f9a6")
	)
	(wire
		(pts
			(xy 127 116.84) (xy 129.54 116.84)
		)
		(stroke
			(width 0)
			(type default)
		)
		(uuid "19c7fae3-4131-408c-9d2b-d407b7693e3d")
	)
	(wire
		(pts
			(xy 101.6 114.3) (xy 109.22 114.3)
		)
		(stroke
			(width 0)
			(type default)
		)
		(uuid "1d23f27e-0811-4b9b-b114-908c69bf1b95")
	)
	(wire
		(pts
			(xy 57.15 52.07) (xy 64.77 52.07)
		)
		(stroke
			(width 0)
			(type default)
		)
		(uuid "1e9adf73-be1d-4ac9-91bd-6ffcdfec7441")
	)
	(wire
		(pts
			(xy 129.54 107.95) (xy 123.19 107.95)
		)
		(stroke
			(width 0)
			(type default)
		)
		(uuid "22049373-a525-4c50-9ee9-66b324e18f8b")
	)
	(wire
		(pts
			(xy 43.18 113.03) (xy 50.8 113.03)
		)
		(stroke
			(width 0)
			(type default)
		)
		(uuid "22614c7d-7237-46a6-ba25-603759c7999d")
	)
	(wire
		(pts
			(xy 143.51 116.84) (xy 152.4 116.84)
		)
		(stroke
			(width 0)
			(type default)
		)
		(uuid "27416671-f907-4aa9-b83d-06a95567dc49")
	)
	(wire
		(pts
			(xy 198.12 53.34) (xy 198.12 58.42)
		)
		(stroke
			(width 0)
			(type default)
		)
		(uuid "2992317b-8854-4467-b1ba-c320ace85e0a")
	)
	(wire
		(pts
			(xy 142.24 151.13) (xy 152.4 151.13)
		)
		(stroke
			(width 0)
			(type default)
		)
		(uuid "30f60f50-a9dc-495e-a57a-7959026ac3a3")
	)
	(polyline
		(pts
			(xy 185.166 21.844) (xy 185.166 71.374)
		)
		(stroke
			(width 0)
			(type dash)
		)
		(uuid "320c2324-5a9a-4f81-a233-4cef4674ebf0")
	)
	(wire
		(pts
			(xy 80.01 67.31) (xy 80.01 81.28)
		)
		(stroke
			(width 0)
			(type default)
		)
		(uuid "3748ef1c-df04-48f2-b506-89242c9b00b2")
	)
	(wire
		(pts
			(xy 80.01 52.07) (xy 80.01 67.31)
		)
		(stroke
			(width 0)
			(type default)
		)
		(uuid "39883e51-981f-4f9f-8243-5b3462edd7da")
	)
	(wire
		(pts
			(xy 129.54 142.24) (xy 123.19 142.24)
		)
		(stroke
			(width 0)
			(type default)
		)
		(uuid "39de614a-a6cf-4d19-8f51-02d06433fe17")
	)
	(wire
		(pts
			(xy 80.01 35.56) (xy 73.66 35.56)
		)
		(stroke
			(width 0)
			(type default)
		)
		(uuid "3c4dc8d4-1790-4d0f-9ac4-f1f9cd6c4caa")
	)
	(wire
		(pts
			(xy 115.57 74.93) (xy 109.22 74.93)
		)
		(stroke
			(width 0)
			(type default)
		)
		(uuid "3d815213-36bb-4bdd-bc25-aaab02af941f")
	)
	(wire
		(pts
			(xy 87.63 114.3) (xy 87.63 148.59)
		)
		(stroke
			(width 0)
			(type default)
		)
		(uuid "4454c424-fab8-4106-8f50-57f5bd8be922")
	)
	(wire
		(pts
			(xy 109.22 148.59) (xy 111.76 148.59)
		)
		(stroke
			(width 0)
			(type default)
		)
		(uuid "45cc6e5d-bf5b-4949-a4b1-785d160b048f")
	)
	(wire
		(pts
			(xy 129.54 83.82) (xy 129.54 74.93)
		)
		(stroke
			(width 0)
			(type default)
		)
		(uuid "46e91797-50e7-4943-a8bc-12f9181963f5")
	)
	(wire
		(pts
			(xy 109.22 86.36) (xy 109.22 90.17)
		)
		(stroke
			(width 0)
			(type default)
		)
		(uuid "474a24b8-9c45-495d-822a-4cc8d32ecf77")
	)
	(wire
		(pts
			(xy 57.15 52.07) (xy 57.15 67.31)
		)
		(stroke
			(width 0)
			(type default)
		)
		(uuid "4c28a74f-0c3e-4737-b3e0-c888b7cf3817")
	)
	(wire
		(pts
			(xy 60.96 83.82) (xy 57.15 83.82)
		)
		(stroke
			(width 0)
			(type default)
		)
		(uuid "51865551-81be-44ea-8568-aff1af05e391")
	)
	(wire
		(pts
			(xy 129.54 116.84) (xy 129.54 107.95)
		)
		(stroke
			(width 0)
			(type default)
		)
		(uuid "549f33f6-eef6-4efd-beb9-ea9c38a3f7a6")
	)
	(polyline
		(pts
			(xy 185.166 21.844) (xy 219.456 21.844)
		)
		(stroke
			(width 0)
			(type dash)
		)
		(uuid "58e110b4-aa17-4f0e-8c55-b39f1aa9e6a5")
	)
	(wire
		(pts
			(xy 50.8 113.03) (xy 50.8 78.74)
		)
		(stroke
			(width 0)
			(type default)
		)
		(uuid "5b9ba295-7d38-4b33-a493-c4d54749e0a8")
	)
	(wire
		(pts
			(xy 109.22 74.93) (xy 109.22 81.28)
		)
		(stroke
			(width 0)
			(type default)
		)
		(uuid "5d5cdfdb-73fe-4f0e-a901-5ba6e50bda41")
	)
	(wire
		(pts
			(xy 87.63 81.28) (xy 87.63 114.3)
		)
		(stroke
			(width 0)
			(type default)
		)
		(uuid "5ec64df0-0745-467e-b1fa-b9b134144809")
	)
	(wire
		(pts
			(xy 76.2 81.28) (xy 80.01 81.28)
		)
		(stroke
			(width 0)
			(type default)
		)
		(uuid "6088d5cf-233f-466b-8a7c-8ad3de40029e")
	)
	(wire
		(pts
			(xy 80.01 81.28) (xy 87.63 81.28)
		)
		(stroke
			(width 0)
			(type default)
		)
		(uuid "640cb75e-03f1-46c9-a0e4-80678d108cb7")
	)
	(wire
		(pts
			(xy 109.22 142.24) (xy 109.22 148.59)
		)
		(stroke
			(width 0)
			(type default)
		)
		(uuid "682b8480-99e7-4fb5-98e3-8e4ee2107913")
	)
	(wire
		(pts
			(xy 111.76 86.36) (xy 109.22 86.36)
		)
		(stroke
			(width 0)
			(type default)
		)
		(uuid "685721f5-861f-43b4-8abf-c6f821ab2175")
	)
	(wire
		(pts
			(xy 57.15 67.31) (xy 57.15 78.74)
		)
		(stroke
			(width 0)
			(type default)
		)
		(uuid "6f29d7a7-856a-4d2d-89b8-cc9009f14795")
	)
	(wire
		(pts
			(xy 129.54 83.82) (xy 135.89 83.82)
		)
		(stroke
			(width 0)
			(type default)
		)
		(uuid "749b72e4-0918-4867-91d7-a08eaba09ee1")
	)
	(wire
		(pts
			(xy 129.54 151.13) (xy 134.62 151.13)
		)
		(stroke
			(width 0)
			(type default)
		)
		(uuid "7672886b-21de-46bb-82ed-cfe75598a8c6")
	)
	(wire
		(pts
			(xy 198.12 34.29) (xy 198.12 38.1)
		)
		(stroke
			(width 0)
			(type default)
		)
		(uuid "77acdc86-971c-48e1-9e68-b1789616a685")
	)
	(wire
		(pts
			(xy 115.57 107.95) (xy 109.22 107.95)
		)
		(stroke
			(width 0)
			(type default)
		)
		(uuid "84b31316-f41b-406c-93a5-db046d83e8b8")
	)
	(wire
		(pts
			(xy 129.54 116.84) (xy 135.89 116.84)
		)
		(stroke
			(width 0)
			(type default)
		)
		(uuid "84debac9-6fe1-4ffa-9ca6-3ff24784fca1")
	)
	(wire
		(pts
			(xy 109.22 153.67) (xy 109.22 158.75)
		)
		(stroke
			(width 0)
			(type default)
		)
		(uuid "87e83b56-296a-4e45-ac07-7512d5bc817b")
	)
	(wire
		(pts
			(xy 127 83.82) (xy 129.54 83.82)
		)
		(stroke
			(width 0)
			(type default)
		)
		(uuid "8ea4d094-6fa8-48ce-b95d-7d76a1e0d5b7")
	)
	(wire
		(pts
			(xy 101.6 81.28) (xy 109.22 81.28)
		)
		(stroke
			(width 0)
			(type default)
		)
		(uuid "9a6e4304-5b66-434e-bef1-18e35cd51c7e")
	)
	(wire
		(pts
			(xy 101.6 148.59) (xy 109.22 148.59)
		)
		(stroke
			(width 0)
			(type default)
		)
		(uuid "9ae3b2ba-2b0c-43d7-b894-a49485e96a95")
	)
	(wire
		(pts
			(xy 72.39 67.31) (xy 80.01 67.31)
		)
		(stroke
			(width 0)
			(type default)
		)
		(uuid "a2c42fe7-45ff-40b7-b6a4-fc8bba880fc0")
	)
	(wire
		(pts
			(xy 57.15 38.1) (xy 57.15 41.91)
		)
		(stroke
			(width 0)
			(type default)
		)
		(uuid "b1ad7fff-c2e6-4ceb-a909-f03d9ed958c4")
	)
	(wire
		(pts
			(xy 109.22 114.3) (xy 111.76 114.3)
		)
		(stroke
			(width 0)
			(type default)
		)
		(uuid "b4d588a0-6e58-4b67-bf56-fcd66b578266")
	)
	(wire
		(pts
			(xy 109.22 107.95) (xy 109.22 114.3)
		)
		(stroke
			(width 0)
			(type default)
		)
		(uuid "bd415eeb-ee02-47a0-b529-0e635b34b39f")
	)
	(wire
		(pts
			(xy 63.5 38.1) (xy 57.15 38.1)
		)
		(stroke
			(width 0)
			(type default)
		)
		(uuid "c6b1ab6d-3789-4cd9-b842-c150efde3dbf")
	)
	(wire
		(pts
			(xy 111.76 119.38) (xy 109.22 119.38)
		)
		(stroke
			(width 0)
			(type default)
		)
		(uuid "c6dd709b-7a52-4f8e-be8e-0b386e7738a9")
	)
	(wire
		(pts
			(xy 143.51 83.82) (xy 152.4 83.82)
		)
		(stroke
			(width 0)
			(type default)
		)
		(uuid "ce3b13bb-6681-4452-80dc-9037453031b5")
	)
	(wire
		(pts
			(xy 50.8 78.74) (xy 57.15 78.74)
		)
		(stroke
			(width 0)
			(type default)
		)
		(uuid "d75279e7-1259-4a1c-b8df-67cd200e5c10")
	)
	(wire
		(pts
			(xy 87.63 114.3) (xy 93.98 114.3)
		)
		(stroke
			(width 0)
			(type default)
		)
		(uuid "daa55ac2-4168-4ed9-8648-4da5118e8a1b")
	)
	(polyline
		(pts
			(xy 219.456 71.374) (xy 185.166 71.374)
		)
		(stroke
			(width 0)
			(type dash)
		)
		(uuid "dbbb5d5f-9b0a-4388-8649-f9c0b8d9c793")
	)
	(polyline
		(pts
			(xy 219.456 21.844) (xy 219.456 71.374)
		)
		(stroke
			(width 0)
			(type dash)
		)
		(uuid "dcd6d424-15d3-400b-89b1-c267dfec5853")
	)
	(wire
		(pts
			(xy 129.54 74.93) (xy 123.19 74.93)
		)
		(stroke
			(width 0)
			(type default)
		)
		(uuid "e1107484-bfc0-4144-9b4b-c894fef42ed9")
	)
	(wire
		(pts
			(xy 129.54 151.13) (xy 129.54 142.24)
		)
		(stroke
			(width 0)
			(type default)
		)
		(uuid "e1c99d86-c569-437c-a950-49a129c7942f")
	)
	(wire
		(pts
			(xy 57.15 78.74) (xy 60.96 78.74)
		)
		(stroke
			(width 0)
			(type default)
		)
		(uuid "e5c41ab7-63ef-489f-a48a-7cac9d7a13df")
	)
	(wire
		(pts
			(xy 29.21 78.74) (xy 35.56 78.74)
		)
		(stroke
			(width 0)
			(type default)
		)
		(uuid "e936eb65-37c1-43ec-80da-a2373683ba44")
	)
	(wire
		(pts
			(xy 57.15 49.53) (xy 57.15 52.07)
		)
		(stroke
			(width 0)
			(type default)
		)
		(uuid "eb47392b-be5e-4a6a-806c-695c07da463e")
	)
	(wire
		(pts
			(xy 87.63 81.28) (xy 93.98 81.28)
		)
		(stroke
			(width 0)
			(type default)
		)
		(uuid "eda9beff-4d0c-4b10-a815-57057f8d9425")
	)
	(wire
		(pts
			(xy 109.22 119.38) (xy 109.22 124.46)
		)
		(stroke
			(width 0)
			(type default)
		)
		(uuid "ee18d25a-82d3-4ec2-838a-6d5b619555ea")
	)
	(wire
		(pts
			(xy 57.15 67.31) (xy 64.77 67.31)
		)
		(stroke
			(width 0)
			(type default)
		)
		(uuid "f0aa77b4-53a1-4c88-b4c6-37c6a7b47677")
	)
	(wire
		(pts
			(xy 109.22 81.28) (xy 111.76 81.28)
		)
		(stroke
			(width 0)
			(type default)
		)
		(uuid "f91b47e9-2e75-4ab2-a6d6-d7a2614f19c1")
	)
	(wire
		(pts
			(xy 115.57 142.24) (xy 109.22 142.24)
		)
		(stroke
			(width 0)
			(type default)
		)
		(uuid "f988cb40-9cfb-42a9-9f2c-18c784aaa34f")
	)
	(wire
		(pts
			(xy 72.39 52.07) (xy 80.01 52.07)
		)
		(stroke
			(width 0)
			(type default)
		)
		(uuid "fd4c8d65-ad90-4409-a3ce-3df74f003bb2")
	)
	(wire
		(pts
			(xy 111.76 153.67) (xy 109.22 153.67)
		)
		(stroke
			(width 0)
			(type default)
		)
		(uuid "ffe3f195-6cea-48db-874b-ea0c45e68b85")
	)
	(rectangle
		(start 18.288 21.59)
		(end 173.228 171.704)
		(stroke
			(width 0)
			(type dash)
		)
		(fill
			(type none)
		)
		(uuid 17cc014c-25d6-4fba-a076-46f7ae06e13d)
	)
	(text "metal film\n1/4W"
		(exclude_from_sim no)
		(at 125.984 111.506 0)
		(effects
			(font
				(size 1.27 1.27)
			)
			(justify right)
		)
		(uuid "085f1e83-8265-4a75-9275-c5d3a8d17011")
	)
	(text "1/4W metal film"
		(exclude_from_sim no)
		(at 98.044 84.582 0)
		(effects
			(font
				(size 1.27 1.27)
			)
		)
		(uuid "545927dd-9edf-4f18-8f42-6bca9ed5c2e4")
	)
	(text "1/4W metal film"
		(exclude_from_sim no)
		(at 97.536 151.892 0)
		(effects
			(font
				(size 1.27 1.27)
			)
		)
		(uuid "5de587a3-89c8-45fd-a438-d6fb12df6e9b")
	)
	(text "metal film\n1/4W"
		(exclude_from_sim no)
		(at 126.238 78.486 0)
		(effects
			(font
				(size 1.27 1.27)
			)
			(justify right)
		)
		(uuid "69708862-c456-474e-86e6-a0f4d87c79f8")
	)
	(text "1/4W metal film"
		(exclude_from_sim no)
		(at 138.684 154.686 0)
		(effects
			(font
				(size 1.27 1.27)
			)
		)
		(uuid "7cc76328-0c00-44bb-b149-df3b594852e9")
	)
	(text "1/4W \nmetal film"
		(exclude_from_sim no)
		(at 61.468 44.704 90)
		(effects
			(font
				(size 1.27 1.27)
			)
		)
		(uuid "8802a6eb-3e37-48d7-aa21-f655d8f46d9d")
	)
	(text "1/4W metal film"
		(exclude_from_sim no)
		(at 69.596 55.118 0)
		(effects
			(font
				(size 1.27 1.27)
			)
		)
		(uuid "a1abf567-404b-4cb1-8081-5cf83be8229b")
	)
	(text "1/4W metal film"
		(exclude_from_sim no)
		(at 40.386 116.586 0)
		(effects
			(font
				(size 1.27 1.27)
			)
		)
		(uuid "a1f50934-4a83-43ea-81af-7ffb1324f964")
	)
	(text "TL074 Power"
		(exclude_from_sim no)
		(at 205.74 24.892 0)
		(effects
			(font
				(size 1.27 1.27)
			)
			(justify left bottom)
		)
		(uuid "b0b63845-7d35-455e-8bb4-7079a33d8a08")
	)
	(text "1/4W metal film"
		(exclude_from_sim no)
		(at 139.446 87.63 0)
		(effects
			(font
				(size 1.27 1.27)
			)
		)
		(uuid "c1e183c4-587e-4e6e-ad59-04c70a260096")
	)
	(text "1/4W metal film"
		(exclude_from_sim no)
		(at 98.044 117.348 0)
		(effects
			(font
				(size 1.27 1.27)
			)
		)
		(uuid "c59d8b4e-ae03-4f6f-b2e4-60d7f7ae1b79")
	)
	(text "1/4W metal film"
		(exclude_from_sim no)
		(at 41.656 81.788 0)
		(effects
			(font
				(size 1.27 1.27)
			)
		)
		(uuid "c7304d00-8cbe-4ca7-8945-8b5b5b28007a")
	)
	(text "metal film\n1/4W"
		(exclude_from_sim no)
		(at 126.746 146.558 0)
		(effects
			(font
				(size 1.27 1.27)
			)
			(justify right)
		)
		(uuid "d7b3f1a2-fcf5-45c4-b070-ccae72fadc7f")
	)
	(text "1/4W metal film"
		(exclude_from_sim no)
		(at 139.446 120.396 0)
		(effects
			(font
				(size 1.27 1.27)
			)
		)
		(uuid "ef76341d-e66f-4165-b08f-ac856a036fd0")
	)
	(hierarchical_label "buff_out_2"
		(shape input)
		(at 152.4 116.84 0)
		(fields_autoplaced yes)
		(effects
			(font
				(size 1.27 1.27)
			)
			(justify left)
		)
		(uuid "0c12f78a-5e3b-4950-948f-877a5dc96ae9")
	)
	(hierarchical_label "buff_out_3"
		(shape input)
		(at 152.4 151.13 0)
		(fields_autoplaced yes)
		(effects
			(font
				(size 1.27 1.27)
			)
			(justify left)
		)
		(uuid "0ee86c8e-3b74-4154-b8e9-bde604534a23")
	)
	(hierarchical_label "in_1"
		(shape input)
		(at 29.21 78.74 180)
		(fields_autoplaced yes)
		(effects
			(font
				(size 1.27 1.27)
			)
			(justify right)
		)
		(uuid "0fd9265b-a950-47f2-be71-d87d7f8cebd8")
	)
	(hierarchical_label "-12V_PWR"
		(shape input)
		(at 198.12 58.42 270)
		(fields_autoplaced yes)
		(effects
			(font
				(size 1.27 1.27)
			)
			(justify right)
		)
		(uuid "19b03055-1140-46d0-8137-29a5abc5797e")
	)
	(hierarchical_label "+12V_PWR"
		(shape input)
		(at 198.12 34.29 90)
		(fields_autoplaced yes)
		(effects
			(font
				(size 1.27 1.27)
			)
			(justify left)
		)
		(uuid "5cdb40af-916e-45c4-8efb-456e37439270")
	)
	(hierarchical_label "in_2"
		(shape input)
		(at 30.48 113.03 180)
		(fields_autoplaced yes)
		(effects
			(font
				(size 1.27 1.27)
			)
			(justify right)
		)
		(uuid "c540c653-23a9-4b01-b5d7-9ceeaa52a0a0")
	)
	(hierarchical_label "buff_out_1"
		(shape input)
		(at 152.4 83.82 0)
		(fields_autoplaced yes)
		(effects
			(font
				(size 1.27 1.27)
			)
			(justify left)
		)
		(uuid "f2939279-0eb0-4d2a-9d03-a4d495bc6812")
	)
	(symbol
		(lib_id "Device:R")
		(at 39.37 78.74 90)
		(unit 1)
		(exclude_from_sim no)
		(in_bom yes)
		(on_board yes)
		(dnp no)
		(fields_autoplaced yes)
		(uuid "0853c712-4716-4a6f-b9b1-b8051cbd55da")
		(property "Reference" "R16"
			(at 39.37 72.39 90)
			(effects
				(font
					(size 1.27 1.27)
				)
			)
		)
		(property "Value" "100k(1%)"
			(at 39.37 74.93 90)
			(effects
				(font
					(size 1.27 1.27)
				)
			)
		)
		(property "Footprint" "Resistor_SMD:R_MELF_MMB-0207"
			(at 39.37 80.518 90)
			(effects
				(font
					(size 1.27 1.27)
				)
				(hide yes)
			)
		)
		(property "Datasheet" "https://datasheet.lcsc.com/lcsc/2304140030_RESI-LMERW330F100KQ9L_C720012.pdf"
			(at 39.37 78.74 0)
			(effects
				(font
					(size 1.27 1.27)
				)
				(hide yes)
			)
		)
		(property "Description" "Resistor"
			(at 39.37 78.74 0)
			(effects
				(font
					(size 1.27 1.27)
				)
				(hide yes)
			)
		)
		(property "LCSC" "C720012"
			(at 39.37 78.74 90)
			(effects
				(font
					(size 1.27 1.27)
				)
				(hide yes)
			)
		)
		(pin "1"
			(uuid "d2ea5897-cdc5-49df-81cb-2457f317288a")
		)
		(pin "2"
			(uuid "4b966dbf-1352-4910-b9c6-195c94fc79ca")
		)
		(instances
			(project "pcb_3u"
				(path "/2d0a5d12-d9ab-431e-bbbb-44aaa454dfb7/16bbe97f-7a9b-45f0-a949-a189e6659edb"
					(reference "R16")
					(unit 1)
				)
				(path "/2d0a5d12-d9ab-431e-bbbb-44aaa454dfb7/3cd5e99a-6b80-4546-9264-9f3a6f357332"
					(reference "R3")
					(unit 1)
				)
			)
		)
	)
	(symbol
		(lib_id "Device:R")
		(at 119.38 74.93 90)
		(unit 1)
		(exclude_from_sim no)
		(in_bom yes)
		(on_board yes)
		(dnp no)
		(fields_autoplaced yes)
		(uuid "12fc6b5e-8945-4c3a-a73f-eb5377968b5e")
		(property "Reference" "R23"
			(at 119.38 68.58 90)
			(effects
				(font
					(size 1.27 1.27)
				)
			)
		)
		(property "Value" "10k(1%)"
			(at 119.38 71.12 90)
			(effects
				(font
					(size 1.27 1.27)
				)
			)
		)
		(property "Footprint" "Resistor_SMD:R_MiniMELF_MMA-0204"
			(at 119.38 76.708 90)
			(effects
				(font
					(size 1.27 1.27)
				)
				(hide yes)
			)
		)
		(property "Datasheet" "https://datasheet.lcsc.com/lcsc/2304140030_Viking-Tech-CSR0204FTDV1002_C316475.pdf"
			(at 119.38 74.93 0)
			(effects
				(font
					(size 1.27 1.27)
				)
				(hide yes)
			)
		)
		(property "Description" "Resistor"
			(at 119.38 74.93 0)
			(effects
				(font
					(size 1.27 1.27)
				)
				(hide yes)
			)
		)
		(property "LCSC" "C316475"
			(at 119.38 74.93 90)
			(effects
				(font
					(size 1.27 1.27)
				)
				(hide yes)
			)
		)
		(pin "1"
			(uuid "ea0dcc4b-14ae-47a5-b497-3fa949e23cd8")
		)
		(pin "2"
			(uuid "bf82dac8-c1be-4c0b-8656-d62c37265f92")
		)
		(instances
			(project "pcb_3u"
				(path "/2d0a5d12-d9ab-431e-bbbb-44aaa454dfb7/16bbe97f-7a9b-45f0-a949-a189e6659edb"
					(reference "R23")
					(unit 1)
				)
				(path "/2d0a5d12-d9ab-431e-bbbb-44aaa454dfb7/3cd5e99a-6b80-4546-9264-9f3a6f357332"
					(reference "R10")
					(unit 1)
				)
			)
		)
	)
	(symbol
		(lib_id "Device:R")
		(at 138.43 151.13 90)
		(unit 1)
		(exclude_from_sim no)
		(in_bom yes)
		(on_board yes)
		(dnp no)
		(fields_autoplaced yes)
		(uuid "1453e433-cb19-4acb-ab65-acd17b86f214")
		(property "Reference" "R26"
			(at 138.43 144.78 90)
			(effects
				(font
					(size 1.27 1.27)
				)
			)
		)
		(property "Value" "1k(1%)"
			(at 138.43 147.32 90)
			(effects
				(font
					(size 1.27 1.27)
				)
			)
		)
		(property "Footprint" "Resistor_SMD:R_MiniMELF_MMA-0204"
			(at 138.43 152.908 90)
			(effects
				(font
					(size 1.27 1.27)
				)
				(hide yes)
			)
		)
		(property "Datasheet" "https://datasheet.lcsc.com/lcsc/2304140030_Viking-Tech-CSR0204FTDV1001_C489406.pdf"
			(at 138.43 151.13 0)
			(effects
				(font
					(size 1.27 1.27)
				)
				(hide yes)
			)
		)
		(property "Description" "Resistor"
			(at 138.43 151.13 0)
			(effects
				(font
					(size 1.27 1.27)
				)
				(hide yes)
			)
		)
		(property "LCSC" "C489406"
			(at 138.43 151.13 90)
			(effects
				(font
					(size 1.27 1.27)
				)
				(hide yes)
			)
		)
		(pin "1"
			(uuid "7f7162c8-ae57-40fe-8f59-86f1528fd4bf")
		)
		(pin "2"
			(uuid "e772120c-6c25-4dd9-9880-a46737d8c439")
		)
		(instances
			(project "pcb_3u"
				(path "/2d0a5d12-d9ab-431e-bbbb-44aaa454dfb7/16bbe97f-7a9b-45f0-a949-a189e6659edb"
					(reference "R26")
					(unit 1)
				)
				(path "/2d0a5d12-d9ab-431e-bbbb-44aaa454dfb7/3cd5e99a-6b80-4546-9264-9f3a6f357332"
					(reference "R13")
					(unit 1)
				)
			)
		)
	)
	(symbol
		(lib_name "GND_2")
		(lib_id "power:GND")
		(at 109.22 90.17 0)
		(unit 1)
		(exclude_from_sim no)
		(in_bom yes)
		(on_board yes)
		(dnp no)
		(fields_autoplaced yes)
		(uuid "183e69d0-30fc-416b-9482-c7a22b9975b6")
		(property "Reference" "#PWR021"
			(at 109.22 96.52 0)
			(effects
				(font
					(size 1.27 1.27)
				)
				(hide yes)
			)
		)
		(property "Value" "GND"
			(at 109.22 95.25 0)
			(effects
				(font
					(size 1.27 1.27)
				)
			)
		)
		(property "Footprint" ""
			(at 109.22 90.17 0)
			(effects
				(font
					(size 1.27 1.27)
				)
				(hide yes)
			)
		)
		(property "Datasheet" ""
			(at 109.22 90.17 0)
			(effects
				(font
					(size 1.27 1.27)
				)
				(hide yes)
			)
		)
		(property "Description" "Power symbol creates a global label with name \"GND\" , ground"
			(at 109.22 90.17 0)
			(effects
				(font
					(size 1.27 1.27)
				)
				(hide yes)
			)
		)
		(pin "1"
			(uuid "99f028e2-1ada-480c-b667-aead520d6573")
		)
		(instances
			(project "pcb_3u"
				(path "/2d0a5d12-d9ab-431e-bbbb-44aaa454dfb7/16bbe97f-7a9b-45f0-a949-a189e6659edb"
					(reference "#PWR021")
					(unit 1)
				)
				(path "/2d0a5d12-d9ab-431e-bbbb-44aaa454dfb7/3cd5e99a-6b80-4546-9264-9f3a6f357332"
					(reference "#PWR012")
					(unit 1)
				)
			)
		)
	)
	(symbol
		(lib_id "Device:R")
		(at 139.7 83.82 90)
		(unit 1)
		(exclude_from_sim no)
		(in_bom yes)
		(on_board yes)
		(dnp no)
		(fields_autoplaced yes)
		(uuid "25c43484-4210-48f5-b5eb-afb053568228")
		(property "Reference" "R27"
			(at 139.7 77.47 90)
			(effects
				(font
					(size 1.27 1.27)
				)
			)
		)
		(property "Value" "1k(1%)"
			(at 139.7 80.01 90)
			(effects
				(font
					(size 1.27 1.27)
				)
			)
		)
		(property "Footprint" "Resistor_SMD:R_MiniMELF_MMA-0204"
			(at 139.7 85.598 90)
			(effects
				(font
					(size 1.27 1.27)
				)
				(hide yes)
			)
		)
		(property "Datasheet" "~"
			(at 139.7 83.82 0)
			(effects
				(font
					(size 1.27 1.27)
				)
				(hide yes)
			)
		)
		(property "Description" "https://datasheet.lcsc.com/lcsc/2304140030_Viking-Tech-CSR0204FTDV1001_C489406.pdf"
			(at 139.7 83.82 0)
			(effects
				(font
					(size 1.27 1.27)
				)
				(hide yes)
			)
		)
		(property "LCSC" "C489406"
			(at 139.7 83.82 90)
			(effects
				(font
					(size 1.27 1.27)
				)
				(hide yes)
			)
		)
		(pin "1"
			(uuid "9d221817-d546-4ffa-8567-04ec6c47b9f2")
		)
		(pin "2"
			(uuid "a42ffa64-6f1f-4937-915f-d565d66f871a")
		)
		(instances
			(project "pcb_3u"
				(path "/2d0a5d12-d9ab-431e-bbbb-44aaa454dfb7/16bbe97f-7a9b-45f0-a949-a189e6659edb"
					(reference "R27")
					(unit 1)
				)
				(path "/2d0a5d12-d9ab-431e-bbbb-44aaa454dfb7/3cd5e99a-6b80-4546-9264-9f3a6f357332"
					(reference "R14")
					(unit 1)
				)
			)
		)
	)
	(symbol
		(lib_id "Device:R")
		(at 119.38 142.24 90)
		(unit 1)
		(exclude_from_sim no)
		(in_bom yes)
		(on_board yes)
		(dnp no)
		(fields_autoplaced yes)
		(uuid "3e3fcf4f-6cde-4a85-af90-8f8db3d6b7d9")
		(property "Reference" "R25"
			(at 119.38 135.89 90)
			(effects
				(font
					(size 1.27 1.27)
				)
			)
		)
		(property "Value" "10k(1%)"
			(at 119.38 138.43 90)
			(effects
				(font
					(size 1.27 1.27)
				)
			)
		)
		(property "Footprint" "Resistor_SMD:R_MiniMELF_MMA-0204"
			(at 119.38 144.018 90)
			(effects
				(font
					(size 1.27 1.27)
				)
				(hide yes)
			)
		)
		(property "Datasheet" "https://datasheet.lcsc.com/lcsc/2304140030_Viking-Tech-CSR0204FTDV1002_C316475.pdf"
			(at 119.38 142.24 0)
			(effects
				(font
					(size 1.27 1.27)
				)
				(hide yes)
			)
		)
		(property "Description" "Resistor"
			(at 119.38 142.24 0)
			(effects
				(font
					(size 1.27 1.27)
				)
				(hide yes)
			)
		)
		(property "LCSC" "C316475"
			(at 119.38 142.24 90)
			(effects
				(font
					(size 1.27 1.27)
				)
				(hide yes)
			)
		)
		(pin "1"
			(uuid "5445c285-fd5d-41e2-a5fa-aa38e0b83c79")
		)
		(pin "2"
			(uuid "34b752f2-4856-4aa0-a35d-73c40f9372c7")
		)
		(instances
			(project "pcb_3u"
				(path "/2d0a5d12-d9ab-431e-bbbb-44aaa454dfb7/16bbe97f-7a9b-45f0-a949-a189e6659edb"
					(reference "R25")
					(unit 1)
				)
				(path "/2d0a5d12-d9ab-431e-bbbb-44aaa454dfb7/3cd5e99a-6b80-4546-9264-9f3a6f357332"
					(reference "R12")
					(unit 1)
				)
			)
		)
	)
	(symbol
		(lib_id "Device:R")
		(at 139.7 116.84 90)
		(unit 1)
		(exclude_from_sim no)
		(in_bom yes)
		(on_board yes)
		(dnp no)
		(fields_autoplaced yes)
		(uuid "45eca295-e602-42d9-a757-d801af761721")
		(property "Reference" "R28"
			(at 139.7 110.49 90)
			(effects
				(font
					(size 1.27 1.27)
				)
			)
		)
		(property "Value" "1k(1%)"
			(at 139.7 113.03 90)
			(effects
				(font
					(size 1.27 1.27)
				)
			)
		)
		(property "Footprint" "Resistor_SMD:R_MiniMELF_MMA-0204"
			(at 139.7 118.618 90)
			(effects
				(font
					(size 1.27 1.27)
				)
				(hide yes)
			)
		)
		(property "Datasheet" "https://datasheet.lcsc.com/lcsc/2304140030_Viking-Tech-CSR0204FTDV1001_C489406.pdf"
			(at 139.7 116.84 0)
			(effects
				(font
					(size 1.27 1.27)
				)
				(hide yes)
			)
		)
		(property "Description" "Resistor"
			(at 139.7 116.84 0)
			(effects
				(font
					(size 1.27 1.27)
				)
				(hide yes)
			)
		)
		(property "LCSC" "C489406"
			(at 139.7 116.84 90)
			(effects
				(font
					(size 1.27 1.27)
				)
				(hide yes)
			)
		)
		(pin "1"
			(uuid "f0704690-67fd-44a6-8c12-4782b8c4dd31")
		)
		(pin "2"
			(uuid "077c939e-7c95-449f-8c74-97a31c7d3315")
		)
		(instances
			(project "pcb_3u"
				(path "/2d0a5d12-d9ab-431e-bbbb-44aaa454dfb7/16bbe97f-7a9b-45f0-a949-a189e6659edb"
					(reference "R28")
					(unit 1)
				)
				(path "/2d0a5d12-d9ab-431e-bbbb-44aaa454dfb7/3cd5e99a-6b80-4546-9264-9f3a6f357332"
					(reference "R15")
					(unit 1)
				)
			)
		)
	)
	(symbol
		(lib_id "Device:R")
		(at 97.79 148.59 90)
		(unit 1)
		(exclude_from_sim no)
		(in_bom yes)
		(on_board yes)
		(dnp no)
		(fields_autoplaced yes)
		(uuid "6487ce46-d664-4905-944e-ef0e5084dc7e")
		(property "Reference" "R22"
			(at 97.79 142.24 90)
			(effects
				(font
					(size 1.27 1.27)
				)
			)
		)
		(property "Value" "10k(1%)"
			(at 97.79 144.78 90)
			(effects
				(font
					(size 1.27 1.27)
				)
			)
		)
		(property "Footprint" "Resistor_SMD:R_MiniMELF_MMA-0204"
			(at 97.79 150.368 90)
			(effects
				(font
					(size 1.27 1.27)
				)
				(hide yes)
			)
		)
		(property "Datasheet" "https://datasheet.lcsc.com/lcsc/2304140030_Viking-Tech-CSR0204FTDV1002_C316475.pdf"
			(at 97.79 148.59 0)
			(effects
				(font
					(size 1.27 1.27)
				)
				(hide yes)
			)
		)
		(property "Description" "Resistor"
			(at 97.79 148.59 0)
			(effects
				(font
					(size 1.27 1.27)
				)
				(hide yes)
			)
		)
		(property "LCSC" "C316475"
			(at 97.79 148.59 90)
			(effects
				(font
					(size 1.27 1.27)
				)
				(hide yes)
			)
		)
		(pin "1"
			(uuid "9bef0dbc-f5a3-4ff2-a7b4-83a1e808a550")
		)
		(pin "2"
			(uuid "4c700ad2-9bc9-4f40-8af1-0ee64aa5a01b")
		)
		(instances
			(project "pcb_3u"
				(path "/2d0a5d12-d9ab-431e-bbbb-44aaa454dfb7/16bbe97f-7a9b-45f0-a949-a189e6659edb"
					(reference "R22")
					(unit 1)
				)
				(path "/2d0a5d12-d9ab-431e-bbbb-44aaa454dfb7/3cd5e99a-6b80-4546-9264-9f3a6f357332"
					(reference "R9")
					(unit 1)
				)
			)
		)
	)
	(symbol
		(lib_name "GND_5")
		(lib_id "power:GND")
		(at 57.15 90.17 0)
		(unit 1)
		(exclude_from_sim no)
		(in_bom yes)
		(on_board yes)
		(dnp no)
		(fields_autoplaced yes)
		(uuid "71a26942-6330-4269-90f4-bf758ec5d70f")
		(property "Reference" "#PWR020"
			(at 57.15 96.52 0)
			(effects
				(font
					(size 1.27 1.27)
				)
				(hide yes)
			)
		)
		(property "Value" "GND"
			(at 57.15 95.25 0)
			(effects
				(font
					(size 1.27 1.27)
				)
			)
		)
		(property "Footprint" ""
			(at 57.15 90.17 0)
			(effects
				(font
					(size 1.27 1.27)
				)
				(hide yes)
			)
		)
		(property "Datasheet" ""
			(at 57.15 90.17 0)
			(effects
				(font
					(size 1.27 1.27)
				)
				(hide yes)
			)
		)
		(property "Description" "Power symbol creates a global label with name \"GND\" , ground"
			(at 57.15 90.17 0)
			(effects
				(font
					(size 1.27 1.27)
				)
				(hide yes)
			)
		)
		(pin "1"
			(uuid "a8d198b0-96f7-4764-b9aa-79af0ca5c8d0")
		)
		(instances
			(project "pcb_3u"
				(path "/2d0a5d12-d9ab-431e-bbbb-44aaa454dfb7/16bbe97f-7a9b-45f0-a949-a189e6659edb"
					(reference "#PWR020")
					(unit 1)
				)
				(path "/2d0a5d12-d9ab-431e-bbbb-44aaa454dfb7/3cd5e99a-6b80-4546-9264-9f3a6f357332"
					(reference "#PWR011")
					(unit 1)
				)
			)
		)
	)
	(symbol
		(lib_id "Device:R")
		(at 68.58 52.07 90)
		(unit 1)
		(exclude_from_sim no)
		(in_bom yes)
		(on_board yes)
		(dnp no)
		(fields_autoplaced yes)
		(uuid "8bd929d2-54e8-4513-b69e-d3c7c62e5872")
		(property "Reference" "R19"
			(at 68.58 45.72 90)
			(effects
				(font
					(size 1.27 1.27)
				)
			)
		)
		(property "Value" "100k(1%)"
			(at 68.58 48.26 90)
			(effects
				(font
					(size 1.27 1.27)
				)
			)
		)
		(property "Footprint" "Resistor_SMD:R_MELF_MMB-0207"
			(at 68.58 53.848 90)
			(effects
				(font
					(size 1.27 1.27)
				)
				(hide yes)
			)
		)
		(property "Datasheet" "https://datasheet.lcsc.com/lcsc/2304140030_RESI-LMERW330F100KQ9L_C720012.pdf"
			(at 68.58 52.07 0)
			(effects
				(font
					(size 1.27 1.27)
				)
				(hide yes)
			)
		)
		(property "Description" "Resistor"
			(at 68.58 52.07 0)
			(effects
				(font
					(size 1.27 1.27)
				)
				(hide yes)
			)
		)
		(property "LCSC" "C720012"
			(at 68.58 52.07 90)
			(effects
				(font
					(size 1.27 1.27)
				)
				(hide yes)
			)
		)
		(pin "1"
			(uuid "25409ba5-48fe-461d-bd9b-2e088e5ec201")
		)
		(pin "2"
			(uuid "185c9a24-4796-4b76-aa47-15d1cdab0743")
		)
		(instances
			(project "pcb_3u"
				(path "/2d0a5d12-d9ab-431e-bbbb-44aaa454dfb7/16bbe97f-7a9b-45f0-a949-a189e6659edb"
					(reference "R19")
					(unit 1)
				)
				(path "/2d0a5d12-d9ab-431e-bbbb-44aaa454dfb7/3cd5e99a-6b80-4546-9264-9f3a6f357332"
					(reference "R6")
					(unit 1)
				)
			)
		)
	)
	(symbol
		(lib_id "Device:R")
		(at 97.79 81.28 90)
		(unit 1)
		(exclude_from_sim no)
		(in_bom yes)
		(on_board yes)
		(dnp no)
		(fields_autoplaced yes)
		(uuid "8c8fe48a-98de-43e7-8551-29bc59b059b6")
		(property "Reference" "R20"
			(at 97.79 74.93 90)
			(effects
				(font
					(size 1.27 1.27)
				)
			)
		)
		(property "Value" "10k(1%)"
			(at 97.79 77.47 90)
			(effects
				(font
					(size 1.27 1.27)
				)
			)
		)
		(property "Footprint" "Resistor_SMD:R_MiniMELF_MMA-0204"
			(at 97.79 83.058 90)
			(effects
				(font
					(size 1.27 1.27)
				)
				(hide yes)
			)
		)
		(property "Datasheet" "https://datasheet.lcsc.com/lcsc/2304140030_Viking-Tech-CSR0204FTDV1002_C316475.pdf"
			(at 97.79 81.28 0)
			(effects
				(font
					(size 1.27 1.27)
				)
				(hide yes)
			)
		)
		(property "Description" "Resistor"
			(at 97.79 81.28 0)
			(effects
				(font
					(size 1.27 1.27)
				)
				(hide yes)
			)
		)
		(property "LCSC" "C316475"
			(at 97.79 81.28 90)
			(effects
				(font
					(size 1.27 1.27)
				)
				(hide yes)
			)
		)
		(pin "1"
			(uuid "7c12d951-8668-479c-8ce9-feeb473265df")
		)
		(pin "2"
			(uuid "f52710b1-ec29-4b06-9026-4edafe8e1b66")
		)
		(instances
			(project "pcb_3u"
				(path "/2d0a5d12-d9ab-431e-bbbb-44aaa454dfb7/16bbe97f-7a9b-45f0-a949-a189e6659edb"
					(reference "R20")
					(unit 1)
				)
				(path "/2d0a5d12-d9ab-431e-bbbb-44aaa454dfb7/3cd5e99a-6b80-4546-9264-9f3a6f357332"
					(reference "R7")
					(unit 1)
				)
			)
		)
	)
	(symbol
		(lib_id "Device:R")
		(at 39.37 113.03 90)
		(unit 1)
		(exclude_from_sim no)
		(in_bom yes)
		(on_board yes)
		(dnp no)
		(fields_autoplaced yes)
		(uuid "8f5db561-399e-4185-a7cf-a6adf52ec01a")
		(property "Reference" "R17"
			(at 39.37 106.68 90)
			(effects
				(font
					(size 1.27 1.27)
				)
			)
		)
		(property "Value" "100k(1%)"
			(at 39.37 109.22 90)
			(effects
				(font
					(size 1.27 1.27)
				)
			)
		)
		(property "Footprint" "Resistor_SMD:R_MELF_MMB-0207"
			(at 39.37 114.808 90)
			(effects
				(font
					(size 1.27 1.27)
				)
				(hide yes)
			)
		)
		(property "Datasheet" "https://datasheet.lcsc.com/lcsc/2304140030_RESI-LMERW330F100KQ9L_C720012.pdf"
			(at 39.37 113.03 0)
			(effects
				(font
					(size 1.27 1.27)
				)
				(hide yes)
			)
		)
		(property "Description" "Resistor"
			(at 39.37 113.03 0)
			(effects
				(font
					(size 1.27 1.27)
				)
				(hide yes)
			)
		)
		(property "LCSC" "C720012"
			(at 39.37 113.03 90)
			(effects
				(font
					(size 1.27 1.27)
				)
				(hide yes)
			)
		)
		(pin "1"
			(uuid "75aaaa6c-0c6e-443e-94ba-6451f6cf8cd4")
		)
		(pin "2"
			(uuid "7648606e-319c-45a2-8800-b4073e62fe1a")
		)
		(instances
			(project "pcb_3u"
				(path "/2d0a5d12-d9ab-431e-bbbb-44aaa454dfb7/16bbe97f-7a9b-45f0-a949-a189e6659edb"
					(reference "R17")
					(unit 1)
				)
				(path "/2d0a5d12-d9ab-431e-bbbb-44aaa454dfb7/3cd5e99a-6b80-4546-9264-9f3a6f357332"
					(reference "R4")
					(unit 1)
				)
			)
		)
	)
	(symbol
		(lib_id "Switch:SW_SPDT")
		(at 68.58 38.1 0)
		(unit 1)
		(exclude_from_sim no)
		(in_bom yes)
		(on_board yes)
		(dnp no)
		(fields_autoplaced yes)
		(uuid "91483925-a98d-4404-8fda-5a026b730d7c")
		(property "Reference" "SW2"
			(at 68.58 29.21 0)
			(effects
				(font
					(size 1.27 1.27)
				)
			)
		)
		(property "Value" "SW_SPDT"
			(at 68.58 31.75 0)
			(effects
				(font
					(size 1.27 1.27)
				)
			)
		)
		(property "Footprint" "Switches:Dailywell 2TES1M2RES"
			(at 68.58 38.1 0)
			(effects
				(font
					(size 1.27 1.27)
				)
				(hide yes)
			)
		)
		(property "Datasheet" "https://datasheet.lcsc.com/lcsc/2004022116_Dailywell-2TES1M2RES_C497115.pdf"
			(at 68.58 45.72 0)
			(effects
				(font
					(size 1.27 1.27)
				)
				(hide yes)
			)
		)
		(property "Description" "Switch, single pole double throw"
			(at 68.58 38.1 0)
			(effects
				(font
					(size 1.27 1.27)
				)
				(hide yes)
			)
		)
		(property "LCSC" "C497115"
			(at 68.58 38.1 0)
			(effects
				(font
					(size 1.27 1.27)
				)
				(hide yes)
			)
		)
		(pin "1"
			(uuid "c07b455a-f91e-4f72-89e0-49ae6ed284d4")
		)
		(pin "3"
			(uuid "1b81238c-442d-4ae2-bcd7-b9ad96e9cdf1")
		)
		(pin "2"
			(uuid "72d26169-1170-41e0-a234-fcf05f35123b")
		)
		(instances
			(project "pcb_3u"
				(path "/2d0a5d12-d9ab-431e-bbbb-44aaa454dfb7/16bbe97f-7a9b-45f0-a949-a189e6659edb"
					(reference "SW2")
					(unit 1)
				)
				(path "/2d0a5d12-d9ab-431e-bbbb-44aaa454dfb7/3cd5e99a-6b80-4546-9264-9f3a6f357332"
					(reference "SW1")
					(unit 1)
				)
			)
		)
	)
	(symbol
		(lib_id "Amplifier_Operational:TL074")
		(at 119.38 83.82 0)
		(mirror x)
		(unit 1)
		(exclude_from_sim no)
		(in_bom yes)
		(on_board yes)
		(dnp no)
		(uuid "934aff0c-2035-4448-801c-2a0f53ac6738")
		(property "Reference" "U2"
			(at 119.38 88.9 0)
			(effects
				(font
					(size 1.27 1.27)
				)
				(justify left)
			)
		)
		(property "Value" "TL074"
			(at 119.38 78.74 0)
			(effects
				(font
					(size 1.27 1.27)
				)
				(justify left)
			)
		)
		(property "Footprint" "Package_SO:SOIC-14_3.9x8.7mm_P1.27mm"
			(at 118.11 86.36 0)
			(effects
				(font
					(size 1.27 1.27)
				)
				(hide yes)
			)
		)
		(property "Datasheet" "http://www.ti.com/lit/ds/symlink/tl071.pdf"
			(at 120.65 88.9 0)
			(effects
				(font
					(size 1.27 1.27)
				)
				(hide yes)
			)
		)
		(property "Description" "Quad Low-Noise JFET-Input Operational Amplifiers, DIP-14/SOIC-14"
			(at 119.38 83.82 0)
			(effects
				(font
					(size 1.27 1.27)
				)
				(hide yes)
			)
		)
		(property "LCSC" "C107644"
			(at 119.38 83.82 0)
			(effects
				(font
					(size 1.27 1.27)
				)
				(hide yes)
			)
		)
		(pin "10"
			(uuid "b1dbd8bd-0476-44b7-ab8b-47cca82c583f")
		)
		(pin "9"
			(uuid "3329ec8b-b81c-4548-a8c8-9bd6cdeea33d")
		)
		(pin "14"
			(uuid "e10b23c9-088b-44be-84f6-1191ea649029")
		)
		(pin "13"
			(uuid "2c619efa-7ab1-4f5e-9f19-4a3d8a57db87")
		)
		(pin "8"
			(uuid "59fb827a-1ba7-4ec6-9ea0-d4721121795e")
		)
		(pin "5"
			(uuid "1c4ebc42-7513-4796-b27d-b77b339029d8")
		)
		(pin "7"
			(uuid "3d60ff66-5492-4d38-afc9-be4aef02dc65")
		)
		(pin "6"
			(uuid "fef28174-f798-4958-a3d7-ea6eb45957e5")
		)
		(pin "12"
			(uuid "33d4a579-4950-48bf-8796-0f68dc5066a0")
		)
		(pin "11"
			(uuid "c4890e4d-bd30-4ca5-9597-2be8f657846b")
		)
		(pin "1"
			(uuid "dfb853e0-f7ff-4bbe-91c5-04b24f76f0ad")
		)
		(pin "3"
			(uuid "63aa7b74-b0a7-4e9f-a4b4-849581d255ea")
		)
		(pin "2"
			(uuid "817429d2-f29f-4d10-bf2e-bfc6d6cf4dad")
		)
		(pin "4"
			(uuid "09ef9357-3263-42cc-99ae-11c808d6be9c")
		)
		(instances
			(project "pcb_3u"
				(path "/2d0a5d12-d9ab-431e-bbbb-44aaa454dfb7/16bbe97f-7a9b-45f0-a949-a189e6659edb"
					(reference "U2")
					(unit 1)
				)
				(path "/2d0a5d12-d9ab-431e-bbbb-44aaa454dfb7/3cd5e99a-6b80-4546-9264-9f3a6f357332"
					(reference "U1")
					(unit 1)
				)
			)
		)
	)
	(symbol
		(lib_id "Amplifier_Operational:TL074")
		(at 200.66 45.72 0)
		(unit 5)
		(exclude_from_sim no)
		(in_bom yes)
		(on_board yes)
		(dnp no)
		(fields_autoplaced yes)
		(uuid "9aea6224-c76c-4f60-a12b-eda6471b26fe")
		(property "Reference" "U2"
			(at 199.39 44.4499 0)
			(effects
				(font
					(size 1.27 1.27)
				)
				(justify left)
			)
		)
		(property "Value" "TL074"
			(at 199.39 46.9899 0)
			(effects
				(font
					(size 1.27 1.27)
				)
				(justify left)
			)
		)
		(property "Footprint" ""
			(at 199.39 43.18 0)
			(effects
				(font
					(size 1.27 1.27)
				)
				(hide yes)
			)
		)
		(property "Datasheet" "http://www.ti.com/lit/ds/symlink/tl071.pdf"
			(at 201.93 40.64 0)
			(effects
				(font
					(size 1.27 1.27)
				)
				(hide yes)
			)
		)
		(property "Description" "Quad Low-Noise JFET-Input Operational Amplifiers, DIP-14/SOIC-14"
			(at 200.66 45.72 0)
			(effects
				(font
					(size 1.27 1.27)
				)
				(hide yes)
			)
		)
		(pin "4"
			(uuid "8ce5a0f1-adeb-4514-be18-134cde36952a")
		)
		(pin "11"
			(uuid "fb44c4ee-19a1-43a0-a6e2-b13d43d79021")
		)
		(pin "14"
			(uuid "efb8ee90-e0e1-43d6-9aa6-1cbef4fd08ad")
		)
		(pin "12"
			(uuid "a4ce3331-e36c-4522-bc67-0d65b71e41cc")
		)
		(pin "2"
			(uuid "ce76ccf5-af03-4a47-9369-e12c3d0082d2")
		)
		(pin "13"
			(uuid "f79289d8-938d-49cc-a082-223b397922e3")
		)
		(pin "6"
			(uuid "49202428-b0ba-4834-b6c0-9102835f4b77")
		)
		(pin "5"
			(uuid "1ed8f570-bdfb-48ed-90e6-0e0b4b9069d5")
		)
		(pin "1"
			(uuid "7708b750-5530-4f42-99e6-7480c07117bd")
		)
		(pin "3"
			(uuid "93ca8eb8-aaa8-4e82-bf30-a0ddea40a128")
		)
		(pin "10"
			(uuid "2b173fb5-97fb-4134-855c-629c369b5ca9")
		)
		(pin "7"
			(uuid "9fb8c832-f8dc-4b20-8fe9-38c96cecc337")
		)
		(pin "9"
			(uuid "554a76be-4973-41b6-96c8-1245f55cafb7")
		)
		(pin "8"
			(uuid "9f7ae766-7045-4b63-943c-898db46be183")
		)
		(instances
			(project ""
				(path "/2d0a5d12-d9ab-431e-bbbb-44aaa454dfb7/16bbe97f-7a9b-45f0-a949-a189e6659edb"
					(reference "U2")
					(unit 5)
				)
				(path "/2d0a5d12-d9ab-431e-bbbb-44aaa454dfb7/3cd5e99a-6b80-4546-9264-9f3a6f357332"
					(reference "U1")
					(unit 5)
				)
			)
		)
	)
	(symbol
		(lib_name "GND_7")
		(lib_id "power:GND")
		(at 109.22 158.75 0)
		(unit 1)
		(exclude_from_sim no)
		(in_bom yes)
		(on_board yes)
		(dnp no)
		(fields_autoplaced yes)
		(uuid "9b0af5ff-04b6-4211-954b-516e9080c547")
		(property "Reference" "#PWR023"
			(at 109.22 165.1 0)
			(effects
				(font
					(size 1.27 1.27)
				)
				(hide yes)
			)
		)
		(property "Value" "GND"
			(at 109.22 163.83 0)
			(effects
				(font
					(size 1.27 1.27)
				)
			)
		)
		(property "Footprint" ""
			(at 109.22 158.75 0)
			(effects
				(font
					(size 1.27 1.27)
				)
				(hide yes)
			)
		)
		(property "Datasheet" ""
			(at 109.22 158.75 0)
			(effects
				(font
					(size 1.27 1.27)
				)
				(hide yes)
			)
		)
		(property "Description" "Power symbol creates a global label with name \"GND\" , ground"
			(at 109.22 158.75 0)
			(effects
				(font
					(size 1.27 1.27)
				)
				(hide yes)
			)
		)
		(pin "1"
			(uuid "d79bd05f-2047-4779-bfa6-7f162121b06f")
		)
		(instances
			(project "pcb_3u"
				(path "/2d0a5d12-d9ab-431e-bbbb-44aaa454dfb7/16bbe97f-7a9b-45f0-a949-a189e6659edb"
					(reference "#PWR023")
					(unit 1)
				)
				(path "/2d0a5d12-d9ab-431e-bbbb-44aaa454dfb7/3cd5e99a-6b80-4546-9264-9f3a6f357332"
					(reference "#PWR014")
					(unit 1)
				)
			)
		)
	)
	(symbol
		(lib_id "Device:R")
		(at 57.15 45.72 180)
		(unit 1)
		(exclude_from_sim no)
		(in_bom yes)
		(on_board yes)
		(dnp no)
		(fields_autoplaced yes)
		(uuid "a86dd2eb-e788-4b4f-9954-fb35b7f48b2b")
		(property "Reference" "R18"
			(at 50.8 45.72 90)
			(effects
				(font
					(size 1.27 1.27)
				)
			)
		)
		(property "Value" "100k(1%)"
			(at 53.34 45.72 90)
			(effects
				(font
					(size 1.27 1.27)
				)
			)
		)
		(property "Footprint" "Resistor_SMD:R_MELF_MMB-0207"
			(at 58.928 45.72 90)
			(effects
				(font
					(size 1.27 1.27)
				)
				(hide yes)
			)
		)
		(property "Datasheet" "https://datasheet.lcsc.com/lcsc/2304140030_RESI-LMERW330F100KQ9L_C720012.pdf"
			(at 57.15 45.72 0)
			(effects
				(font
					(size 1.27 1.27)
				)
				(hide yes)
			)
		)
		(property "Description" "Resistor"
			(at 57.15 45.72 0)
			(effects
				(font
					(size 1.27 1.27)
				)
				(hide yes)
			)
		)
		(property "LCSC" "C720012"
			(at 57.15 45.72 90)
			(effects
				(font
					(size 1.27 1.27)
				)
				(hide yes)
			)
		)
		(pin "1"
			(uuid "fd5d2132-63e9-48ad-b308-75f1ce7193f9")
		)
		(pin "2"
			(uuid "1021c086-a48d-44fd-a489-eff5b73ef885")
		)
		(instances
			(project "pcb_3u"
				(path "/2d0a5d12-d9ab-431e-bbbb-44aaa454dfb7/16bbe97f-7a9b-45f0-a949-a189e6659edb"
					(reference "R18")
					(unit 1)
				)
				(path "/2d0a5d12-d9ab-431e-bbbb-44aaa454dfb7/3cd5e99a-6b80-4546-9264-9f3a6f357332"
					(reference "R5")
					(unit 1)
				)
			)
		)
	)
	(symbol
		(lib_id "Amplifier_Operational:TL074")
		(at 119.38 116.84 0)
		(mirror x)
		(unit 2)
		(exclude_from_sim no)
		(in_bom yes)
		(on_board yes)
		(dnp no)
		(uuid "d0077709-6e6c-4956-8b87-e146c4e00b87")
		(property "Reference" "U2"
			(at 119.38 121.92 0)
			(effects
				(font
					(size 1.27 1.27)
				)
				(justify left)
			)
		)
		(property "Value" "TL074"
			(at 119.38 111.76 0)
			(effects
				(font
					(size 1.27 1.27)
				)
				(justify left)
			)
		)
		(property "Footprint" "Package_SO:SOIC-14_3.9x8.7mm_P1.27mm"
			(at 118.11 119.38 0)
			(effects
				(font
					(size 1.27 1.27)
				)
				(hide yes)
			)
		)
		(property "Datasheet" "http://www.ti.com/lit/ds/symlink/tl071.pdf"
			(at 120.65 121.92 0)
			(effects
				(font
					(size 1.27 1.27)
				)
				(hide yes)
			)
		)
		(property "Description" "Quad Low-Noise JFET-Input Operational Amplifiers, DIP-14/SOIC-14"
			(at 119.38 116.84 0)
			(effects
				(font
					(size 1.27 1.27)
				)
				(hide yes)
			)
		)
		(property "LCSC" "C107644"
			(at 119.38 116.84 0)
			(effects
				(font
					(size 1.27 1.27)
				)
				(hide yes)
			)
		)
		(pin "10"
			(uuid "b1dbd8bd-0476-44b7-ab8b-47cca82c583b")
		)
		(pin "9"
			(uuid "3329ec8b-b81c-4548-a8c8-9bd6cdeea339")
		)
		(pin "14"
			(uuid "e10b23c9-088b-44be-84f6-1191ea649025")
		)
		(pin "13"
			(uuid "2c619efa-7ab1-4f5e-9f19-4a3d8a57db83")
		)
		(pin "8"
			(uuid "59fb827a-1ba7-4ec6-9ea0-d4721121795a")
		)
		(pin "5"
			(uuid "01cffcb6-58b4-4d38-9d8c-80a164e035e7")
		)
		(pin "7"
			(uuid "8f562416-abfb-498e-bbe8-bbba45c45d6c")
		)
		(pin "6"
			(uuid "9859f299-a8dd-4d36-a5da-3914f1849380")
		)
		(pin "12"
			(uuid "33d4a579-4950-48bf-8796-0f68dc50669c")
		)
		(pin "11"
			(uuid "c4890e4d-bd30-4ca5-9597-2be8f6578467")
		)
		(pin "1"
			(uuid "23c7ba26-714c-4c97-a5ab-382c29c49d72")
		)
		(pin "3"
			(uuid "6efa84f7-e5e8-4537-b541-92f2d5909ade")
		)
		(pin "2"
			(uuid "78a035bf-eb30-4f5e-9023-1b9ceb6b765f")
		)
		(pin "4"
			(uuid "09ef9357-3263-42cc-99ae-11c808d6be98")
		)
		(instances
			(project "pcb_3u"
				(path "/2d0a5d12-d9ab-431e-bbbb-44aaa454dfb7/16bbe97f-7a9b-45f0-a949-a189e6659edb"
					(reference "U2")
					(unit 2)
				)
				(path "/2d0a5d12-d9ab-431e-bbbb-44aaa454dfb7/3cd5e99a-6b80-4546-9264-9f3a6f357332"
					(reference "U1")
					(unit 2)
				)
			)
		)
	)
	(symbol
		(lib_id "Device:R")
		(at 119.38 107.95 90)
		(unit 1)
		(exclude_from_sim no)
		(in_bom yes)
		(on_board yes)
		(dnp no)
		(fields_autoplaced yes)
		(uuid "d1410067-b0b9-4c89-8c99-a4f097e88a7b")
		(property "Reference" "R24"
			(at 119.38 101.6 90)
			(effects
				(font
					(size 1.27 1.27)
				)
			)
		)
		(property "Value" "10k(1%)"
			(at 119.38 104.14 90)
			(effects
				(font
					(size 1.27 1.27)
				)
			)
		)
		(property "Footprint" "Resistor_SMD:R_MiniMELF_MMA-0204"
			(at 119.38 109.728 90)
			(effects
				(font
					(size 1.27 1.27)
				)
				(hide yes)
			)
		)
		(property "Datasheet" "https://datasheet.lcsc.com/lcsc/2304140030_Viking-Tech-CSR0204FTDV1002_C316475.pdf"
			(at 119.38 107.95 0)
			(effects
				(font
					(size 1.27 1.27)
				)
				(hide yes)
			)
		)
		(property "Description" "Resistor"
			(at 119.38 107.95 0)
			(effects
				(font
					(size 1.27 1.27)
				)
				(hide yes)
			)
		)
		(property "LCSC" "C316475"
			(at 119.38 107.95 90)
			(effects
				(font
					(size 1.27 1.27)
				)
				(hide yes)
			)
		)
		(pin "1"
			(uuid "43cd85dd-10b2-49f4-b7cc-e1e1bb433baf")
		)
		(pin "2"
			(uuid "e8b24e94-6eac-4325-8d2d-b8dfd7c02fec")
		)
		(instances
			(project "pcb_3u"
				(path "/2d0a5d12-d9ab-431e-bbbb-44aaa454dfb7/16bbe97f-7a9b-45f0-a949-a189e6659edb"
					(reference "R24")
					(unit 1)
				)
				(path "/2d0a5d12-d9ab-431e-bbbb-44aaa454dfb7/3cd5e99a-6b80-4546-9264-9f3a6f357332"
					(reference "R11")
					(unit 1)
				)
			)
		)
	)
	(symbol
		(lib_name "GND_8")
		(lib_id "power:GND")
		(at 109.22 124.46 0)
		(unit 1)
		(exclude_from_sim no)
		(in_bom yes)
		(on_board yes)
		(dnp no)
		(fields_autoplaced yes)
		(uuid "e1fc5873-a911-40b1-8570-0bd355ad5fc6")
		(property "Reference" "#PWR022"
			(at 109.22 130.81 0)
			(effects
				(font
					(size 1.27 1.27)
				)
				(hide yes)
			)
		)
		(property "Value" "GND"
			(at 109.22 129.54 0)
			(effects
				(font
					(size 1.27 1.27)
				)
			)
		)
		(property "Footprint" ""
			(at 109.22 124.46 0)
			(effects
				(font
					(size 1.27 1.27)
				)
				(hide yes)
			)
		)
		(property "Datasheet" ""
			(at 109.22 124.46 0)
			(effects
				(font
					(size 1.27 1.27)
				)
				(hide yes)
			)
		)
		(property "Description" "Power symbol creates a global label with name \"GND\" , ground"
			(at 109.22 124.46 0)
			(effects
				(font
					(size 1.27 1.27)
				)
				(hide yes)
			)
		)
		(pin "1"
			(uuid "8a79c50f-4ff0-4c6a-94ec-38f838a807f2")
		)
		(instances
			(project "pcb_3u"
				(path "/2d0a5d12-d9ab-431e-bbbb-44aaa454dfb7/16bbe97f-7a9b-45f0-a949-a189e6659edb"
					(reference "#PWR022")
					(unit 1)
				)
				(path "/2d0a5d12-d9ab-431e-bbbb-44aaa454dfb7/3cd5e99a-6b80-4546-9264-9f3a6f357332"
					(reference "#PWR013")
					(unit 1)
				)
			)
		)
	)
	(symbol
		(lib_id "Amplifier_Operational:TL074")
		(at 68.58 81.28 0)
		(mirror x)
		(unit 4)
		(exclude_from_sim no)
		(in_bom yes)
		(on_board yes)
		(dnp no)
		(uuid "e4eabd43-f843-4c08-81cf-9ab75858e746")
		(property "Reference" "U2"
			(at 68.58 86.36 0)
			(effects
				(font
					(size 1.27 1.27)
				)
				(justify left)
			)
		)
		(property "Value" "TL074"
			(at 68.58 76.2 0)
			(effects
				(font
					(size 1.27 1.27)
				)
				(justify left)
			)
		)
		(property "Footprint" "Package_SO:SOIC-14_3.9x8.7mm_P1.27mm"
			(at 67.31 83.82 0)
			(effects
				(font
					(size 1.27 1.27)
				)
				(hide yes)
			)
		)
		(property "Datasheet" "http://www.ti.com/lit/ds/symlink/tl071.pdf"
			(at 69.85 86.36 0)
			(effects
				(font
					(size 1.27 1.27)
				)
				(hide yes)
			)
		)
		(property "Description" "Quad Low-Noise JFET-Input Operational Amplifiers, DIP-14/SOIC-14"
			(at 68.58 81.28 0)
			(effects
				(font
					(size 1.27 1.27)
				)
				(hide yes)
			)
		)
		(property "LCSC" "C107644"
			(at 68.58 81.28 0)
			(effects
				(font
					(size 1.27 1.27)
				)
				(hide yes)
			)
		)
		(pin "10"
			(uuid "b1dbd8bd-0476-44b7-ab8b-47cca82c583e")
		)
		(pin "9"
			(uuid "3329ec8b-b81c-4548-a8c8-9bd6cdeea33c")
		)
		(pin "14"
			(uuid "fdc0fa99-162e-4f15-ad5f-9d1ba8fc4870")
		)
		(pin "13"
			(uuid "7eb04185-e489-402d-b633-9ef504b60c24")
		)
		(pin "8"
			(uuid "59fb827a-1ba7-4ec6-9ea0-d4721121795d")
		)
		(pin "5"
			(uuid "1c4ebc42-7513-4796-b27d-b77b339029d7")
		)
		(pin "7"
			(uuid "3d60ff66-5492-4d38-afc9-be4aef02dc64")
		)
		(pin "6"
			(uuid "fef28174-f798-4958-a3d7-ea6eb45957e4")
		)
		(pin "12"
			(uuid "6c1e4ab1-6de6-4fce-b95c-3ea96ca23e1f")
		)
		(pin "11"
			(uuid "c4890e4d-bd30-4ca5-9597-2be8f657846a")
		)
		(pin "1"
			(uuid "23c7ba26-714c-4c97-a5ab-382c29c49d75")
		)
		(pin "3"
			(uuid "6efa84f7-e5e8-4537-b541-92f2d5909ae1")
		)
		(pin "2"
			(uuid "78a035bf-eb30-4f5e-9023-1b9ceb6b7662")
		)
		(pin "4"
			(uuid "09ef9357-3263-42cc-99ae-11c808d6be9b")
		)
		(instances
			(project "pcb_3u"
				(path "/2d0a5d12-d9ab-431e-bbbb-44aaa454dfb7/16bbe97f-7a9b-45f0-a949-a189e6659edb"
					(reference "U2")
					(unit 4)
				)
				(path "/2d0a5d12-d9ab-431e-bbbb-44aaa454dfb7/3cd5e99a-6b80-4546-9264-9f3a6f357332"
					(reference "U1")
					(unit 4)
				)
			)
		)
	)
	(symbol
		(lib_id "Device:R")
		(at 97.79 114.3 90)
		(unit 1)
		(exclude_from_sim no)
		(in_bom yes)
		(on_board yes)
		(dnp no)
		(fields_autoplaced yes)
		(uuid "ed723619-def5-4530-bd89-7d171e443310")
		(property "Reference" "R21"
			(at 97.79 107.95 90)
			(effects
				(font
					(size 1.27 1.27)
				)
			)
		)
		(property "Value" "10k(1%)"
			(at 97.79 110.49 90)
			(effects
				(font
					(size 1.27 1.27)
				)
			)
		)
		(property "Footprint" "Resistor_SMD:R_MiniMELF_MMA-0204"
			(at 97.79 116.078 90)
			(effects
				(font
					(size 1.27 1.27)
				)
				(hide yes)
			)
		)
		(property "Datasheet" "https://datasheet.lcsc.com/lcsc/2304140030_Viking-Tech-CSR0204FTDV1002_C316475.pdf"
			(at 97.79 114.3 0)
			(effects
				(font
					(size 1.27 1.27)
				)
				(hide yes)
			)
		)
		(property "Description" "Resistor"
			(at 97.79 114.3 0)
			(effects
				(font
					(size 1.27 1.27)
				)
				(hide yes)
			)
		)
		(property "LCSC" "C316475"
			(at 97.79 114.3 90)
			(effects
				(font
					(size 1.27 1.27)
				)
				(hide yes)
			)
		)
		(pin "1"
			(uuid "96c0a459-69a9-4089-ab69-7191241de8fd")
		)
		(pin "2"
			(uuid "8754cee6-74da-4bd8-9a4b-257a8f88acd8")
		)
		(instances
			(project "pcb_3u"
				(path "/2d0a5d12-d9ab-431e-bbbb-44aaa454dfb7/16bbe97f-7a9b-45f0-a949-a189e6659edb"
					(reference "R21")
					(unit 1)
				)
				(path "/2d0a5d12-d9ab-431e-bbbb-44aaa454dfb7/3cd5e99a-6b80-4546-9264-9f3a6f357332"
					(reference "R8")
					(unit 1)
				)
			)
		)
	)
	(symbol
		(lib_id "Device:C")
		(at 68.58 67.31 90)
		(unit 1)
		(exclude_from_sim no)
		(in_bom yes)
		(on_board yes)
		(dnp no)
		(fields_autoplaced yes)
		(uuid "ef5f4b9b-7b62-41ec-b195-0cc6df7327b2")
		(property "Reference" "C8"
			(at 68.58 59.69 90)
			(effects
				(font
					(size 1.27 1.27)
				)
			)
		)
		(property "Value" "10p"
			(at 68.58 62.23 90)
			(effects
				(font
					(size 1.27 1.27)
				)
			)
		)
		(property "Footprint" "Capacitor_SMD:C_0603_1608Metric"
			(at 72.39 66.3448 0)
			(effects
				(font
					(size 1.27 1.27)
				)
				(hide yes)
			)
		)
		(property "Datasheet" "https://datasheet.lcsc.com/lcsc/2304140030_Walsin-Tech-Corp-0603N100F500CT_C458889.pdf"
			(at 68.58 67.31 0)
			(effects
				(font
					(size 1.27 1.27)
				)
				(hide yes)
			)
		)
		(property "Description" "Unpolarized capacitor"
			(at 68.58 67.31 0)
			(effects
				(font
					(size 1.27 1.27)
				)
				(hide yes)
			)
		)
		(property "LCSC" "C458889"
			(at 68.58 67.31 90)
			(effects
				(font
					(size 1.27 1.27)
				)
				(hide yes)
			)
		)
		(pin "2"
			(uuid "51263e31-69ea-459b-9954-70097cb1c993")
		)
		(pin "1"
			(uuid "eae3202f-0c9b-48e0-878f-94a1aa06204a")
		)
		(instances
			(project "pcb_3u"
				(path "/2d0a5d12-d9ab-431e-bbbb-44aaa454dfb7/16bbe97f-7a9b-45f0-a949-a189e6659edb"
					(reference "C8")
					(unit 1)
				)
				(path "/2d0a5d12-d9ab-431e-bbbb-44aaa454dfb7/3cd5e99a-6b80-4546-9264-9f3a6f357332"
					(reference "C7")
					(unit 1)
				)
			)
		)
	)
	(symbol
		(lib_id "Amplifier_Operational:TL074")
		(at 119.38 151.13 0)
		(mirror x)
		(unit 3)
		(exclude_from_sim no)
		(in_bom yes)
		(on_board yes)
		(dnp no)
		(uuid "fd918a75-cc29-4427-84e8-a98dce7642d4")
		(property "Reference" "U2"
			(at 119.38 156.21 0)
			(effects
				(font
					(size 1.27 1.27)
				)
				(justify left)
			)
		)
		(property "Value" "TL074"
			(at 119.38 146.05 0)
			(effects
				(font
					(size 1.27 1.27)
				)
				(justify left)
			)
		)
		(property "Footprint" "Package_SO:SOIC-14_3.9x8.7mm_P1.27mm"
			(at 118.11 153.67 0)
			(effects
				(font
					(size 1.27 1.27)
				)
				(hide yes)
			)
		)
		(property "Datasheet" "http://www.ti.com/lit/ds/symlink/tl071.pdf"
			(at 120.65 156.21 0)
			(effects
				(font
					(size 1.27 1.27)
				)
				(hide yes)
			)
		)
		(property "Description" "Quad Low-Noise JFET-Input Operational Amplifiers, DIP-14/SOIC-14"
			(at 119.38 151.13 0)
			(effects
				(font
					(size 1.27 1.27)
				)
				(hide yes)
			)
		)
		(property "LCSC" "C107644"
			(at 119.38 151.13 0)
			(effects
				(font
					(size 1.27 1.27)
				)
				(hide yes)
			)
		)
		(pin "10"
			(uuid "6b9eba4b-e089-44c8-931e-e1303672b8a3")
		)
		(pin "9"
			(uuid "7cdfb1a7-7692-4dcc-b80f-d6ea197009ce")
		)
		(pin "14"
			(uuid "e10b23c9-088b-44be-84f6-1191ea649026")
		)
		(pin "13"
			(uuid "2c619efa-7ab1-4f5e-9f19-4a3d8a57db84")
		)
		(pin "8"
			(uuid "d64f8aa4-6ad3-45e0-b72b-63d682b37e7c")
		)
		(pin "5"
			(uuid "1c4ebc42-7513-4796-b27d-b77b339029d5")
		)
		(pin "7"
			(uuid "3d60ff66-5492-4d38-afc9-be4aef02dc62")
		)
		(pin "6"
			(uuid "fef28174-f798-4958-a3d7-ea6eb45957e2")
		)
		(pin "12"
			(uuid "33d4a579-4950-48bf-8796-0f68dc50669d")
		)
		(pin "11"
			(uuid "c4890e4d-bd30-4ca5-9597-2be8f6578468")
		)
		(pin "1"
			(uuid "23c7ba26-714c-4c97-a5ab-382c29c49d73")
		)
		(pin "3"
			(uuid "6efa84f7-e5e8-4537-b541-92f2d5909adf")
		)
		(pin "2"
			(uuid "78a035bf-eb30-4f5e-9023-1b9ceb6b7660")
		)
		(pin "4"
			(uuid "09ef9357-3263-42cc-99ae-11c808d6be99")
		)
		(instances
			(project "pcb_3u"
				(path "/2d0a5d12-d9ab-431e-bbbb-44aaa454dfb7/16bbe97f-7a9b-45f0-a949-a189e6659edb"
					(reference "U2")
					(unit 3)
				)
				(path "/2d0a5d12-d9ab-431e-bbbb-44aaa454dfb7/3cd5e99a-6b80-4546-9264-9f3a6f357332"
					(reference "U1")
					(unit 3)
				)
			)
		)
	)
)
