999
"DXF R12 Output" (www.mydxf.blogspot.com)
 0 
SECTION
 2 
HEADER
 9 
$ACADVER
 1 
AC1009
 9 
$EXTMIN
 10 
 0 
 20 
 0 
 9 
$EXTMAX
 10 
 8.5 
 20 
 11 
 0 
ENDSEC
 0 
SECTION
 2 
ENTITIES
0
LINE
8
EuroPanel
10
40.175200
20
172.761000
11
151.575200
21
172.761000
0
LINE
8
EuroPanel
10
151.575200
20
172.761000
11
151.575200
21
133.111000
0
LINE
8
EuroPanel
10
151.575200
20
133.111000
11
40.175200
21
133.111000
0
LINE
8
EuroPanel
10
40.175200
20
133.111000
11
40.175200
21
172.761000
0
LINE
8
EuroPanel
10
46.525200
20
137.711000
11
48.825200
21
137.711000
0
LINE
8
EuroPanel
10
48.825200
20
137.711000
11
49.437493
21
137.589207
0
LINE
8
EuroPanel
10
49.437493
20
137.589207
11
49.956571
21
137.242371
0
LINE
8
EuroPanel
10
49.956571
20
137.242371
11
50.303407
21
136.723293
0
LINE
8
EuroPanel
10
50.303407
20
136.723293
11
50.425200
21
136.111000
0
LINE
8
EuroPanel
10
50.425200
20
136.111000
11
50.425200
21
136.111000
0
LINE
8
EuroPanel
10
50.425200
20
136.111000
11
50.303407
21
135.498707
0
LINE
8
EuroPanel
10
50.303407
20
135.498707
11
49.956571
21
134.979629
0
LINE
8
EuroPanel
10
49.956571
20
134.979629
11
49.437493
21
134.632793
0
LINE
8
EuroPanel
10
49.437493
20
134.632793
11
48.825200
21
134.511000
0
LINE
8
EuroPanel
10
48.825200
20
134.511000
11
46.525200
21
134.511000
0
LINE
8
EuroPanel
10
46.525200
20
134.511000
11
45.912907
21
134.632793
0
LINE
8
EuroPanel
10
45.912907
20
134.632793
11
45.393829
21
134.979629
0
LINE
8
EuroPanel
10
45.393829
20
134.979629
11
45.046993
21
135.498707
0
LINE
8
EuroPanel
10
45.046993
20
135.498707
11
44.925200
21
136.111000
0
LINE
8
EuroPanel
10
44.925200
20
136.111000
11
44.925200
21
136.111000
0
LINE
8
EuroPanel
10
44.925200
20
136.111000
11
45.046993
21
136.723293
0
LINE
8
EuroPanel
10
45.046993
20
136.723293
11
45.393829
21
137.242371
0
LINE
8
EuroPanel
10
45.393829
20
137.242371
11
45.912907
21
137.589207
0
LINE
8
EuroPanel
10
45.912907
20
137.589207
11
46.525200
21
137.711000
0
LINE
8
EuroPanel
10
46.525200
20
137.711000
11
46.525200
21
137.711000
0
LINE
8
EuroPanel
10
46.525200
20
171.361000
11
48.825200
21
171.361000
0
LINE
8
EuroPanel
10
48.825200
20
171.361000
11
49.437493
21
171.239207
0
LINE
8
EuroPanel
10
49.437493
20
171.239207
11
49.956571
21
170.892371
0
LINE
8
EuroPanel
10
49.956571
20
170.892371
11
50.303407
21
170.373293
0
LINE
8
EuroPanel
10
50.303407
20
170.373293
11
50.425200
21
169.761000
0
LINE
8
EuroPanel
10
50.425200
20
169.761000
11
50.425200
21
169.761000
0
LINE
8
EuroPanel
10
50.425200
20
169.761000
11
50.303407
21
169.148707
0
LINE
8
EuroPanel
10
50.303407
20
169.148707
11
49.956571
21
168.629629
0
LINE
8
EuroPanel
10
49.956571
20
168.629629
11
49.437493
21
168.282793
0
LINE
8
EuroPanel
10
49.437493
20
168.282793
11
48.825200
21
168.161000
0
LINE
8
EuroPanel
10
48.825200
20
168.161000
11
46.525200
21
168.161000
0
LINE
8
EuroPanel
10
46.525200
20
168.161000
11
45.912907
21
168.282793
0
LINE
8
EuroPanel
10
45.912907
20
168.282793
11
45.393829
21
168.629629
0
LINE
8
EuroPanel
10
45.393829
20
168.629629
11
45.046993
21
169.148707
0
LINE
8
EuroPanel
10
45.046993
20
169.148707
11
44.925200
21
169.761000
0
LINE
8
EuroPanel
10
44.925200
20
169.761000
11
44.925200
21
169.761000
0
LINE
8
EuroPanel
10
44.925200
20
169.761000
11
45.046993
21
170.373293
0
LINE
8
EuroPanel
10
45.046993
20
170.373293
11
45.393829
21
170.892371
0
LINE
8
EuroPanel
10
45.393829
20
170.892371
11
45.912907
21
171.239207
0
LINE
8
EuroPanel
10
45.912907
20
171.239207
11
46.525200
21
171.361000
0
LINE
8
EuroPanel
10
46.525200
20
171.361000
11
46.525200
21
171.361000
0
LINE
8
EuroPanel
10
143.045200
20
137.711000
11
145.345200
21
137.711000
0
LINE
8
EuroPanel
10
145.345200
20
137.711000
11
145.957493
21
137.589207
0
LINE
8
EuroPanel
10
145.957493
20
137.589207
11
146.476571
21
137.242371
0
LINE
8
EuroPanel
10
146.476571
20
137.242371
11
146.823407
21
136.723293
0
LINE
8
EuroPanel
10
146.823407
20
136.723293
11
146.945200
21
136.111000
0
LINE
8
EuroPanel
10
146.945200
20
136.111000
11
146.945200
21
136.111000
0
LINE
8
EuroPanel
10
146.945200
20
136.111000
11
146.823407
21
135.498707
0
LINE
8
EuroPanel
10
146.823407
20
135.498707
11
146.476571
21
134.979629
0
LINE
8
EuroPanel
10
146.476571
20
134.979629
11
145.957493
21
134.632793
0
LINE
8
EuroPanel
10
145.957493
20
134.632793
11
145.345200
21
134.511000
0
LINE
8
EuroPanel
10
145.345200
20
134.511000
11
143.045200
21
134.511000
0
LINE
8
EuroPanel
10
143.045200
20
134.511000
11
142.432907
21
134.632793
0
LINE
8
EuroPanel
10
142.432907
20
134.632793
11
141.913829
21
134.979629
0
LINE
8
EuroPanel
10
141.913829
20
134.979629
11
141.566993
21
135.498707
0
LINE
8
EuroPanel
10
141.566993
20
135.498707
11
141.445200
21
136.111000
0
LINE
8
EuroPanel
10
141.445200
20
136.111000
11
141.445200
21
136.111000
0
LINE
8
EuroPanel
10
141.445200
20
136.111000
11
141.566993
21
136.723293
0
LINE
8
EuroPanel
10
141.566993
20
136.723293
11
141.913829
21
137.242371
0
LINE
8
EuroPanel
10
141.913829
20
137.242371
11
142.432907
21
137.589207
0
LINE
8
EuroPanel
10
142.432907
20
137.589207
11
143.045200
21
137.711000
0
LINE
8
EuroPanel
10
143.045200
20
137.711000
11
143.045200
21
137.711000
0
LINE
8
EuroPanel
10
143.045200
20
171.361000
11
145.345200
21
171.361000
0
LINE
8
EuroPanel
10
145.345200
20
171.361000
11
145.957493
21
171.239207
0
LINE
8
EuroPanel
10
145.957493
20
171.239207
11
146.476571
21
170.892371
0
LINE
8
EuroPanel
10
146.476571
20
170.892371
11
146.823407
21
170.373293
0
LINE
8
EuroPanel
10
146.823407
20
170.373293
11
146.945200
21
169.761000
0
LINE
8
EuroPanel
10
146.945200
20
169.761000
11
146.945200
21
169.761000
0
LINE
8
EuroPanel
10
146.945200
20
169.761000
11
146.823407
21
169.148707
0
LINE
8
EuroPanel
10
146.823407
20
169.148707
11
146.476571
21
168.629629
0
LINE
8
EuroPanel
10
146.476571
20
168.629629
11
145.957493
21
168.282793
0
LINE
8
EuroPanel
10
145.957493
20
168.282793
11
145.345200
21
168.161000
0
LINE
8
EuroPanel
10
145.345200
20
168.161000
11
143.045200
21
168.161000
0
LINE
8
EuroPanel
10
143.045200
20
168.161000
11
142.432907
21
168.282793
0
LINE
8
EuroPanel
10
142.432907
20
168.282793
11
141.913829
21
168.629629
0
LINE
8
EuroPanel
10
141.913829
20
168.629629
11
141.566993
21
169.148707
0
LINE
8
EuroPanel
10
141.566993
20
169.148707
11
141.445200
21
169.761000
0
LINE
8
EuroPanel
10
141.445200
20
169.761000
11
141.445200
21
169.761000
0
LINE
8
EuroPanel
10
141.445200
20
169.761000
11
141.566993
21
170.373293
0
LINE
8
EuroPanel
10
141.566993
20
170.373293
11
141.913829
21
170.892371
0
LINE
8
EuroPanel
10
141.913829
20
170.892371
11
142.432907
21
171.239207
0
LINE
8
EuroPanel
10
142.432907
20
171.239207
11
143.045200
21
171.361000
0
LINE
8
EuroPanel
10
143.045200
20
171.361000
11
143.045200
21
171.361000
 0 
ENDSEC
 0 
EOF