999
"DXF R12 Output" (www.mydxf.blogspot.com)
 0 
SECTION
 2 
HEADER
 9 
$ACADVER
 1 
AC1009
 9 
$EXTMIN
 10 
 0 
 20 
 0 
 9 
$EXTMAX
 10 
 8.5 
 20 
 11 
 0 
ENDSEC
 0 
SECTION
 2 
ENTITIES
0
LINE
8
EuroPanel
10
42.454700
20
240.106000
11
133.754700
21
240.106000
0
LINE
8
EuroPanel
10
133.754700
20
240.106000
11
133.754700
21
111.606000
0
LINE
8
EuroPanel
10
133.754700
20
111.606000
11
42.454700
21
111.606000
0
LINE
8
EuroPanel
10
42.454700
20
111.606000
11
42.454700
21
240.106000
0
LINE
8
EuroPanel
10
48.804700
20
116.206000
11
51.104700
21
116.206000
0
LINE
8
EuroPanel
10
51.104700
20
116.206000
11
51.716993
21
116.084207
0
LINE
8
EuroPanel
10
51.716993
20
116.084207
11
52.236071
21
115.737371
0
LINE
8
EuroPanel
10
52.236071
20
115.737371
11
52.582907
21
115.218293
0
LINE
8
EuroPanel
10
52.582907
20
115.218293
11
52.704700
21
114.606000
0
LINE
8
EuroPanel
10
52.704700
20
114.606000
11
52.704700
21
114.606000
0
LINE
8
EuroPanel
10
52.704700
20
114.606000
11
52.582907
21
113.993707
0
LINE
8
EuroPanel
10
52.582907
20
113.993707
11
52.236071
21
113.474629
0
LINE
8
EuroPanel
10
52.236071
20
113.474629
11
51.716993
21
113.127793
0
LINE
8
EuroPanel
10
51.716993
20
113.127793
11
51.104700
21
113.006000
0
LINE
8
EuroPanel
10
51.104700
20
113.006000
11
48.804700
21
113.006000
0
LINE
8
EuroPanel
10
48.804700
20
113.006000
11
48.192407
21
113.127793
0
LINE
8
EuroPanel
10
48.192407
20
113.127793
11
47.673329
21
113.474629
0
LINE
8
EuroPanel
10
47.673329
20
113.474629
11
47.326493
21
113.993707
0
LINE
8
EuroPanel
10
47.326493
20
113.993707
11
47.204700
21
114.606000
0
LINE
8
EuroPanel
10
47.204700
20
114.606000
11
47.204700
21
114.606000
0
LINE
8
EuroPanel
10
47.204700
20
114.606000
11
47.326493
21
115.218293
0
LINE
8
EuroPanel
10
47.326493
20
115.218293
11
47.673329
21
115.737371
0
LINE
8
EuroPanel
10
47.673329
20
115.737371
11
48.192407
21
116.084207
0
LINE
8
EuroPanel
10
48.192407
20
116.084207
11
48.804700
21
116.206000
0
LINE
8
EuroPanel
10
48.804700
20
116.206000
11
48.804700
21
116.206000
0
LINE
8
EuroPanel
10
48.804700
20
238.706000
11
51.104700
21
238.706000
0
LINE
8
EuroPanel
10
51.104700
20
238.706000
11
51.716993
21
238.584207
0
LINE
8
EuroPanel
10
51.716993
20
238.584207
11
52.236071
21
238.237371
0
LINE
8
EuroPanel
10
52.236071
20
238.237371
11
52.582907
21
237.718293
0
LINE
8
EuroPanel
10
52.582907
20
237.718293
11
52.704700
21
237.106000
0
LINE
8
EuroPanel
10
52.704700
20
237.106000
11
52.704700
21
237.106000
0
LINE
8
EuroPanel
10
52.704700
20
237.106000
11
52.582907
21
236.493707
0
LINE
8
EuroPanel
10
52.582907
20
236.493707
11
52.236071
21
235.974629
0
LINE
8
EuroPanel
10
52.236071
20
235.974629
11
51.716993
21
235.627793
0
LINE
8
EuroPanel
10
51.716993
20
235.627793
11
51.104700
21
235.506000
0
LINE
8
EuroPanel
10
51.104700
20
235.506000
11
48.804700
21
235.506000
0
LINE
8
EuroPanel
10
48.804700
20
235.506000
11
48.192407
21
235.627793
0
LINE
8
EuroPanel
10
48.192407
20
235.627793
11
47.673329
21
235.974629
0
LINE
8
EuroPanel
10
47.673329
20
235.974629
11
47.326493
21
236.493707
0
LINE
8
EuroPanel
10
47.326493
20
236.493707
11
47.204700
21
237.106000
0
LINE
8
EuroPanel
10
47.204700
20
237.106000
11
47.204700
21
237.106000
0
LINE
8
EuroPanel
10
47.204700
20
237.106000
11
47.326493
21
237.718293
0
LINE
8
EuroPanel
10
47.326493
20
237.718293
11
47.673329
21
238.237371
0
LINE
8
EuroPanel
10
47.673329
20
238.237371
11
48.192407
21
238.584207
0
LINE
8
EuroPanel
10
48.192407
20
238.584207
11
48.804700
21
238.706000
0
LINE
8
EuroPanel
10
48.804700
20
238.706000
11
48.804700
21
238.706000
0
LINE
8
EuroPanel
10
125.004700
20
116.206000
11
127.304700
21
116.206000
0
LINE
8
EuroPanel
10
127.304700
20
116.206000
11
127.916993
21
116.084207
0
LINE
8
EuroPanel
10
127.916993
20
116.084207
11
128.436071
21
115.737371
0
LINE
8
EuroPanel
10
128.436071
20
115.737371
11
128.782907
21
115.218293
0
LINE
8
EuroPanel
10
128.782907
20
115.218293
11
128.904700
21
114.606000
0
LINE
8
EuroPanel
10
128.904700
20
114.606000
11
128.904700
21
114.606000
0
LINE
8
EuroPanel
10
128.904700
20
114.606000
11
128.782907
21
113.993707
0
LINE
8
EuroPanel
10
128.782907
20
113.993707
11
128.436071
21
113.474629
0
LINE
8
EuroPanel
10
128.436071
20
113.474629
11
127.916993
21
113.127793
0
LINE
8
EuroPanel
10
127.916993
20
113.127793
11
127.304700
21
113.006000
0
LINE
8
EuroPanel
10
127.304700
20
113.006000
11
125.004700
21
113.006000
0
LINE
8
EuroPanel
10
125.004700
20
113.006000
11
124.392407
21
113.127793
0
LINE
8
EuroPanel
10
124.392407
20
113.127793
11
123.873329
21
113.474629
0
LINE
8
EuroPanel
10
123.873329
20
113.474629
11
123.526493
21
113.993707
0
LINE
8
EuroPanel
10
123.526493
20
113.993707
11
123.404700
21
114.606000
0
LINE
8
EuroPanel
10
123.404700
20
114.606000
11
123.404700
21
114.606000
0
LINE
8
EuroPanel
10
123.404700
20
114.606000
11
123.526493
21
115.218293
0
LINE
8
EuroPanel
10
123.526493
20
115.218293
11
123.873329
21
115.737371
0
LINE
8
EuroPanel
10
123.873329
20
115.737371
11
124.392407
21
116.084207
0
LINE
8
EuroPanel
10
124.392407
20
116.084207
11
125.004700
21
116.206000
0
LINE
8
EuroPanel
10
125.004700
20
116.206000
11
125.004700
21
116.206000
0
LINE
8
EuroPanel
10
125.004700
20
238.706000
11
127.304700
21
238.706000
0
LINE
8
EuroPanel
10
127.304700
20
238.706000
11
127.916993
21
238.584207
0
LINE
8
EuroPanel
10
127.916993
20
238.584207
11
128.436071
21
238.237371
0
LINE
8
EuroPanel
10
128.436071
20
238.237371
11
128.782907
21
237.718293
0
LINE
8
EuroPanel
10
128.782907
20
237.718293
11
128.904700
21
237.106000
0
LINE
8
EuroPanel
10
128.904700
20
237.106000
11
128.904700
21
237.106000
0
LINE
8
EuroPanel
10
128.904700
20
237.106000
11
128.782907
21
236.493707
0
LINE
8
EuroPanel
10
128.782907
20
236.493707
11
128.436071
21
235.974629
0
LINE
8
EuroPanel
10
128.436071
20
235.974629
11
127.916993
21
235.627793
0
LINE
8
EuroPanel
10
127.916993
20
235.627793
11
127.304700
21
235.506000
0
LINE
8
EuroPanel
10
127.304700
20
235.506000
11
125.004700
21
235.506000
0
LINE
8
EuroPanel
10
125.004700
20
235.506000
11
124.392407
21
235.627793
0
LINE
8
EuroPanel
10
124.392407
20
235.627793
11
123.873329
21
235.974629
0
LINE
8
EuroPanel
10
123.873329
20
235.974629
11
123.526493
21
236.493707
0
LINE
8
EuroPanel
10
123.526493
20
236.493707
11
123.404700
21
237.106000
0
LINE
8
EuroPanel
10
123.404700
20
237.106000
11
123.404700
21
237.106000
0
LINE
8
EuroPanel
10
123.404700
20
237.106000
11
123.526493
21
237.718293
0
LINE
8
EuroPanel
10
123.526493
20
237.718293
11
123.873329
21
238.237371
0
LINE
8
EuroPanel
10
123.873329
20
238.237371
11
124.392407
21
238.584207
0
LINE
8
EuroPanel
10
124.392407
20
238.584207
11
125.004700
21
238.706000
0
LINE
8
EuroPanel
10
125.004700
20
238.706000
11
125.004700
21
238.706000
 0 
ENDSEC
 0 
EOF