(kicad_sch
	(version 20231120)
	(generator "eeschema")
	(generator_version "8.0")
	(uuid "2d0a5d12-d9ab-431e-bbbb-44aaa454dfb7")
	(paper "A4")
	(lib_symbols)
	(sheet_instances
		(path "/"
			(page "1")
		)
	)
)