999
"DXF R12 Output" (www.mydxf.blogspot.com)
 0 
SECTION
 2 
HEADER
 9 
$ACADVER
 1 
AC1009
 9 
$EXTMIN
 10 
 0 
 20 
 0 
 9 
$EXTMAX
 10 
 8.5 
 20 
 11 
 0 
ENDSEC
 0 
SECTION
 2 
ENTITIES
0
LINE
8
EuroPanel
10
67.954700
20
240.106000
11
108.254700
21
240.106000
0
LINE
8
EuroPanel
10
108.254700
20
240.106000
11
108.254700
21
111.606000
0
LINE
8
EuroPanel
10
108.254700
20
111.606000
11
67.954700
21
111.606000
0
LINE
8
EuroPanel
10
67.954700
20
111.606000
11
67.954700
21
240.106000
0
LINE
8
EuroPanel
10
74.304700
20
116.206000
11
76.604700
21
116.206000
0
LINE
8
EuroPanel
10
76.604700
20
116.206000
11
77.216993
21
116.084207
0
LINE
8
EuroPanel
10
77.216993
20
116.084207
11
77.736071
21
115.737371
0
LINE
8
EuroPanel
10
77.736071
20
115.737371
11
78.082907
21
115.218293
0
LINE
8
EuroPanel
10
78.082907
20
115.218293
11
78.204700
21
114.606000
0
LINE
8
EuroPanel
10
78.204700
20
114.606000
11
78.204700
21
114.606000
0
LINE
8
EuroPanel
10
78.204700
20
114.606000
11
78.082907
21
113.993707
0
LINE
8
EuroPanel
10
78.082907
20
113.993707
11
77.736071
21
113.474629
0
LINE
8
EuroPanel
10
77.736071
20
113.474629
11
77.216993
21
113.127793
0
LINE
8
EuroPanel
10
77.216993
20
113.127793
11
76.604700
21
113.006000
0
LINE
8
EuroPanel
10
76.604700
20
113.006000
11
74.304700
21
113.006000
0
LINE
8
EuroPanel
10
74.304700
20
113.006000
11
73.692407
21
113.127793
0
LINE
8
EuroPanel
10
73.692407
20
113.127793
11
73.173329
21
113.474629
0
LINE
8
EuroPanel
10
73.173329
20
113.474629
11
72.826493
21
113.993707
0
LINE
8
EuroPanel
10
72.826493
20
113.993707
11
72.704700
21
114.606000
0
LINE
8
EuroPanel
10
72.704700
20
114.606000
11
72.704700
21
114.606000
0
LINE
8
EuroPanel
10
72.704700
20
114.606000
11
72.826493
21
115.218293
0
LINE
8
EuroPanel
10
72.826493
20
115.218293
11
73.173329
21
115.737371
0
LINE
8
EuroPanel
10
73.173329
20
115.737371
11
73.692407
21
116.084207
0
LINE
8
EuroPanel
10
73.692407
20
116.084207
11
74.304700
21
116.206000
0
LINE
8
EuroPanel
10
74.304700
20
116.206000
11
74.304700
21
116.206000
0
LINE
8
EuroPanel
10
74.304700
20
238.706000
11
76.604700
21
238.706000
0
LINE
8
EuroPanel
10
76.604700
20
238.706000
11
77.216993
21
238.584207
0
LINE
8
EuroPanel
10
77.216993
20
238.584207
11
77.736071
21
238.237371
0
LINE
8
EuroPanel
10
77.736071
20
238.237371
11
78.082907
21
237.718293
0
LINE
8
EuroPanel
10
78.082907
20
237.718293
11
78.204700
21
237.106000
0
LINE
8
EuroPanel
10
78.204700
20
237.106000
11
78.204700
21
237.106000
0
LINE
8
EuroPanel
10
78.204700
20
237.106000
11
78.082907
21
236.493707
0
LINE
8
EuroPanel
10
78.082907
20
236.493707
11
77.736071
21
235.974629
0
LINE
8
EuroPanel
10
77.736071
20
235.974629
11
77.216993
21
235.627793
0
LINE
8
EuroPanel
10
77.216993
20
235.627793
11
76.604700
21
235.506000
0
LINE
8
EuroPanel
10
76.604700
20
235.506000
11
74.304700
21
235.506000
0
LINE
8
EuroPanel
10
74.304700
20
235.506000
11
73.692407
21
235.627793
0
LINE
8
EuroPanel
10
73.692407
20
235.627793
11
73.173329
21
235.974629
0
LINE
8
EuroPanel
10
73.173329
20
235.974629
11
72.826493
21
236.493707
0
LINE
8
EuroPanel
10
72.826493
20
236.493707
11
72.704700
21
237.106000
0
LINE
8
EuroPanel
10
72.704700
20
237.106000
11
72.704700
21
237.106000
0
LINE
8
EuroPanel
10
72.704700
20
237.106000
11
72.826493
21
237.718293
0
LINE
8
EuroPanel
10
72.826493
20
237.718293
11
73.173329
21
238.237371
0
LINE
8
EuroPanel
10
73.173329
20
238.237371
11
73.692407
21
238.584207
0
LINE
8
EuroPanel
10
73.692407
20
238.584207
11
74.304700
21
238.706000
0
LINE
8
EuroPanel
10
74.304700
20
238.706000
11
74.304700
21
238.706000
0
LINE
8
EuroPanel
10
99.704700
20
116.206000
11
102.004700
21
116.206000
0
LINE
8
EuroPanel
10
102.004700
20
116.206000
11
102.616993
21
116.084207
0
LINE
8
EuroPanel
10
102.616993
20
116.084207
11
103.136071
21
115.737371
0
LINE
8
EuroPanel
10
103.136071
20
115.737371
11
103.482907
21
115.218293
0
LINE
8
EuroPanel
10
103.482907
20
115.218293
11
103.604700
21
114.606000
0
LINE
8
EuroPanel
10
103.604700
20
114.606000
11
103.604700
21
114.606000
0
LINE
8
EuroPanel
10
103.604700
20
114.606000
11
103.482907
21
113.993707
0
LINE
8
EuroPanel
10
103.482907
20
113.993707
11
103.136071
21
113.474629
0
LINE
8
EuroPanel
10
103.136071
20
113.474629
11
102.616993
21
113.127793
0
LINE
8
EuroPanel
10
102.616993
20
113.127793
11
102.004700
21
113.006000
0
LINE
8
EuroPanel
10
102.004700
20
113.006000
11
99.704700
21
113.006000
0
LINE
8
EuroPanel
10
99.704700
20
113.006000
11
99.092407
21
113.127793
0
LINE
8
EuroPanel
10
99.092407
20
113.127793
11
98.573329
21
113.474629
0
LINE
8
EuroPanel
10
98.573329
20
113.474629
11
98.226493
21
113.993707
0
LINE
8
EuroPanel
10
98.226493
20
113.993707
11
98.104700
21
114.606000
0
LINE
8
EuroPanel
10
98.104700
20
114.606000
11
98.104700
21
114.606000
0
LINE
8
EuroPanel
10
98.104700
20
114.606000
11
98.226493
21
115.218293
0
LINE
8
EuroPanel
10
98.226493
20
115.218293
11
98.573329
21
115.737371
0
LINE
8
EuroPanel
10
98.573329
20
115.737371
11
99.092407
21
116.084207
0
LINE
8
EuroPanel
10
99.092407
20
116.084207
11
99.704700
21
116.206000
0
LINE
8
EuroPanel
10
99.704700
20
116.206000
11
99.704700
21
116.206000
0
LINE
8
EuroPanel
10
99.704700
20
238.706000
11
102.004700
21
238.706000
0
LINE
8
EuroPanel
10
102.004700
20
238.706000
11
102.616993
21
238.584207
0
LINE
8
EuroPanel
10
102.616993
20
238.584207
11
103.136071
21
238.237371
0
LINE
8
EuroPanel
10
103.136071
20
238.237371
11
103.482907
21
237.718293
0
LINE
8
EuroPanel
10
103.482907
20
237.718293
11
103.604700
21
237.106000
0
LINE
8
EuroPanel
10
103.604700
20
237.106000
11
103.604700
21
237.106000
0
LINE
8
EuroPanel
10
103.604700
20
237.106000
11
103.482907
21
236.493707
0
LINE
8
EuroPanel
10
103.482907
20
236.493707
11
103.136071
21
235.974629
0
LINE
8
EuroPanel
10
103.136071
20
235.974629
11
102.616993
21
235.627793
0
LINE
8
EuroPanel
10
102.616993
20
235.627793
11
102.004700
21
235.506000
0
LINE
8
EuroPanel
10
102.004700
20
235.506000
11
99.704700
21
235.506000
0
LINE
8
EuroPanel
10
99.704700
20
235.506000
11
99.092407
21
235.627793
0
LINE
8
EuroPanel
10
99.092407
20
235.627793
11
98.573329
21
235.974629
0
LINE
8
EuroPanel
10
98.573329
20
235.974629
11
98.226493
21
236.493707
0
LINE
8
EuroPanel
10
98.226493
20
236.493707
11
98.104700
21
237.106000
0
LINE
8
EuroPanel
10
98.104700
20
237.106000
11
98.104700
21
237.106000
0
LINE
8
EuroPanel
10
98.104700
20
237.106000
11
98.226493
21
237.718293
0
LINE
8
EuroPanel
10
98.226493
20
237.718293
11
98.573329
21
238.237371
0
LINE
8
EuroPanel
10
98.573329
20
238.237371
11
99.092407
21
238.584207
0
LINE
8
EuroPanel
10
99.092407
20
238.584207
11
99.704700
21
238.706000
0
LINE
8
EuroPanel
10
99.704700
20
238.706000
11
99.704700
21
238.706000
 0 
ENDSEC
 0 
EOF