999
"DXF R12 Output" (www.mydxf.blogspot.com)
 0 
SECTION
 2 
HEADER
 9 
$ACADVER
 1 
AC1009
 9 
$EXTMIN
 10 
 0 
 20 
 0 
 9 
$EXTMAX
 10 
 8.5 
 20 
 11 
 0 
ENDSEC
 0 
SECTION
 2 
ENTITIES
0
LINE
8
EuroPanel
10
-18.395300
20
195.681000
11
194.604700
21
195.681000
0
LINE
8
EuroPanel
10
194.604700
20
195.681000
11
194.604700
21
156.031000
0
LINE
8
EuroPanel
10
194.604700
20
156.031000
11
-18.395300
21
156.031000
0
LINE
8
EuroPanel
10
-18.395300
20
156.031000
11
-18.395300
21
195.681000
0
LINE
8
EuroPanel
10
-12.045300
20
160.631000
11
-9.745300
21
160.631000
0
LINE
8
EuroPanel
10
-9.745300
20
160.631000
11
-9.133007
21
160.509207
0
LINE
8
EuroPanel
10
-9.133007
20
160.509207
11
-8.613929
21
160.162371
0
LINE
8
EuroPanel
10
-8.613929
20
160.162371
11
-8.267093
21
159.643293
0
LINE
8
EuroPanel
10
-8.267093
20
159.643293
11
-8.145300
21
159.031000
0
LINE
8
EuroPanel
10
-8.145300
20
159.031000
11
-8.145300
21
159.031000
0
LINE
8
EuroPanel
10
-8.145300
20
159.031000
11
-8.267093
21
158.418707
0
LINE
8
EuroPanel
10
-8.267093
20
158.418707
11
-8.613929
21
157.899629
0
LINE
8
EuroPanel
10
-8.613929
20
157.899629
11
-9.133007
21
157.552793
0
LINE
8
EuroPanel
10
-9.133007
20
157.552793
11
-9.745300
21
157.431000
0
LINE
8
EuroPanel
10
-9.745300
20
157.431000
11
-12.045300
21
157.431000
0
LINE
8
EuroPanel
10
-12.045300
20
157.431000
11
-12.668092
21
157.556736
0
LINE
8
EuroPanel
10
-12.668092
20
157.556736
11
-13.176671
21
157.899629
0
LINE
8
EuroPanel
10
-13.176671
20
157.899629
11
-13.519564
21
158.408208
0
LINE
8
EuroPanel
10
-13.519564
20
158.408208
11
-13.645300
21
159.031000
0
LINE
8
EuroPanel
10
-13.645300
20
159.031000
11
-13.645300
21
159.031000
0
LINE
8
EuroPanel
10
-13.645300
20
159.031000
11
-13.519564
21
159.653792
0
LINE
8
EuroPanel
10
-13.519564
20
159.653792
11
-13.176671
21
160.162371
0
LINE
8
EuroPanel
10
-13.176671
20
160.162371
11
-12.668092
21
160.505264
0
LINE
8
EuroPanel
10
-12.668092
20
160.505264
11
-12.045300
21
160.631000
0
LINE
8
EuroPanel
10
-12.045300
20
160.631000
11
-12.045300
21
160.631000
0
LINE
8
EuroPanel
10
-12.045300
20
194.281000
11
-9.745300
21
194.281000
0
LINE
8
EuroPanel
10
-9.745300
20
194.281000
11
-9.133007
21
194.159207
0
LINE
8
EuroPanel
10
-9.133007
20
194.159207
11
-8.613929
21
193.812371
0
LINE
8
EuroPanel
10
-8.613929
20
193.812371
11
-8.267093
21
193.293293
0
LINE
8
EuroPanel
10
-8.267093
20
193.293293
11
-8.145300
21
192.681000
0
LINE
8
EuroPanel
10
-8.145300
20
192.681000
11
-8.145300
21
192.681000
0
LINE
8
EuroPanel
10
-8.145300
20
192.681000
11
-8.267093
21
192.068707
0
LINE
8
EuroPanel
10
-8.267093
20
192.068707
11
-8.613929
21
191.549629
0
LINE
8
EuroPanel
10
-8.613929
20
191.549629
11
-9.133007
21
191.202793
0
LINE
8
EuroPanel
10
-9.133007
20
191.202793
11
-9.745300
21
191.081000
0
LINE
8
EuroPanel
10
-9.745300
20
191.081000
11
-12.045300
21
191.081000
0
LINE
8
EuroPanel
10
-12.045300
20
191.081000
11
-12.668092
21
191.206736
0
LINE
8
EuroPanel
10
-12.668092
20
191.206736
11
-13.176671
21
191.549629
0
LINE
8
EuroPanel
10
-13.176671
20
191.549629
11
-13.519564
21
192.058208
0
LINE
8
EuroPanel
10
-13.519564
20
192.058208
11
-13.645300
21
192.681000
0
LINE
8
EuroPanel
10
-13.645300
20
192.681000
11
-13.645300
21
192.681000
0
LINE
8
EuroPanel
10
-13.645300
20
192.681000
11
-13.519564
21
193.303792
0
LINE
8
EuroPanel
10
-13.519564
20
193.303792
11
-13.176671
21
193.812371
0
LINE
8
EuroPanel
10
-13.176671
20
193.812371
11
-12.668092
21
194.155264
0
LINE
8
EuroPanel
10
-12.668092
20
194.155264
11
-12.045300
21
194.281000
0
LINE
8
EuroPanel
10
-12.045300
20
194.281000
11
-12.045300
21
194.281000
0
LINE
8
EuroPanel
10
186.074700
20
160.631000
11
188.374700
21
160.631000
0
LINE
8
EuroPanel
10
188.374700
20
160.631000
11
188.986993
21
160.509207
0
LINE
8
EuroPanel
10
188.986993
20
160.509207
11
189.506071
21
160.162371
0
LINE
8
EuroPanel
10
189.506071
20
160.162371
11
189.852907
21
159.643293
0
LINE
8
EuroPanel
10
189.852907
20
159.643293
11
189.974700
21
159.031000
0
LINE
8
EuroPanel
10
189.974700
20
159.031000
11
189.974700
21
159.031000
0
LINE
8
EuroPanel
10
189.974700
20
159.031000
11
189.852907
21
158.418707
0
LINE
8
EuroPanel
10
189.852907
20
158.418707
11
189.506071
21
157.899629
0
LINE
8
EuroPanel
10
189.506071
20
157.899629
11
188.986993
21
157.552793
0
LINE
8
EuroPanel
10
188.986993
20
157.552793
11
188.374700
21
157.431000
0
LINE
8
EuroPanel
10
188.374700
20
157.431000
11
186.074700
21
157.431000
0
LINE
8
EuroPanel
10
186.074700
20
157.431000
11
185.462407
21
157.552793
0
LINE
8
EuroPanel
10
185.462407
20
157.552793
11
184.943329
21
157.899629
0
LINE
8
EuroPanel
10
184.943329
20
157.899629
11
184.596493
21
158.418707
0
LINE
8
EuroPanel
10
184.596493
20
158.418707
11
184.474700
21
159.031000
0
LINE
8
EuroPanel
10
184.474700
20
159.031000
11
184.474700
21
159.031000
0
LINE
8
EuroPanel
10
184.474700
20
159.031000
11
184.596493
21
159.643293
0
LINE
8
EuroPanel
10
184.596493
20
159.643293
11
184.943329
21
160.162371
0
LINE
8
EuroPanel
10
184.943329
20
160.162371
11
185.462407
21
160.509207
0
LINE
8
EuroPanel
10
185.462407
20
160.509207
11
186.074700
21
160.631000
0
LINE
8
EuroPanel
10
186.074700
20
160.631000
11
186.074700
21
160.631000
0
LINE
8
EuroPanel
10
186.074700
20
194.281000
11
188.374700
21
194.281000
0
LINE
8
EuroPanel
10
188.374700
20
194.281000
11
188.986993
21
194.159207
0
LINE
8
EuroPanel
10
188.986993
20
194.159207
11
189.506071
21
193.812371
0
LINE
8
EuroPanel
10
189.506071
20
193.812371
11
189.852907
21
193.293293
0
LINE
8
EuroPanel
10
189.852907
20
193.293293
11
189.974700
21
192.681000
0
LINE
8
EuroPanel
10
189.974700
20
192.681000
11
189.974700
21
192.681000
0
LINE
8
EuroPanel
10
189.974700
20
192.681000
11
189.852907
21
192.068707
0
LINE
8
EuroPanel
10
189.852907
20
192.068707
11
189.506071
21
191.549629
0
LINE
8
EuroPanel
10
189.506071
20
191.549629
11
188.986993
21
191.202793
0
LINE
8
EuroPanel
10
188.986993
20
191.202793
11
188.374700
21
191.081000
0
LINE
8
EuroPanel
10
188.374700
20
191.081000
11
186.074700
21
191.081000
0
LINE
8
EuroPanel
10
186.074700
20
191.081000
11
185.462407
21
191.202793
0
LINE
8
EuroPanel
10
185.462407
20
191.202793
11
184.943329
21
191.549629
0
LINE
8
EuroPanel
10
184.943329
20
191.549629
11
184.596493
21
192.068707
0
LINE
8
EuroPanel
10
184.596493
20
192.068707
11
184.474700
21
192.681000
0
LINE
8
EuroPanel
10
184.474700
20
192.681000
11
184.474700
21
192.681000
0
LINE
8
EuroPanel
10
184.474700
20
192.681000
11
184.596493
21
193.293293
0
LINE
8
EuroPanel
10
184.596493
20
193.293293
11
184.943329
21
193.812371
0
LINE
8
EuroPanel
10
184.943329
20
193.812371
11
185.462407
21
194.159207
0
LINE
8
EuroPanel
10
185.462407
20
194.159207
11
186.074700
21
194.281000
0
LINE
8
EuroPanel
10
186.074700
20
194.281000
11
186.074700
21
194.281000
 0 
ENDSEC
 0 
EOF