999
"DXF R12 Output" (www.mydxf.blogspot.com)
 0 
SECTION
 2 
HEADER
 9 
$ACADVER
 1 
AC1009
 9 
$EXTMIN
 10 
 0 
 20 
 0 
 9 
$EXTMAX
 10 
 8.5 
 20 
 11 
 0 
ENDSEC
 0 
SECTION
 2 
ENTITIES
0
LINE
8
EuroPanel
10
67.954700
20
195.681000
11
108.254700
21
195.681000
0
LINE
8
EuroPanel
10
108.254700
20
195.681000
11
108.254700
21
156.031000
0
LINE
8
EuroPanel
10
108.254700
20
156.031000
11
67.954700
21
156.031000
0
LINE
8
EuroPanel
10
67.954700
20
156.031000
11
67.954700
21
195.681000
0
LINE
8
EuroPanel
10
74.304700
20
160.631000
11
76.604700
21
160.631000
0
LINE
8
EuroPanel
10
76.604700
20
160.631000
11
77.216993
21
160.509207
0
LINE
8
EuroPanel
10
77.216993
20
160.509207
11
77.736071
21
160.162371
0
LINE
8
EuroPanel
10
77.736071
20
160.162371
11
78.082907
21
159.643293
0
LINE
8
EuroPanel
10
78.082907
20
159.643293
11
78.204700
21
159.031000
0
LINE
8
EuroPanel
10
78.204700
20
159.031000
11
78.204700
21
159.031000
0
LINE
8
EuroPanel
10
78.204700
20
159.031000
11
78.082907
21
158.418707
0
LINE
8
EuroPanel
10
78.082907
20
158.418707
11
77.736071
21
157.899629
0
LINE
8
EuroPanel
10
77.736071
20
157.899629
11
77.216993
21
157.552793
0
LINE
8
EuroPanel
10
77.216993
20
157.552793
11
76.604700
21
157.431000
0
LINE
8
EuroPanel
10
76.604700
20
157.431000
11
74.304700
21
157.431000
0
LINE
8
EuroPanel
10
74.304700
20
157.431000
11
73.692407
21
157.552793
0
LINE
8
EuroPanel
10
73.692407
20
157.552793
11
73.173329
21
157.899629
0
LINE
8
EuroPanel
10
73.173329
20
157.899629
11
72.826493
21
158.418707
0
LINE
8
EuroPanel
10
72.826493
20
158.418707
11
72.704700
21
159.031000
0
LINE
8
EuroPanel
10
72.704700
20
159.031000
11
72.704700
21
159.031000
0
LINE
8
EuroPanel
10
72.704700
20
159.031000
11
72.826493
21
159.643293
0
LINE
8
EuroPanel
10
72.826493
20
159.643293
11
73.173329
21
160.162371
0
LINE
8
EuroPanel
10
73.173329
20
160.162371
11
73.692407
21
160.509207
0
LINE
8
EuroPanel
10
73.692407
20
160.509207
11
74.304700
21
160.631000
0
LINE
8
EuroPanel
10
74.304700
20
160.631000
11
74.304700
21
160.631000
0
LINE
8
EuroPanel
10
74.304700
20
194.281000
11
76.604700
21
194.281000
0
LINE
8
EuroPanel
10
76.604700
20
194.281000
11
77.216993
21
194.159207
0
LINE
8
EuroPanel
10
77.216993
20
194.159207
11
77.736071
21
193.812371
0
LINE
8
EuroPanel
10
77.736071
20
193.812371
11
78.082907
21
193.293293
0
LINE
8
EuroPanel
10
78.082907
20
193.293293
11
78.204700
21
192.681000
0
LINE
8
EuroPanel
10
78.204700
20
192.681000
11
78.204700
21
192.681000
0
LINE
8
EuroPanel
10
78.204700
20
192.681000
11
78.082907
21
192.068707
0
LINE
8
EuroPanel
10
78.082907
20
192.068707
11
77.736071
21
191.549629
0
LINE
8
EuroPanel
10
77.736071
20
191.549629
11
77.216993
21
191.202793
0
LINE
8
EuroPanel
10
77.216993
20
191.202793
11
76.604700
21
191.081000
0
LINE
8
EuroPanel
10
76.604700
20
191.081000
11
74.304700
21
191.081000
0
LINE
8
EuroPanel
10
74.304700
20
191.081000
11
73.692407
21
191.202793
0
LINE
8
EuroPanel
10
73.692407
20
191.202793
11
73.173329
21
191.549629
0
LINE
8
EuroPanel
10
73.173329
20
191.549629
11
72.826493
21
192.068707
0
LINE
8
EuroPanel
10
72.826493
20
192.068707
11
72.704700
21
192.681000
0
LINE
8
EuroPanel
10
72.704700
20
192.681000
11
72.704700
21
192.681000
0
LINE
8
EuroPanel
10
72.704700
20
192.681000
11
72.826493
21
193.293293
0
LINE
8
EuroPanel
10
72.826493
20
193.293293
11
73.173329
21
193.812371
0
LINE
8
EuroPanel
10
73.173329
20
193.812371
11
73.692407
21
194.159207
0
LINE
8
EuroPanel
10
73.692407
20
194.159207
11
74.304700
21
194.281000
0
LINE
8
EuroPanel
10
74.304700
20
194.281000
11
74.304700
21
194.281000
0
LINE
8
EuroPanel
10
99.704700
20
160.631000
11
102.004700
21
160.631000
0
LINE
8
EuroPanel
10
102.004700
20
160.631000
11
102.616993
21
160.509207
0
LINE
8
EuroPanel
10
102.616993
20
160.509207
11
103.136071
21
160.162371
0
LINE
8
EuroPanel
10
103.136071
20
160.162371
11
103.482907
21
159.643293
0
LINE
8
EuroPanel
10
103.482907
20
159.643293
11
103.604700
21
159.031000
0
LINE
8
EuroPanel
10
103.604700
20
159.031000
11
103.604700
21
159.031000
0
LINE
8
EuroPanel
10
103.604700
20
159.031000
11
103.482907
21
158.418707
0
LINE
8
EuroPanel
10
103.482907
20
158.418707
11
103.136071
21
157.899629
0
LINE
8
EuroPanel
10
103.136071
20
157.899629
11
102.616993
21
157.552793
0
LINE
8
EuroPanel
10
102.616993
20
157.552793
11
102.004700
21
157.431000
0
LINE
8
EuroPanel
10
102.004700
20
157.431000
11
99.704700
21
157.431000
0
LINE
8
EuroPanel
10
99.704700
20
157.431000
11
99.092407
21
157.552793
0
LINE
8
EuroPanel
10
99.092407
20
157.552793
11
98.573329
21
157.899629
0
LINE
8
EuroPanel
10
98.573329
20
157.899629
11
98.226493
21
158.418707
0
LINE
8
EuroPanel
10
98.226493
20
158.418707
11
98.104700
21
159.031000
0
LINE
8
EuroPanel
10
98.104700
20
159.031000
11
98.104700
21
159.031000
0
LINE
8
EuroPanel
10
98.104700
20
159.031000
11
98.226493
21
159.643293
0
LINE
8
EuroPanel
10
98.226493
20
159.643293
11
98.573329
21
160.162371
0
LINE
8
EuroPanel
10
98.573329
20
160.162371
11
99.092407
21
160.509207
0
LINE
8
EuroPanel
10
99.092407
20
160.509207
11
99.704700
21
160.631000
0
LINE
8
EuroPanel
10
99.704700
20
160.631000
11
99.704700
21
160.631000
0
LINE
8
EuroPanel
10
99.704700
20
194.281000
11
102.004700
21
194.281000
0
LINE
8
EuroPanel
10
102.004700
20
194.281000
11
102.616993
21
194.159207
0
LINE
8
EuroPanel
10
102.616993
20
194.159207
11
103.136071
21
193.812371
0
LINE
8
EuroPanel
10
103.136071
20
193.812371
11
103.482907
21
193.293293
0
LINE
8
EuroPanel
10
103.482907
20
193.293293
11
103.604700
21
192.681000
0
LINE
8
EuroPanel
10
103.604700
20
192.681000
11
103.604700
21
192.681000
0
LINE
8
EuroPanel
10
103.604700
20
192.681000
11
103.482907
21
192.068707
0
LINE
8
EuroPanel
10
103.482907
20
192.068707
11
103.136071
21
191.549629
0
LINE
8
EuroPanel
10
103.136071
20
191.549629
11
102.616993
21
191.202793
0
LINE
8
EuroPanel
10
102.616993
20
191.202793
11
102.004700
21
191.081000
0
LINE
8
EuroPanel
10
102.004700
20
191.081000
11
99.704700
21
191.081000
0
LINE
8
EuroPanel
10
99.704700
20
191.081000
11
99.092407
21
191.202793
0
LINE
8
EuroPanel
10
99.092407
20
191.202793
11
98.573329
21
191.549629
0
LINE
8
EuroPanel
10
98.573329
20
191.549629
11
98.226493
21
192.068707
0
LINE
8
EuroPanel
10
98.226493
20
192.068707
11
98.104700
21
192.681000
0
LINE
8
EuroPanel
10
98.104700
20
192.681000
11
98.104700
21
192.681000
0
LINE
8
EuroPanel
10
98.104700
20
192.681000
11
98.226493
21
193.293293
0
LINE
8
EuroPanel
10
98.226493
20
193.293293
11
98.573329
21
193.812371
0
LINE
8
EuroPanel
10
98.573329
20
193.812371
11
99.092407
21
194.159207
0
LINE
8
EuroPanel
10
99.092407
20
194.159207
11
99.704700
21
194.281000
0
LINE
8
EuroPanel
10
99.704700
20
194.281000
11
99.704700
21
194.281000
 0 
ENDSEC
 0 
EOF