999
"DXF R12 Output" (www.mydxf.blogspot.com)
 0 
SECTION
 2 
HEADER
 9 
$ACADVER
 1 
AC1009
 9 
$EXTMIN
 10 
 0 
 20 
 0 
 9 
$EXTMAX
 10 
 8.5 
 20 
 11 
 0 
ENDSEC
 0 
SECTION
 2 
ENTITIES
0
LINE
8
EuroPanel
10
17.154700
20
195.681000
11
159.054700
21
195.681000
0
LINE
8
EuroPanel
10
159.054700
20
195.681000
11
159.054700
21
156.031000
0
LINE
8
EuroPanel
10
159.054700
20
156.031000
11
17.154700
21
156.031000
0
LINE
8
EuroPanel
10
17.154700
20
156.031000
11
17.154700
21
195.681000
0
LINE
8
EuroPanel
10
23.504700
20
160.631000
11
25.804700
21
160.631000
0
LINE
8
EuroPanel
10
25.804700
20
160.631000
11
26.416993
21
160.509207
0
LINE
8
EuroPanel
10
26.416993
20
160.509207
11
26.936071
21
160.162371
0
LINE
8
EuroPanel
10
26.936071
20
160.162371
11
27.282907
21
159.643293
0
LINE
8
EuroPanel
10
27.282907
20
159.643293
11
27.404700
21
159.031000
0
LINE
8
EuroPanel
10
27.404700
20
159.031000
11
27.404700
21
159.031000
0
LINE
8
EuroPanel
10
27.404700
20
159.031000
11
27.282907
21
158.418707
0
LINE
8
EuroPanel
10
27.282907
20
158.418707
11
26.936071
21
157.899629
0
LINE
8
EuroPanel
10
26.936071
20
157.899629
11
26.416993
21
157.552793
0
LINE
8
EuroPanel
10
26.416993
20
157.552793
11
25.804700
21
157.431000
0
LINE
8
EuroPanel
10
25.804700
20
157.431000
11
23.504700
21
157.431000
0
LINE
8
EuroPanel
10
23.504700
20
157.431000
11
22.892407
21
157.552793
0
LINE
8
EuroPanel
10
22.892407
20
157.552793
11
22.373329
21
157.899629
0
LINE
8
EuroPanel
10
22.373329
20
157.899629
11
22.026493
21
158.418707
0
LINE
8
EuroPanel
10
22.026493
20
158.418707
11
21.904700
21
159.031000
0
LINE
8
EuroPanel
10
21.904700
20
159.031000
11
21.904700
21
159.031000
0
LINE
8
EuroPanel
10
21.904700
20
159.031000
11
22.026493
21
159.643293
0
LINE
8
EuroPanel
10
22.026493
20
159.643293
11
22.373329
21
160.162371
0
LINE
8
EuroPanel
10
22.373329
20
160.162371
11
22.892407
21
160.509207
0
LINE
8
EuroPanel
10
22.892407
20
160.509207
11
23.504700
21
160.631000
0
LINE
8
EuroPanel
10
23.504700
20
160.631000
11
23.504700
21
160.631000
0
LINE
8
EuroPanel
10
23.504700
20
194.281000
11
25.804700
21
194.281000
0
LINE
8
EuroPanel
10
25.804700
20
194.281000
11
26.416993
21
194.159207
0
LINE
8
EuroPanel
10
26.416993
20
194.159207
11
26.936071
21
193.812371
0
LINE
8
EuroPanel
10
26.936071
20
193.812371
11
27.282907
21
193.293293
0
LINE
8
EuroPanel
10
27.282907
20
193.293293
11
27.404700
21
192.681000
0
LINE
8
EuroPanel
10
27.404700
20
192.681000
11
27.404700
21
192.681000
0
LINE
8
EuroPanel
10
27.404700
20
192.681000
11
27.282907
21
192.068707
0
LINE
8
EuroPanel
10
27.282907
20
192.068707
11
26.936071
21
191.549629
0
LINE
8
EuroPanel
10
26.936071
20
191.549629
11
26.416993
21
191.202793
0
LINE
8
EuroPanel
10
26.416993
20
191.202793
11
25.804700
21
191.081000
0
LINE
8
EuroPanel
10
25.804700
20
191.081000
11
23.504700
21
191.081000
0
LINE
8
EuroPanel
10
23.504700
20
191.081000
11
22.892407
21
191.202793
0
LINE
8
EuroPanel
10
22.892407
20
191.202793
11
22.373329
21
191.549629
0
LINE
8
EuroPanel
10
22.373329
20
191.549629
11
22.026493
21
192.068707
0
LINE
8
EuroPanel
10
22.026493
20
192.068707
11
21.904700
21
192.681000
0
LINE
8
EuroPanel
10
21.904700
20
192.681000
11
21.904700
21
192.681000
0
LINE
8
EuroPanel
10
21.904700
20
192.681000
11
22.026493
21
193.293293
0
LINE
8
EuroPanel
10
22.026493
20
193.293293
11
22.373329
21
193.812371
0
LINE
8
EuroPanel
10
22.373329
20
193.812371
11
22.892407
21
194.159207
0
LINE
8
EuroPanel
10
22.892407
20
194.159207
11
23.504700
21
194.281000
0
LINE
8
EuroPanel
10
23.504700
20
194.281000
11
23.504700
21
194.281000
0
LINE
8
EuroPanel
10
150.504700
20
160.631000
11
152.804700
21
160.631000
0
LINE
8
EuroPanel
10
152.804700
20
160.631000
11
153.416993
21
160.509207
0
LINE
8
EuroPanel
10
153.416993
20
160.509207
11
153.936071
21
160.162371
0
LINE
8
EuroPanel
10
153.936071
20
160.162371
11
154.282907
21
159.643293
0
LINE
8
EuroPanel
10
154.282907
20
159.643293
11
154.404700
21
159.031000
0
LINE
8
EuroPanel
10
154.404700
20
159.031000
11
154.404700
21
159.031000
0
LINE
8
EuroPanel
10
154.404700
20
159.031000
11
154.282907
21
158.418707
0
LINE
8
EuroPanel
10
154.282907
20
158.418707
11
153.936071
21
157.899629
0
LINE
8
EuroPanel
10
153.936071
20
157.899629
11
153.416993
21
157.552793
0
LINE
8
EuroPanel
10
153.416993
20
157.552793
11
152.804700
21
157.431000
0
LINE
8
EuroPanel
10
152.804700
20
157.431000
11
150.504700
21
157.431000
0
LINE
8
EuroPanel
10
150.504700
20
157.431000
11
149.881908
21
157.556736
0
LINE
8
EuroPanel
10
149.881908
20
157.556736
11
149.373329
21
157.899629
0
LINE
8
EuroPanel
10
149.373329
20
157.899629
11
149.030436
21
158.408208
0
LINE
8
EuroPanel
10
149.030436
20
158.408208
11
148.904700
21
159.031000
0
LINE
8
EuroPanel
10
148.904700
20
159.031000
11
148.904700
21
159.031000
0
LINE
8
EuroPanel
10
148.904700
20
159.031000
11
149.030436
21
159.653792
0
LINE
8
EuroPanel
10
149.030436
20
159.653792
11
149.373329
21
160.162371
0
LINE
8
EuroPanel
10
149.373329
20
160.162371
11
149.881908
21
160.505264
0
LINE
8
EuroPanel
10
149.881908
20
160.505264
11
150.504700
21
160.631000
0
LINE
8
EuroPanel
10
150.504700
20
160.631000
11
150.504700
21
160.631000
0
LINE
8
EuroPanel
10
150.504700
20
194.281000
11
152.804700
21
194.281000
0
LINE
8
EuroPanel
10
152.804700
20
194.281000
11
153.416993
21
194.159207
0
LINE
8
EuroPanel
10
153.416993
20
194.159207
11
153.936071
21
193.812371
0
LINE
8
EuroPanel
10
153.936071
20
193.812371
11
154.282907
21
193.293293
0
LINE
8
EuroPanel
10
154.282907
20
193.293293
11
154.404700
21
192.681000
0
LINE
8
EuroPanel
10
154.404700
20
192.681000
11
154.404700
21
192.681000
0
LINE
8
EuroPanel
10
154.404700
20
192.681000
11
154.282907
21
192.068707
0
LINE
8
EuroPanel
10
154.282907
20
192.068707
11
153.936071
21
191.549629
0
LINE
8
EuroPanel
10
153.936071
20
191.549629
11
153.416993
21
191.202793
0
LINE
8
EuroPanel
10
153.416993
20
191.202793
11
152.804700
21
191.081000
0
LINE
8
EuroPanel
10
152.804700
20
191.081000
11
150.504700
21
191.081000
0
LINE
8
EuroPanel
10
150.504700
20
191.081000
11
149.881908
21
191.206736
0
LINE
8
EuroPanel
10
149.881908
20
191.206736
11
149.373329
21
191.549629
0
LINE
8
EuroPanel
10
149.373329
20
191.549629
11
149.030436
21
192.058208
0
LINE
8
EuroPanel
10
149.030436
20
192.058208
11
148.904700
21
192.681000
0
LINE
8
EuroPanel
10
148.904700
20
192.681000
11
148.904700
21
192.681000
0
LINE
8
EuroPanel
10
148.904700
20
192.681000
11
149.030436
21
193.303792
0
LINE
8
EuroPanel
10
149.030436
20
193.303792
11
149.373329
21
193.812371
0
LINE
8
EuroPanel
10
149.373329
20
193.812371
11
149.881908
21
194.155264
0
LINE
8
EuroPanel
10
149.881908
20
194.155264
11
150.504700
21
194.281000
0
LINE
8
EuroPanel
10
150.504700
20
194.281000
11
150.504700
21
194.281000
 0 
ENDSEC
 0 
EOF