999
"DXF R12 Output" (www.mydxf.blogspot.com)
 0 
SECTION
 2 
HEADER
 9 
$ACADVER
 1 
AC1009
 9 
$EXTMIN
 10 
 0 
 20 
 0 
 9 
$EXTMAX
 10 
 8.5 
 20 
 11 
 0 
ENDSEC
 0 
SECTION
 2 
ENTITIES
0
LINE
8
EuroPanel
10
78.104700
20
240.106000
11
98.104700
21
240.106000
0
LINE
8
EuroPanel
10
98.104700
20
240.106000
11
98.104700
21
111.606000
0
LINE
8
EuroPanel
10
98.104700
20
111.606000
11
78.104700
21
111.606000
0
LINE
8
EuroPanel
10
78.104700
20
111.606000
11
78.104700
21
240.106000
0
LINE
8
EuroPanel
10
84.454700
20
116.206000
11
86.754700
21
116.206000
0
LINE
8
EuroPanel
10
86.754700
20
116.206000
11
87.366993
21
116.084207
0
LINE
8
EuroPanel
10
87.366993
20
116.084207
11
87.886071
21
115.737371
0
LINE
8
EuroPanel
10
87.886071
20
115.737371
11
88.232907
21
115.218293
0
LINE
8
EuroPanel
10
88.232907
20
115.218293
11
88.354700
21
114.606000
0
LINE
8
EuroPanel
10
88.354700
20
114.606000
11
88.354700
21
114.606000
0
LINE
8
EuroPanel
10
88.354700
20
114.606000
11
88.232907
21
113.993707
0
LINE
8
EuroPanel
10
88.232907
20
113.993707
11
87.886071
21
113.474629
0
LINE
8
EuroPanel
10
87.886071
20
113.474629
11
87.366993
21
113.127793
0
LINE
8
EuroPanel
10
87.366993
20
113.127793
11
86.754700
21
113.006000
0
LINE
8
EuroPanel
10
86.754700
20
113.006000
11
84.454700
21
113.006000
0
LINE
8
EuroPanel
10
84.454700
20
113.006000
11
83.842407
21
113.127793
0
LINE
8
EuroPanel
10
83.842407
20
113.127793
11
83.323329
21
113.474629
0
LINE
8
EuroPanel
10
83.323329
20
113.474629
11
82.976493
21
113.993707
0
LINE
8
EuroPanel
10
82.976493
20
113.993707
11
82.854700
21
114.606000
0
LINE
8
EuroPanel
10
82.854700
20
114.606000
11
82.854700
21
114.606000
0
LINE
8
EuroPanel
10
82.854700
20
114.606000
11
82.976493
21
115.218293
0
LINE
8
EuroPanel
10
82.976493
20
115.218293
11
83.323329
21
115.737371
0
LINE
8
EuroPanel
10
83.323329
20
115.737371
11
83.842407
21
116.084207
0
LINE
8
EuroPanel
10
83.842407
20
116.084207
11
84.454700
21
116.206000
0
LINE
8
EuroPanel
10
84.454700
20
116.206000
11
84.454700
21
116.206000
0
LINE
8
EuroPanel
10
84.454700
20
238.706000
11
86.754700
21
238.706000
0
LINE
8
EuroPanel
10
86.754700
20
238.706000
11
87.366993
21
238.584207
0
LINE
8
EuroPanel
10
87.366993
20
238.584207
11
87.886071
21
238.237371
0
LINE
8
EuroPanel
10
87.886071
20
238.237371
11
88.232907
21
237.718293
0
LINE
8
EuroPanel
10
88.232907
20
237.718293
11
88.354700
21
237.106000
0
LINE
8
EuroPanel
10
88.354700
20
237.106000
11
88.354700
21
237.106000
0
LINE
8
EuroPanel
10
88.354700
20
237.106000
11
88.232907
21
236.493707
0
LINE
8
EuroPanel
10
88.232907
20
236.493707
11
87.886071
21
235.974629
0
LINE
8
EuroPanel
10
87.886071
20
235.974629
11
87.366993
21
235.627793
0
LINE
8
EuroPanel
10
87.366993
20
235.627793
11
86.754700
21
235.506000
0
LINE
8
EuroPanel
10
86.754700
20
235.506000
11
84.454700
21
235.506000
0
LINE
8
EuroPanel
10
84.454700
20
235.506000
11
83.842407
21
235.627793
0
LINE
8
EuroPanel
10
83.842407
20
235.627793
11
83.323329
21
235.974629
0
LINE
8
EuroPanel
10
83.323329
20
235.974629
11
82.976493
21
236.493707
0
LINE
8
EuroPanel
10
82.976493
20
236.493707
11
82.854700
21
237.106000
0
LINE
8
EuroPanel
10
82.854700
20
237.106000
11
82.854700
21
237.106000
0
LINE
8
EuroPanel
10
82.854700
20
237.106000
11
82.976493
21
237.718293
0
LINE
8
EuroPanel
10
82.976493
20
237.718293
11
83.323329
21
238.237371
0
LINE
8
EuroPanel
10
83.323329
20
238.237371
11
83.842407
21
238.584207
0
LINE
8
EuroPanel
10
83.842407
20
238.584207
11
84.454700
21
238.706000
0
LINE
8
EuroPanel
10
84.454700
20
238.706000
11
84.454700
21
238.706000
 0 
ENDSEC
 0 
EOF