(kicad_sch
	(version 20231120)
	(generator "eeschema")
	(generator_version "8.0")
	(uuid "fd30f43d-af6b-4bfd-a2c4-aadeadad874e")
	(paper "A4")
	(lib_symbols
		(symbol "Amplifier_Operational:TL074"
			(pin_names
				(offset 0.127)
			)
			(exclude_from_sim no)
			(in_bom yes)
			(on_board yes)
			(property "Reference" "U"
				(at 0 5.08 0)
				(effects
					(font
						(size 1.27 1.27)
					)
					(justify left)
				)
			)
			(property "Value" "TL074"
				(at 0 -5.08 0)
				(effects
					(font
						(size 1.27 1.27)
					)
					(justify left)
				)
			)
			(property "Footprint" ""
				(at -1.27 2.54 0)
				(effects
					(font
						(size 1.27 1.27)
					)
					(hide yes)
				)
			)
			(property "Datasheet" "http://www.ti.com/lit/ds/symlink/tl071.pdf"
				(at 1.27 5.08 0)
				(effects
					(font
						(size 1.27 1.27)
					)
					(hide yes)
				)
			)
			(property "Description" "Quad Low-Noise JFET-Input Operational Amplifiers, DIP-14/SOIC-14"
				(at 0 0 0)
				(effects
					(font
						(size 1.27 1.27)
					)
					(hide yes)
				)
			)
			(property "ki_locked" ""
				(at 0 0 0)
				(effects
					(font
						(size 1.27 1.27)
					)
				)
			)
			(property "ki_keywords" "quad opamp"
				(at 0 0 0)
				(effects
					(font
						(size 1.27 1.27)
					)
					(hide yes)
				)
			)
			(property "ki_fp_filters" "SOIC*3.9x8.7mm*P1.27mm* DIP*W7.62mm* TSSOP*4.4x5mm*P0.65mm* SSOP*5.3x6.2mm*P0.65mm* MSOP*3x3mm*P0.5mm*"
				(at 0 0 0)
				(effects
					(font
						(size 1.27 1.27)
					)
					(hide yes)
				)
			)
			(symbol "TL074_1_1"
				(polyline
					(pts
						(xy -5.08 5.08) (xy 5.08 0) (xy -5.08 -5.08) (xy -5.08 5.08)
					)
					(stroke
						(width 0.254)
						(type default)
					)
					(fill
						(type background)
					)
				)
				(pin output line
					(at 7.62 0 180)
					(length 2.54)
					(name "~"
						(effects
							(font
								(size 1.27 1.27)
							)
						)
					)
					(number "1"
						(effects
							(font
								(size 1.27 1.27)
							)
						)
					)
				)
				(pin input line
					(at -7.62 -2.54 0)
					(length 2.54)
					(name "-"
						(effects
							(font
								(size 1.27 1.27)
							)
						)
					)
					(number "2"
						(effects
							(font
								(size 1.27 1.27)
							)
						)
					)
				)
				(pin input line
					(at -7.62 2.54 0)
					(length 2.54)
					(name "+"
						(effects
							(font
								(size 1.27 1.27)
							)
						)
					)
					(number "3"
						(effects
							(font
								(size 1.27 1.27)
							)
						)
					)
				)
			)
			(symbol "TL074_2_1"
				(polyline
					(pts
						(xy -5.08 5.08) (xy 5.08 0) (xy -5.08 -5.08) (xy -5.08 5.08)
					)
					(stroke
						(width 0.254)
						(type default)
					)
					(fill
						(type background)
					)
				)
				(pin input line
					(at -7.62 2.54 0)
					(length 2.54)
					(name "+"
						(effects
							(font
								(size 1.27 1.27)
							)
						)
					)
					(number "5"
						(effects
							(font
								(size 1.27 1.27)
							)
						)
					)
				)
				(pin input line
					(at -7.62 -2.54 0)
					(length 2.54)
					(name "-"
						(effects
							(font
								(size 1.27 1.27)
							)
						)
					)
					(number "6"
						(effects
							(font
								(size 1.27 1.27)
							)
						)
					)
				)
				(pin output line
					(at 7.62 0 180)
					(length 2.54)
					(name "~"
						(effects
							(font
								(size 1.27 1.27)
							)
						)
					)
					(number "7"
						(effects
							(font
								(size 1.27 1.27)
							)
						)
					)
				)
			)
			(symbol "TL074_3_1"
				(polyline
					(pts
						(xy -5.08 5.08) (xy 5.08 0) (xy -5.08 -5.08) (xy -5.08 5.08)
					)
					(stroke
						(width 0.254)
						(type default)
					)
					(fill
						(type background)
					)
				)
				(pin input line
					(at -7.62 2.54 0)
					(length 2.54)
					(name "+"
						(effects
							(font
								(size 1.27 1.27)
							)
						)
					)
					(number "10"
						(effects
							(font
								(size 1.27 1.27)
							)
						)
					)
				)
				(pin output line
					(at 7.62 0 180)
					(length 2.54)
					(name "~"
						(effects
							(font
								(size 1.27 1.27)
							)
						)
					)
					(number "8"
						(effects
							(font
								(size 1.27 1.27)
							)
						)
					)
				)
				(pin input line
					(at -7.62 -2.54 0)
					(length 2.54)
					(name "-"
						(effects
							(font
								(size 1.27 1.27)
							)
						)
					)
					(number "9"
						(effects
							(font
								(size 1.27 1.27)
							)
						)
					)
				)
			)
			(symbol "TL074_4_1"
				(polyline
					(pts
						(xy -5.08 5.08) (xy 5.08 0) (xy -5.08 -5.08) (xy -5.08 5.08)
					)
					(stroke
						(width 0.254)
						(type default)
					)
					(fill
						(type background)
					)
				)
				(pin input line
					(at -7.62 2.54 0)
					(length 2.54)
					(name "+"
						(effects
							(font
								(size 1.27 1.27)
							)
						)
					)
					(number "12"
						(effects
							(font
								(size 1.27 1.27)
							)
						)
					)
				)
				(pin input line
					(at -7.62 -2.54 0)
					(length 2.54)
					(name "-"
						(effects
							(font
								(size 1.27 1.27)
							)
						)
					)
					(number "13"
						(effects
							(font
								(size 1.27 1.27)
							)
						)
					)
				)
				(pin output line
					(at 7.62 0 180)
					(length 2.54)
					(name "~"
						(effects
							(font
								(size 1.27 1.27)
							)
						)
					)
					(number "14"
						(effects
							(font
								(size 1.27 1.27)
							)
						)
					)
				)
			)
			(symbol "TL074_5_1"
				(pin power_in line
					(at -2.54 -7.62 90)
					(length 3.81)
					(name "V-"
						(effects
							(font
								(size 1.27 1.27)
							)
						)
					)
					(number "11"
						(effects
							(font
								(size 1.27 1.27)
							)
						)
					)
				)
				(pin power_in line
					(at -2.54 7.62 270)
					(length 3.81)
					(name "V+"
						(effects
							(font
								(size 1.27 1.27)
							)
						)
					)
					(number "4"
						(effects
							(font
								(size 1.27 1.27)
							)
						)
					)
				)
			)
		)
		(symbol "Device:C"
			(pin_numbers hide)
			(pin_names
				(offset 0.254)
			)
			(exclude_from_sim no)
			(in_bom yes)
			(on_board yes)
			(property "Reference" "C"
				(at 0.635 2.54 0)
				(effects
					(font
						(size 1.27 1.27)
					)
					(justify left)
				)
			)
			(property "Value" "C"
				(at 0.635 -2.54 0)
				(effects
					(font
						(size 1.27 1.27)
					)
					(justify left)
				)
			)
			(property "Footprint" ""
				(at 0.9652 -3.81 0)
				(effects
					(font
						(size 1.27 1.27)
					)
					(hide yes)
				)
			)
			(property "Datasheet" "~"
				(at 0 0 0)
				(effects
					(font
						(size 1.27 1.27)
					)
					(hide yes)
				)
			)
			(property "Description" "Unpolarized capacitor"
				(at 0 0 0)
				(effects
					(font
						(size 1.27 1.27)
					)
					(hide yes)
				)
			)
			(property "ki_keywords" "cap capacitor"
				(at 0 0 0)
				(effects
					(font
						(size 1.27 1.27)
					)
					(hide yes)
				)
			)
			(property "ki_fp_filters" "C_*"
				(at 0 0 0)
				(effects
					(font
						(size 1.27 1.27)
					)
					(hide yes)
				)
			)
			(symbol "C_0_1"
				(polyline
					(pts
						(xy -2.032 -0.762) (xy 2.032 -0.762)
					)
					(stroke
						(width 0.508)
						(type default)
					)
					(fill
						(type none)
					)
				)
				(polyline
					(pts
						(xy -2.032 0.762) (xy 2.032 0.762)
					)
					(stroke
						(width 0.508)
						(type default)
					)
					(fill
						(type none)
					)
				)
			)
			(symbol "C_1_1"
				(pin passive line
					(at 0 3.81 270)
					(length 2.794)
					(name "~"
						(effects
							(font
								(size 1.27 1.27)
							)
						)
					)
					(number "1"
						(effects
							(font
								(size 1.27 1.27)
							)
						)
					)
				)
				(pin passive line
					(at 0 -3.81 90)
					(length 2.794)
					(name "~"
						(effects
							(font
								(size 1.27 1.27)
							)
						)
					)
					(number "2"
						(effects
							(font
								(size 1.27 1.27)
							)
						)
					)
				)
			)
		)
		(symbol "Device:R"
			(pin_numbers hide)
			(pin_names
				(offset 0)
			)
			(exclude_from_sim no)
			(in_bom yes)
			(on_board yes)
			(property "Reference" "R"
				(at 2.032 0 90)
				(effects
					(font
						(size 1.27 1.27)
					)
				)
			)
			(property "Value" "R"
				(at 0 0 90)
				(effects
					(font
						(size 1.27 1.27)
					)
				)
			)
			(property "Footprint" ""
				(at -1.778 0 90)
				(effects
					(font
						(size 1.27 1.27)
					)
					(hide yes)
				)
			)
			(property "Datasheet" "~"
				(at 0 0 0)
				(effects
					(font
						(size 1.27 1.27)
					)
					(hide yes)
				)
			)
			(property "Description" "Resistor"
				(at 0 0 0)
				(effects
					(font
						(size 1.27 1.27)
					)
					(hide yes)
				)
			)
			(property "ki_keywords" "R res resistor"
				(at 0 0 0)
				(effects
					(font
						(size 1.27 1.27)
					)
					(hide yes)
				)
			)
			(property "ki_fp_filters" "R_*"
				(at 0 0 0)
				(effects
					(font
						(size 1.27 1.27)
					)
					(hide yes)
				)
			)
			(symbol "R_0_1"
				(rectangle
					(start -1.016 -2.54)
					(end 1.016 2.54)
					(stroke
						(width 0.254)
						(type default)
					)
					(fill
						(type none)
					)
				)
			)
			(symbol "R_1_1"
				(pin passive line
					(at 0 3.81 270)
					(length 1.27)
					(name "~"
						(effects
							(font
								(size 1.27 1.27)
							)
						)
					)
					(number "1"
						(effects
							(font
								(size 1.27 1.27)
							)
						)
					)
				)
				(pin passive line
					(at 0 -3.81 90)
					(length 1.27)
					(name "~"
						(effects
							(font
								(size 1.27 1.27)
							)
						)
					)
					(number "2"
						(effects
							(font
								(size 1.27 1.27)
							)
						)
					)
				)
			)
		)
		(symbol "Switch:SW_SPDT"
			(pin_names
				(offset 0) hide)
			(exclude_from_sim no)
			(in_bom yes)
			(on_board yes)
			(property "Reference" "SW"
				(at 0 5.08 0)
				(effects
					(font
						(size 1.27 1.27)
					)
				)
			)
			(property "Value" "SW_SPDT"
				(at 0 -5.08 0)
				(effects
					(font
						(size 1.27 1.27)
					)
				)
			)
			(property "Footprint" ""
				(at 0 0 0)
				(effects
					(font
						(size 1.27 1.27)
					)
					(hide yes)
				)
			)
			(property "Datasheet" "~"
				(at 0 -7.62 0)
				(effects
					(font
						(size 1.27 1.27)
					)
					(hide yes)
				)
			)
			(property "Description" "Switch, single pole double throw"
				(at 0 0 0)
				(effects
					(font
						(size 1.27 1.27)
					)
					(hide yes)
				)
			)
			(property "ki_keywords" "switch single-pole double-throw spdt ON-ON"
				(at 0 0 0)
				(effects
					(font
						(size 1.27 1.27)
					)
					(hide yes)
				)
			)
			(symbol "SW_SPDT_0_1"
				(circle
					(center -2.032 0)
					(radius 0.4572)
					(stroke
						(width 0)
						(type default)
					)
					(fill
						(type none)
					)
				)
				(polyline
					(pts
						(xy -1.651 0.254) (xy 1.651 2.286)
					)
					(stroke
						(width 0)
						(type default)
					)
					(fill
						(type none)
					)
				)
				(circle
					(center 2.032 -2.54)
					(radius 0.4572)
					(stroke
						(width 0)
						(type default)
					)
					(fill
						(type none)
					)
				)
				(circle
					(center 2.032 2.54)
					(radius 0.4572)
					(stroke
						(width 0)
						(type default)
					)
					(fill
						(type none)
					)
				)
			)
			(symbol "SW_SPDT_1_1"
				(rectangle
					(start -3.175 3.81)
					(end 3.175 -3.81)
					(stroke
						(width 0)
						(type default)
					)
					(fill
						(type background)
					)
				)
				(pin passive line
					(at 5.08 2.54 180)
					(length 2.54)
					(name "A"
						(effects
							(font
								(size 1.27 1.27)
							)
						)
					)
					(number "1"
						(effects
							(font
								(size 1.27 1.27)
							)
						)
					)
				)
				(pin passive line
					(at -5.08 0 0)
					(length 2.54)
					(name "B"
						(effects
							(font
								(size 1.27 1.27)
							)
						)
					)
					(number "2"
						(effects
							(font
								(size 1.27 1.27)
							)
						)
					)
				)
				(pin passive line
					(at 5.08 -2.54 180)
					(length 2.54)
					(name "C"
						(effects
							(font
								(size 1.27 1.27)
							)
						)
					)
					(number "3"
						(effects
							(font
								(size 1.27 1.27)
							)
						)
					)
				)
			)
		)
		(symbol "power:GND"
			(power)
			(pin_numbers hide)
			(pin_names
				(offset 0) hide)
			(exclude_from_sim no)
			(in_bom yes)
			(on_board yes)
			(property "Reference" "#PWR"
				(at 0 -6.35 0)
				(effects
					(font
						(size 1.27 1.27)
					)
					(hide yes)
				)
			)
			(property "Value" "GND"
				(at 0 -3.81 0)
				(effects
					(font
						(size 1.27 1.27)
					)
				)
			)
			(property "Footprint" ""
				(at 0 0 0)
				(effects
					(font
						(size 1.27 1.27)
					)
					(hide yes)
				)
			)
			(property "Datasheet" ""
				(at 0 0 0)
				(effects
					(font
						(size 1.27 1.27)
					)
					(hide yes)
				)
			)
			(property "Description" "Power symbol creates a global label with name \"GND\" , ground"
				(at 0 0 0)
				(effects
					(font
						(size 1.27 1.27)
					)
					(hide yes)
				)
			)
			(property "ki_keywords" "global power"
				(at 0 0 0)
				(effects
					(font
						(size 1.27 1.27)
					)
					(hide yes)
				)
			)
			(symbol "GND_0_1"
				(polyline
					(pts
						(xy 0 0) (xy 0 -1.27) (xy 1.27 -1.27) (xy 0 -2.54) (xy -1.27 -1.27) (xy 0 -1.27)
					)
					(stroke
						(width 0)
						(type default)
					)
					(fill
						(type none)
					)
				)
			)
			(symbol "GND_1_1"
				(pin power_in line
					(at 0 0 270)
					(length 0)
					(name "~"
						(effects
							(font
								(size 1.27 1.27)
							)
						)
					)
					(number "1"
						(effects
							(font
								(size 1.27 1.27)
							)
						)
					)
				)
			)
		)
	)
	(junction
		(at 157.48 100.33)
		(diameter 0)
		(color 0 0 0 0)
		(uuid "145e76fb-5534-4961-ad7e-3a61a3c1ec28")
	)
	(junction
		(at 134.62 71.12)
		(diameter 0)
		(color 0 0 0 0)
		(uuid "44c2e16c-02e8-4fd1-83a1-94ee069a6915")
	)
	(junction
		(at 134.62 86.36)
		(diameter 0)
		(color 0 0 0 0)
		(uuid "9e6e5734-3ef1-473a-8d40-07c82ff0c655")
	)
	(junction
		(at 128.27 97.79)
		(diameter 0)
		(color 0 0 0 0)
		(uuid "cc9ff1e6-ec5c-4455-8e0b-889eb9fa25d7")
	)
	(junction
		(at 157.48 71.12)
		(diameter 0)
		(color 0 0 0 0)
		(uuid "cd68a167-62ca-4726-9e38-f03b3a5899dd")
	)
	(junction
		(at 134.62 97.79)
		(diameter 0)
		(color 0 0 0 0)
		(uuid "efd28fef-b04c-44d0-9789-157b724562d3")
	)
	(junction
		(at 157.48 86.36)
		(diameter 0)
		(color 0 0 0 0)
		(uuid "f97c885a-866b-4c4f-a162-6dc6de48366f")
	)
	(no_connect
		(at 151.13 59.69)
		(uuid "b2cbfe8f-f0d7-4e43-87f8-af4fadfa3037")
	)
	(wire
		(pts
			(xy 134.62 71.12) (xy 134.62 86.36)
		)
		(stroke
			(width 0)
			(type default)
		)
		(uuid "03d5bb46-260a-477e-9b05-9ccad29f4284")
	)
	(wire
		(pts
			(xy 134.62 68.58) (xy 134.62 71.12)
		)
		(stroke
			(width 0)
			(type default)
		)
		(uuid "0eb08c8b-e381-4b78-b7c2-e2b2a970df5f")
	)
	(wire
		(pts
			(xy 134.62 97.79) (xy 138.43 97.79)
		)
		(stroke
			(width 0)
			(type default)
		)
		(uuid "16d9e5a0-1752-4e27-aead-c2d1c4e46d7c")
	)
	(wire
		(pts
			(xy 149.86 86.36) (xy 157.48 86.36)
		)
		(stroke
			(width 0)
			(type default)
		)
		(uuid "3b98789a-d2a2-4b72-a826-4381e347cec6")
	)
	(wire
		(pts
			(xy 140.97 57.15) (xy 134.62 57.15)
		)
		(stroke
			(width 0)
			(type default)
		)
		(uuid "48aeb967-5d26-4493-9bf2-8943d8b5ee82")
	)
	(wire
		(pts
			(xy 102.87 132.08) (xy 113.03 132.08)
		)
		(stroke
			(width 0)
			(type default)
		)
		(uuid "543e37c6-245d-492c-8d79-397b3582e8d4")
	)
	(wire
		(pts
			(xy 134.62 86.36) (xy 134.62 97.79)
		)
		(stroke
			(width 0)
			(type default)
		)
		(uuid "588ae563-11b7-4afe-8ae7-cfbb71626c80")
	)
	(wire
		(pts
			(xy 157.48 71.12) (xy 157.48 54.61)
		)
		(stroke
			(width 0)
			(type default)
		)
		(uuid "838e8844-e89b-473e-9bea-9eacb369d819")
	)
	(wire
		(pts
			(xy 102.87 97.79) (xy 113.03 97.79)
		)
		(stroke
			(width 0)
			(type default)
		)
		(uuid "839da0b6-0a5c-4249-927b-1227e757c249")
	)
	(wire
		(pts
			(xy 149.86 71.12) (xy 157.48 71.12)
		)
		(stroke
			(width 0)
			(type default)
		)
		(uuid "8e8bcfaa-a1b0-4847-a8a5-b990196c3cbf")
	)
	(wire
		(pts
			(xy 120.65 132.08) (xy 128.27 132.08)
		)
		(stroke
			(width 0)
			(type default)
		)
		(uuid "9457bcac-f2e8-49ba-8e5d-e426b2f52209")
	)
	(wire
		(pts
			(xy 134.62 71.12) (xy 142.24 71.12)
		)
		(stroke
			(width 0)
			(type default)
		)
		(uuid "a764fcbd-487c-443b-afc7-582c4f940aef")
	)
	(wire
		(pts
			(xy 128.27 97.79) (xy 134.62 97.79)
		)
		(stroke
			(width 0)
			(type default)
		)
		(uuid "a99cdd8e-38da-4934-8a8f-412dc60275f6")
	)
	(wire
		(pts
			(xy 157.48 54.61) (xy 151.13 54.61)
		)
		(stroke
			(width 0)
			(type default)
		)
		(uuid "b1405cdd-bab0-4bea-a581-216f16a4b80e")
	)
	(wire
		(pts
			(xy 157.48 86.36) (xy 157.48 100.33)
		)
		(stroke
			(width 0)
			(type default)
		)
		(uuid "b41b444b-b01e-4916-b4f9-09f0edee430f")
	)
	(wire
		(pts
			(xy 153.67 100.33) (xy 157.48 100.33)
		)
		(stroke
			(width 0)
			(type default)
		)
		(uuid "b4598ee2-d758-441c-81f2-f648b9626bba")
	)
	(wire
		(pts
			(xy 157.48 100.33) (xy 171.45 100.33)
		)
		(stroke
			(width 0)
			(type default)
		)
		(uuid "b6771271-0b73-4357-963a-03074333a582")
	)
	(wire
		(pts
			(xy 128.27 132.08) (xy 128.27 97.79)
		)
		(stroke
			(width 0)
			(type default)
		)
		(uuid "c2b109d4-1efd-4d11-a821-8a681c2dae57")
	)
	(wire
		(pts
			(xy 138.43 102.87) (xy 134.62 102.87)
		)
		(stroke
			(width 0)
			(type default)
		)
		(uuid "c673915e-3313-4344-bc18-25e357f41171")
	)
	(wire
		(pts
			(xy 157.48 71.12) (xy 157.48 86.36)
		)
		(stroke
			(width 0)
			(type default)
		)
		(uuid "cbd505a6-0225-46a1-963a-b72b22152a6e")
	)
	(wire
		(pts
			(xy 134.62 57.15) (xy 134.62 60.96)
		)
		(stroke
			(width 0)
			(type default)
		)
		(uuid "d0f3698e-6c30-4452-b22e-c206e36541d5")
	)
	(wire
		(pts
			(xy 134.62 102.87) (xy 134.62 109.22)
		)
		(stroke
			(width 0)
			(type default)
		)
		(uuid "d65c70ab-7697-4e38-82fd-aeb738fae6db")
	)
	(wire
		(pts
			(xy 120.65 97.79) (xy 128.27 97.79)
		)
		(stroke
			(width 0)
			(type default)
		)
		(uuid "dcb4d42e-f80c-4ea3-a8e0-ccf8d667c6ec")
	)
	(wire
		(pts
			(xy 134.62 86.36) (xy 142.24 86.36)
		)
		(stroke
			(width 0)
			(type default)
		)
		(uuid "ec423725-ccda-4058-ad9b-9a1f634fa058")
	)
	(text "1/4W metal film"
		(exclude_from_sim no)
		(at 117.856 135.636 0)
		(effects
			(font
				(size 1.27 1.27)
			)
		)
		(uuid "01e9be0b-e8b4-49ab-834b-e9bb70639fff")
	)
	(text "1/4W \nmetal film"
		(exclude_from_sim no)
		(at 138.938 63.754 90)
		(effects
			(font
				(size 1.27 1.27)
			)
		)
		(uuid "5953901e-7ccd-451a-a2b4-52fe462b038a")
	)
	(text "1/4W metal film"
		(exclude_from_sim no)
		(at 119.126 100.838 0)
		(effects
			(font
				(size 1.27 1.27)
			)
		)
		(uuid "8a44242d-b130-454b-9ea5-319d00ec0d87")
	)
	(text "1/4W metal film"
		(exclude_from_sim no)
		(at 147.066 74.168 0)
		(effects
			(font
				(size 1.27 1.27)
			)
		)
		(uuid "905a5954-c145-4592-bceb-485bf7bf9f59")
	)
	(hierarchical_label "in_2"
		(shape input)
		(at 102.87 132.08 180)
		(fields_autoplaced yes)
		(effects
			(font
				(size 1.27 1.27)
			)
			(justify right)
		)
		(uuid "5e9cd261-88d9-49aa-9fc0-fc6206bb7413")
	)
	(hierarchical_label "in_1"
		(shape input)
		(at 102.87 97.79 180)
		(fields_autoplaced yes)
		(effects
			(font
				(size 1.27 1.27)
			)
			(justify right)
		)
		(uuid "cf65d622-2196-44a4-8b16-d963e665d027")
	)
	(hierarchical_label "out"
		(shape input)
		(at 171.45 100.33 0)
		(fields_autoplaced yes)
		(effects
			(font
				(size 1.27 1.27)
			)
			(justify left)
		)
		(uuid "dbc574c8-b308-4850-bce5-ce8b61db643f")
	)
	(symbol
		(lib_id "Amplifier_Operational:TL074")
		(at 146.05 100.33 0)
		(mirror x)
		(unit 4)
		(exclude_from_sim no)
		(in_bom yes)
		(on_board yes)
		(dnp no)
		(uuid "06a80905-aa87-4d31-bbaf-40a7070c62bd")
		(property "Reference" "U1"
			(at 146.05 110.49 0)
			(effects
				(font
					(size 1.27 1.27)
				)
			)
		)
		(property "Value" "TL074"
			(at 146.05 107.95 0)
			(effects
				(font
					(size 1.27 1.27)
				)
			)
		)
		(property "Footprint" "Package_SO:SOIC-14_3.9x8.7mm_P1.27mm"
			(at 144.78 102.87 0)
			(effects
				(font
					(size 1.27 1.27)
				)
				(hide yes)
			)
		)
		(property "Datasheet" "http://www.ti.com/lit/ds/symlink/tl071.pdf"
			(at 147.32 105.41 0)
			(effects
				(font
					(size 1.27 1.27)
				)
				(hide yes)
			)
		)
		(property "Description" "Quad Low-Noise JFET-Input Operational Amplifiers, DIP-14/SOIC-14"
			(at 146.05 100.33 0)
			(effects
				(font
					(size 1.27 1.27)
				)
				(hide yes)
			)
		)
		(property "LCSC" "C107644"
			(at 146.05 100.33 0)
			(effects
				(font
					(size 1.27 1.27)
				)
				(hide yes)
			)
		)
		(pin "10"
			(uuid "b1dbd8bd-0476-44b7-ab8b-47cca82c583e")
		)
		(pin "9"
			(uuid "3329ec8b-b81c-4548-a8c8-9bd6cdeea33c")
		)
		(pin "14"
			(uuid "b3a98bc9-dac6-4037-9491-d039ebe0ca5b")
		)
		(pin "13"
			(uuid "281d89b7-8aef-4a2b-ba65-bb7fdc93cc7d")
		)
		(pin "8"
			(uuid "59fb827a-1ba7-4ec6-9ea0-d4721121795d")
		)
		(pin "5"
			(uuid "1c4ebc42-7513-4796-b27d-b77b339029d7")
		)
		(pin "7"
			(uuid "3d60ff66-5492-4d38-afc9-be4aef02dc64")
		)
		(pin "6"
			(uuid "fef28174-f798-4958-a3d7-ea6eb45957e4")
		)
		(pin "12"
			(uuid "d26cb3bb-b1c8-476a-bde4-dad273ac356c")
		)
		(pin "11"
			(uuid "c4890e4d-bd30-4ca5-9597-2be8f657846a")
		)
		(pin "1"
			(uuid "23c7ba26-714c-4c97-a5ab-382c29c49d75")
		)
		(pin "3"
			(uuid "6efa84f7-e5e8-4537-b541-92f2d5909ae1")
		)
		(pin "2"
			(uuid "78a035bf-eb30-4f5e-9023-1b9ceb6b7662")
		)
		(pin "4"
			(uuid "09ef9357-3263-42cc-99ae-11c808d6be9b")
		)
		(instances
			(project "BufferedMultiple"
				(path "/2d0a5d12-d9ab-431e-bbbb-44aaa454dfb7/d4dbb936-c863-4fdc-a5da-d2768d73907a"
					(reference "U1")
					(unit 4)
				)
			)
		)
	)
	(symbol
		(lib_id "Switch:SW_SPDT")
		(at 146.05 57.15 0)
		(unit 1)
		(exclude_from_sim no)
		(in_bom yes)
		(on_board yes)
		(dnp no)
		(fields_autoplaced yes)
		(uuid "3c8a8a4f-17f2-44dd-8916-a40fe474880a")
		(property "Reference" "SW1"
			(at 146.05 48.26 0)
			(effects
				(font
					(size 1.27 1.27)
				)
			)
		)
		(property "Value" "SW_SPDT"
			(at 146.05 50.8 0)
			(effects
				(font
					(size 1.27 1.27)
				)
			)
		)
		(property "Footprint" "Switches:Dailywell 2TES1M2RES"
			(at 146.05 57.15 0)
			(effects
				(font
					(size 1.27 1.27)
				)
				(hide yes)
			)
		)
		(property "Datasheet" "https://datasheet.lcsc.com/lcsc/2004022116_Dailywell-2TES1M2RES_C497115.pdf"
			(at 146.05 64.77 0)
			(effects
				(font
					(size 1.27 1.27)
				)
				(hide yes)
			)
		)
		(property "Description" "Switch, single pole double throw"
			(at 146.05 57.15 0)
			(effects
				(font
					(size 1.27 1.27)
				)
				(hide yes)
			)
		)
		(property "LCSC" "C497115"
			(at 146.05 57.15 0)
			(effects
				(font
					(size 1.27 1.27)
				)
				(hide yes)
			)
		)
		(pin "1"
			(uuid "5f60d5e9-ed85-4aa7-a93b-dcc3d6dab27d")
		)
		(pin "3"
			(uuid "de04ce3d-695b-4b8a-a3b5-cd898f207d0b")
		)
		(pin "2"
			(uuid "66cdb427-0344-4f62-8ffe-2ac293bb73c9")
		)
		(instances
			(project "BufferedMultiple"
				(path "/2d0a5d12-d9ab-431e-bbbb-44aaa454dfb7/d4dbb936-c863-4fdc-a5da-d2768d73907a"
					(reference "SW1")
					(unit 1)
				)
			)
		)
	)
	(symbol
		(lib_id "power:GND")
		(at 134.62 109.22 0)
		(unit 1)
		(exclude_from_sim no)
		(in_bom yes)
		(on_board yes)
		(dnp no)
		(fields_autoplaced yes)
		(uuid "4bb54765-e8cd-474e-beb6-484cf3564a2f")
		(property "Reference" "#PWR08"
			(at 134.62 115.57 0)
			(effects
				(font
					(size 1.27 1.27)
				)
				(hide yes)
			)
		)
		(property "Value" "GND"
			(at 134.62 114.3 0)
			(effects
				(font
					(size 1.27 1.27)
				)
			)
		)
		(property "Footprint" ""
			(at 134.62 109.22 0)
			(effects
				(font
					(size 1.27 1.27)
				)
				(hide yes)
			)
		)
		(property "Datasheet" ""
			(at 134.62 109.22 0)
			(effects
				(font
					(size 1.27 1.27)
				)
				(hide yes)
			)
		)
		(property "Description" "Power symbol creates a global label with name \"GND\" , ground"
			(at 134.62 109.22 0)
			(effects
				(font
					(size 1.27 1.27)
				)
				(hide yes)
			)
		)
		(pin "1"
			(uuid "beaa060a-c710-4b3a-8a37-2302bc5be40d")
		)
		(instances
			(project "BufferedMultiple"
				(path "/2d0a5d12-d9ab-431e-bbbb-44aaa454dfb7/d4dbb936-c863-4fdc-a5da-d2768d73907a"
					(reference "#PWR08")
					(unit 1)
				)
			)
		)
	)
	(symbol
		(lib_id "Device:R")
		(at 134.62 64.77 180)
		(unit 1)
		(exclude_from_sim no)
		(in_bom yes)
		(on_board yes)
		(dnp no)
		(fields_autoplaced yes)
		(uuid "7fc33495-5c70-4364-bae3-58abc640405b")
		(property "Reference" "R5"
			(at 128.27 64.77 90)
			(effects
				(font
					(size 1.27 1.27)
				)
			)
		)
		(property "Value" "100k(1%)"
			(at 130.81 64.77 90)
			(effects
				(font
					(size 1.27 1.27)
				)
			)
		)
		(property "Footprint" "Resistor_SMD:R_MELF_MMB-0207"
			(at 136.398 64.77 90)
			(effects
				(font
					(size 1.27 1.27)
				)
				(hide yes)
			)
		)
		(property "Datasheet" "https://datasheet.lcsc.com/lcsc/2304140030_RESI-LMERW330F100KQ9L_C720012.pdf"
			(at 134.62 64.77 0)
			(effects
				(font
					(size 1.27 1.27)
				)
				(hide yes)
			)
		)
		(property "Description" "Resistor"
			(at 134.62 64.77 0)
			(effects
				(font
					(size 1.27 1.27)
				)
				(hide yes)
			)
		)
		(property "LCSC" "C720012"
			(at 134.62 64.77 90)
			(effects
				(font
					(size 1.27 1.27)
				)
				(hide yes)
			)
		)
		(pin "1"
			(uuid "27ad8523-a09c-4db5-9bef-307389d16153")
		)
		(pin "2"
			(uuid "399d6b26-3ae6-46c5-aead-bca5181011c1")
		)
		(instances
			(project "BufferedMultiple"
				(path "/2d0a5d12-d9ab-431e-bbbb-44aaa454dfb7/d4dbb936-c863-4fdc-a5da-d2768d73907a"
					(reference "R5")
					(unit 1)
				)
			)
		)
	)
	(symbol
		(lib_id "Device:R")
		(at 116.84 132.08 90)
		(unit 1)
		(exclude_from_sim no)
		(in_bom yes)
		(on_board yes)
		(dnp no)
		(fields_autoplaced yes)
		(uuid "8e1c0fcf-ad4c-40af-bc31-751f82816abe")
		(property "Reference" "R4"
			(at 116.84 125.73 90)
			(effects
				(font
					(size 1.27 1.27)
				)
			)
		)
		(property "Value" "100k(1%)"
			(at 116.84 128.27 90)
			(effects
				(font
					(size 1.27 1.27)
				)
			)
		)
		(property "Footprint" "Resistor_SMD:R_MELF_MMB-0207"
			(at 116.84 133.858 90)
			(effects
				(font
					(size 1.27 1.27)
				)
				(hide yes)
			)
		)
		(property "Datasheet" "https://datasheet.lcsc.com/lcsc/2304140030_RESI-LMERW330F100KQ9L_C720012.pdf"
			(at 116.84 132.08 0)
			(effects
				(font
					(size 1.27 1.27)
				)
				(hide yes)
			)
		)
		(property "Description" "Resistor"
			(at 116.84 132.08 0)
			(effects
				(font
					(size 1.27 1.27)
				)
				(hide yes)
			)
		)
		(property "LCSC" "C720012"
			(at 116.84 132.08 90)
			(effects
				(font
					(size 1.27 1.27)
				)
				(hide yes)
			)
		)
		(pin "1"
			(uuid "8f7fd144-f5e1-44b5-8eda-7fa08602ced3")
		)
		(pin "2"
			(uuid "4fa4cfde-68e1-408c-a929-8e182c985cac")
		)
		(instances
			(project "BufferedMultiple"
				(path "/2d0a5d12-d9ab-431e-bbbb-44aaa454dfb7/d4dbb936-c863-4fdc-a5da-d2768d73907a"
					(reference "R4")
					(unit 1)
				)
			)
		)
	)
	(symbol
		(lib_id "Device:C")
		(at 146.05 86.36 90)
		(unit 1)
		(exclude_from_sim no)
		(in_bom yes)
		(on_board yes)
		(dnp no)
		(fields_autoplaced yes)
		(uuid "ccf18145-f7cb-4004-8d7c-e71d902e50ac")
		(property "Reference" "C7"
			(at 146.05 78.74 90)
			(effects
				(font
					(size 1.27 1.27)
				)
			)
		)
		(property "Value" "10p"
			(at 146.05 81.28 90)
			(effects
				(font
					(size 1.27 1.27)
				)
			)
		)
		(property "Footprint" "Capacitor_SMD:C_0603_1608Metric"
			(at 149.86 85.3948 0)
			(effects
				(font
					(size 1.27 1.27)
				)
				(hide yes)
			)
		)
		(property "Datasheet" "https://datasheet.lcsc.com/lcsc/2304140030_Walsin-Tech-Corp-0603N100F500CT_C458889.pdf"
			(at 146.05 86.36 0)
			(effects
				(font
					(size 1.27 1.27)
				)
				(hide yes)
			)
		)
		(property "Description" "Unpolarized capacitor"
			(at 146.05 86.36 0)
			(effects
				(font
					(size 1.27 1.27)
				)
				(hide yes)
			)
		)
		(property "LCSC" "C458889"
			(at 146.05 86.36 90)
			(effects
				(font
					(size 1.27 1.27)
				)
				(hide yes)
			)
		)
		(pin "2"
			(uuid "13ca2690-0248-4316-baf3-163be577277a")
		)
		(pin "1"
			(uuid "775b92b8-449b-4d6e-88f2-9d29ac0b1790")
		)
		(instances
			(project "BufferedMultiple"
				(path "/2d0a5d12-d9ab-431e-bbbb-44aaa454dfb7/d4dbb936-c863-4fdc-a5da-d2768d73907a"
					(reference "C7")
					(unit 1)
				)
			)
		)
	)
	(symbol
		(lib_id "Device:R")
		(at 146.05 71.12 90)
		(unit 1)
		(exclude_from_sim no)
		(in_bom yes)
		(on_board yes)
		(dnp no)
		(fields_autoplaced yes)
		(uuid "e593c9cb-40e8-49c2-8572-bf53c8c81484")
		(property "Reference" "R6"
			(at 146.05 64.77 90)
			(effects
				(font
					(size 1.27 1.27)
				)
			)
		)
		(property "Value" "100k(1%)"
			(at 146.05 67.31 90)
			(effects
				(font
					(size 1.27 1.27)
				)
			)
		)
		(property "Footprint" "Resistor_SMD:R_MELF_MMB-0207"
			(at 146.05 72.898 90)
			(effects
				(font
					(size 1.27 1.27)
				)
				(hide yes)
			)
		)
		(property "Datasheet" "https://datasheet.lcsc.com/lcsc/2304140030_RESI-LMERW330F100KQ9L_C720012.pdf"
			(at 146.05 71.12 0)
			(effects
				(font
					(size 1.27 1.27)
				)
				(hide yes)
			)
		)
		(property "Description" "Resistor"
			(at 146.05 71.12 0)
			(effects
				(font
					(size 1.27 1.27)
				)
				(hide yes)
			)
		)
		(property "LCSC" "C720012"
			(at 146.05 71.12 90)
			(effects
				(font
					(size 1.27 1.27)
				)
				(hide yes)
			)
		)
		(pin "1"
			(uuid "60c2a42b-ebde-4f51-8c23-4569e68ab7c5")
		)
		(pin "2"
			(uuid "f7f2c13b-91b3-47a1-ab9b-f47916a9e965")
		)
		(instances
			(project "BufferedMultiple"
				(path "/2d0a5d12-d9ab-431e-bbbb-44aaa454dfb7/d4dbb936-c863-4fdc-a5da-d2768d73907a"
					(reference "R6")
					(unit 1)
				)
			)
		)
	)
	(symbol
		(lib_id "Device:R")
		(at 116.84 97.79 90)
		(unit 1)
		(exclude_from_sim no)
		(in_bom yes)
		(on_board yes)
		(dnp no)
		(fields_autoplaced yes)
		(uuid "f9d78deb-213c-419d-b4d6-c0f6d57261e1")
		(property "Reference" "R3"
			(at 116.84 91.44 90)
			(effects
				(font
					(size 1.27 1.27)
				)
			)
		)
		(property "Value" "100k(1%)"
			(at 116.84 93.98 90)
			(effects
				(font
					(size 1.27 1.27)
				)
			)
		)
		(property "Footprint" "Resistor_SMD:R_MELF_MMB-0207"
			(at 116.84 99.568 90)
			(effects
				(font
					(size 1.27 1.27)
				)
				(hide yes)
			)
		)
		(property "Datasheet" "https://datasheet.lcsc.com/lcsc/2304140030_RESI-LMERW330F100KQ9L_C720012.pdf"
			(at 116.84 97.79 0)
			(effects
				(font
					(size 1.27 1.27)
				)
				(hide yes)
			)
		)
		(property "Description" "Resistor"
			(at 116.84 97.79 0)
			(effects
				(font
					(size 1.27 1.27)
				)
				(hide yes)
			)
		)
		(property "LCSC" "C720012"
			(at 116.84 97.79 90)
			(effects
				(font
					(size 1.27 1.27)
				)
				(hide yes)
			)
		)
		(pin "1"
			(uuid "417c3b54-7786-48ed-ace1-fcdb6a08c65f")
		)
		(pin "2"
			(uuid "dcf6c2bd-21f1-4d2e-a94e-98b21ba637ef")
		)
		(instances
			(project "BufferedMultiple"
				(path "/2d0a5d12-d9ab-431e-bbbb-44aaa454dfb7/d4dbb936-c863-4fdc-a5da-d2768d73907a"
					(reference "R3")
					(unit 1)
				)
			)
		)
	)
)
