999
"DXF R12 Output" (www.mydxf.blogspot.com)
 0 
SECTION
 2 
HEADER
 9 
$ACADVER
 1 
AC1009
 9 
$EXTMIN
 10 
 0 
 20 
 0 
 9 
$EXTMAX
 10 
 8.5 
 20 
 11 
 0 
ENDSEC
 0 
SECTION
 2 
ENTITIES
0
LINE
8
EuroPanel
10
32.404700
20
240.106000
11
143.804700
21
240.106000
0
LINE
8
EuroPanel
10
143.804700
20
240.106000
11
143.804700
21
111.606000
0
LINE
8
EuroPanel
10
143.804700
20
111.606000
11
32.404700
21
111.606000
0
LINE
8
EuroPanel
10
32.404700
20
111.606000
11
32.404700
21
240.106000
0
LINE
8
EuroPanel
10
38.754700
20
116.206000
11
41.054700
21
116.206000
0
LINE
8
EuroPanel
10
41.054700
20
116.206000
11
41.666993
21
116.084207
0
LINE
8
EuroPanel
10
41.666993
20
116.084207
11
42.186071
21
115.737371
0
LINE
8
EuroPanel
10
42.186071
20
115.737371
11
42.532907
21
115.218293
0
LINE
8
EuroPanel
10
42.532907
20
115.218293
11
42.654700
21
114.606000
0
LINE
8
EuroPanel
10
42.654700
20
114.606000
11
42.654700
21
114.606000
0
LINE
8
EuroPanel
10
42.654700
20
114.606000
11
42.532907
21
113.993707
0
LINE
8
EuroPanel
10
42.532907
20
113.993707
11
42.186071
21
113.474629
0
LINE
8
EuroPanel
10
42.186071
20
113.474629
11
41.666993
21
113.127793
0
LINE
8
EuroPanel
10
41.666993
20
113.127793
11
41.054700
21
113.006000
0
LINE
8
EuroPanel
10
41.054700
20
113.006000
11
38.754700
21
113.006000
0
LINE
8
EuroPanel
10
38.754700
20
113.006000
11
38.142407
21
113.127793
0
LINE
8
EuroPanel
10
38.142407
20
113.127793
11
37.623329
21
113.474629
0
LINE
8
EuroPanel
10
37.623329
20
113.474629
11
37.276493
21
113.993707
0
LINE
8
EuroPanel
10
37.276493
20
113.993707
11
37.154700
21
114.606000
0
LINE
8
EuroPanel
10
37.154700
20
114.606000
11
37.154700
21
114.606000
0
LINE
8
EuroPanel
10
37.154700
20
114.606000
11
37.276493
21
115.218293
0
LINE
8
EuroPanel
10
37.276493
20
115.218293
11
37.623329
21
115.737371
0
LINE
8
EuroPanel
10
37.623329
20
115.737371
11
38.142407
21
116.084207
0
LINE
8
EuroPanel
10
38.142407
20
116.084207
11
38.754700
21
116.206000
0
LINE
8
EuroPanel
10
38.754700
20
116.206000
11
38.754700
21
116.206000
0
LINE
8
EuroPanel
10
38.754700
20
238.706000
11
41.054700
21
238.706000
0
LINE
8
EuroPanel
10
41.054700
20
238.706000
11
41.666993
21
238.584207
0
LINE
8
EuroPanel
10
41.666993
20
238.584207
11
42.186071
21
238.237371
0
LINE
8
EuroPanel
10
42.186071
20
238.237371
11
42.532907
21
237.718293
0
LINE
8
EuroPanel
10
42.532907
20
237.718293
11
42.654700
21
237.106000
0
LINE
8
EuroPanel
10
42.654700
20
237.106000
11
42.654700
21
237.106000
0
LINE
8
EuroPanel
10
42.654700
20
237.106000
11
42.532907
21
236.493707
0
LINE
8
EuroPanel
10
42.532907
20
236.493707
11
42.186071
21
235.974629
0
LINE
8
EuroPanel
10
42.186071
20
235.974629
11
41.666993
21
235.627793
0
LINE
8
EuroPanel
10
41.666993
20
235.627793
11
41.054700
21
235.506000
0
LINE
8
EuroPanel
10
41.054700
20
235.506000
11
38.754700
21
235.506000
0
LINE
8
EuroPanel
10
38.754700
20
235.506000
11
38.142407
21
235.627793
0
LINE
8
EuroPanel
10
38.142407
20
235.627793
11
37.623329
21
235.974629
0
LINE
8
EuroPanel
10
37.623329
20
235.974629
11
37.276493
21
236.493707
0
LINE
8
EuroPanel
10
37.276493
20
236.493707
11
37.154700
21
237.106000
0
LINE
8
EuroPanel
10
37.154700
20
237.106000
11
37.154700
21
237.106000
0
LINE
8
EuroPanel
10
37.154700
20
237.106000
11
37.276493
21
237.718293
0
LINE
8
EuroPanel
10
37.276493
20
237.718293
11
37.623329
21
238.237371
0
LINE
8
EuroPanel
10
37.623329
20
238.237371
11
38.142407
21
238.584207
0
LINE
8
EuroPanel
10
38.142407
20
238.584207
11
38.754700
21
238.706000
0
LINE
8
EuroPanel
10
38.754700
20
238.706000
11
38.754700
21
238.706000
0
LINE
8
EuroPanel
10
135.274700
20
116.206000
11
137.574700
21
116.206000
0
LINE
8
EuroPanel
10
137.574700
20
116.206000
11
138.186993
21
116.084207
0
LINE
8
EuroPanel
10
138.186993
20
116.084207
11
138.706071
21
115.737371
0
LINE
8
EuroPanel
10
138.706071
20
115.737371
11
139.052907
21
115.218293
0
LINE
8
EuroPanel
10
139.052907
20
115.218293
11
139.174700
21
114.606000
0
LINE
8
EuroPanel
10
139.174700
20
114.606000
11
139.174700
21
114.606000
0
LINE
8
EuroPanel
10
139.174700
20
114.606000
11
139.052907
21
113.993707
0
LINE
8
EuroPanel
10
139.052907
20
113.993707
11
138.706071
21
113.474629
0
LINE
8
EuroPanel
10
138.706071
20
113.474629
11
138.186993
21
113.127793
0
LINE
8
EuroPanel
10
138.186993
20
113.127793
11
137.574700
21
113.006000
0
LINE
8
EuroPanel
10
137.574700
20
113.006000
11
135.274700
21
113.006000
0
LINE
8
EuroPanel
10
135.274700
20
113.006000
11
134.662407
21
113.127793
0
LINE
8
EuroPanel
10
134.662407
20
113.127793
11
134.143329
21
113.474629
0
LINE
8
EuroPanel
10
134.143329
20
113.474629
11
133.796493
21
113.993707
0
LINE
8
EuroPanel
10
133.796493
20
113.993707
11
133.674700
21
114.606000
0
LINE
8
EuroPanel
10
133.674700
20
114.606000
11
133.674700
21
114.606000
0
LINE
8
EuroPanel
10
133.674700
20
114.606000
11
133.796493
21
115.218293
0
LINE
8
EuroPanel
10
133.796493
20
115.218293
11
134.143329
21
115.737371
0
LINE
8
EuroPanel
10
134.143329
20
115.737371
11
134.662407
21
116.084207
0
LINE
8
EuroPanel
10
134.662407
20
116.084207
11
135.274700
21
116.206000
0
LINE
8
EuroPanel
10
135.274700
20
116.206000
11
135.274700
21
116.206000
0
LINE
8
EuroPanel
10
135.274700
20
238.706000
11
137.574700
21
238.706000
0
LINE
8
EuroPanel
10
137.574700
20
238.706000
11
138.186993
21
238.584207
0
LINE
8
EuroPanel
10
138.186993
20
238.584207
11
138.706071
21
238.237371
0
LINE
8
EuroPanel
10
138.706071
20
238.237371
11
139.052907
21
237.718293
0
LINE
8
EuroPanel
10
139.052907
20
237.718293
11
139.174700
21
237.106000
0
LINE
8
EuroPanel
10
139.174700
20
237.106000
11
139.174700
21
237.106000
0
LINE
8
EuroPanel
10
139.174700
20
237.106000
11
139.052907
21
236.493707
0
LINE
8
EuroPanel
10
139.052907
20
236.493707
11
138.706071
21
235.974629
0
LINE
8
EuroPanel
10
138.706071
20
235.974629
11
138.186993
21
235.627793
0
LINE
8
EuroPanel
10
138.186993
20
235.627793
11
137.574700
21
235.506000
0
LINE
8
EuroPanel
10
137.574700
20
235.506000
11
135.274700
21
235.506000
0
LINE
8
EuroPanel
10
135.274700
20
235.506000
11
134.662407
21
235.627793
0
LINE
8
EuroPanel
10
134.662407
20
235.627793
11
134.143329
21
235.974629
0
LINE
8
EuroPanel
10
134.143329
20
235.974629
11
133.796493
21
236.493707
0
LINE
8
EuroPanel
10
133.796493
20
236.493707
11
133.674700
21
237.106000
0
LINE
8
EuroPanel
10
133.674700
20
237.106000
11
133.674700
21
237.106000
0
LINE
8
EuroPanel
10
133.674700
20
237.106000
11
133.796493
21
237.718293
0
LINE
8
EuroPanel
10
133.796493
20
237.718293
11
134.143329
21
238.237371
0
LINE
8
EuroPanel
10
134.143329
20
238.237371
11
134.662407
21
238.584207
0
LINE
8
EuroPanel
10
134.662407
20
238.584207
11
135.274700
21
238.706000
0
LINE
8
EuroPanel
10
135.274700
20
238.706000
11
135.274700
21
238.706000
 0 
ENDSEC
 0 
EOF