%YAML 1.1
%TAG !u! tag:unity3d.com,2011:
--- !u!21 &2100000
Material:
  serializedVersion: 6
  m_ObjectHideFlags: 0
  m_CorrespondingSourceObject: {fileID: 0}
  m_PrefabInstance: {fileID: 0}
  m_PrefabAsset: {fileID: 0}
  m_Name: Teleportation_WeatherText
  m_Shader: {fileID: 4800000, guid: 0293be427a75a497bab73547fb7f3f3b, type: 3}
  m_ShaderKeywords: _CHANGEEFFECT_ON _CHANGEXY_ON _REVERSE_ON
  m_LightmapFlags: 0
  m_EnableInstancingVariants: 0
  m_DoubleSidedGI: 0
  m_CustomRenderQueue: 4000
  stringTagMap: {}
  disabledShaderPasses: []
  m_SavedProperties:
    serializedVersion: 3
    m_TexEnvs:
    - _Albedo:
        m_Texture: {fileID: 0}
        m_Scale: {x: 1, y: 1}
        m_Offset: {x: 0, y: 0}
    - _AmbientOcclusion:
        m_Texture: {fileID: 0}
        m_Scale: {x: 1, y: 1}
        m_Offset: {x: 0, y: 0}
    - _Ambient_Occlusion:
        m_Texture: {fileID: 2800000, guid: 259cb12a7dd23674ebe715a3cda9fc1f, type: 3}
        m_Scale: {x: 1, y: 1}
        m_Offset: {x: 0, y: 0}
    - _BumpMap:
        m_Texture: {fileID: 0}
        m_Scale: {x: 1, y: 1}
        m_Offset: {x: 0, y: 0}
    - _DetailAlbedoMap:
        m_Texture: {fileID: 0}
        m_Scale: {x: 1, y: 1}
        m_Offset: {x: 0, y: 0}
    - _DetailMask:
        m_Texture: {fileID: 0}
        m_Scale: {x: 1, y: 1}
        m_Offset: {x: 0, y: 0}
    - _DetailNormalMap:
        m_Texture: {fileID: 0}
        m_Scale: {x: 1, y: 1}
        m_Offset: {x: 0, y: 0}
    - _EmissionMap:
        m_Texture: {fileID: 0}
        m_Scale: {x: 1, y: 1}
        m_Offset: {x: 0, y: 0}
    - _MainTex:
        m_Texture: {fileID: 0}
        m_Scale: {x: 1, y: 1}
        m_Offset: {x: 0, y: 0}
    - _Main_Texture:
        m_Texture: {fileID: 2800000, guid: 095018d096363440792dde10fa914ccc, type: 3}
        m_Scale: {x: 20, y: 20}
        m_Offset: {x: 0, y: 0}
    - _MetallicGlossMap:
        m_Texture: {fileID: 0}
        m_Scale: {x: 1, y: 1}
        m_Offset: {x: 0, y: 0}
    - _Metallic_Map:
        m_Texture: {fileID: 2800000, guid: 1a3bedba980378442aaecf1de95da5ed, type: 3}
        m_Scale: {x: 1, y: 1}
        m_Offset: {x: 0, y: 0}
    - _Normal:
        m_Texture: {fileID: 2800000, guid: 25b7a270665f27e4fa843cb6006414fa, type: 3}
        m_Scale: {x: 1, y: 1}
        m_Offset: {x: 0, y: 0}
    - _NormalMap:
        m_Texture: {fileID: 0}
        m_Scale: {x: 1, y: 1}
        m_Offset: {x: 0, y: 0}
    - _OcclusionMap:
        m_Texture: {fileID: 0}
        m_Scale: {x: 1, y: 1}
        m_Offset: {x: 0, y: 0}
    - _ParallaxMap:
        m_Texture: {fileID: 0}
        m_Scale: {x: 1, y: 1}
        m_Offset: {x: 0, y: 0}
    - _Smoothness_Map:
        m_Texture: {fileID: 2800000, guid: 095018d096363440792dde10fa914ccc, type: 3}
        m_Scale: {x: 20, y: 20}
        m_Offset: {x: 0, y: 0}
    - _texcoord:
        m_Texture: {fileID: 0}
        m_Scale: {x: 1, y: 1}
        m_Offset: {x: 0, y: 0}
    m_Floats:
    - _Alpha_Bias: 2.57
    - _Booster: 1
    - _BumpScale: 1
    - _ChangeEffect: 1
    - _ChangeXY: 1
    - _Cutoff: 0.5
    - _DetailNormalMapScale: 1
    - _DstBlend: 0
    - _Effect: 0
    - _GlossMapScale: 1
    - _Glossiness: 0.5
    - _GlossyReflections: 1
    - _Level: 0.84
    - _LineNoiseScale: 15
    - _LineNoiseSpeed: 1
    - _LineNoiseThickness: 0.2
    - _Mask_Smoothness: 1.23
    - _Metallic: 0
    - _Mode: 0
    - _NegativeNumber: -1
    - _NoiseScale: 28.53
    - _Noise_Tilling: -0.04
    - _NormalNoiseBooster: 1
    - _NormalNoiseSpeed: 1
    - _OcclusionStrength: 1
    - _OffsetStrength: 0
    - _Opacity: 1
    - _OpacityB_Bias: 16.23
    - _Parallax: 0.02
    - _PositiveNumber: 1
    - _Range: -10
    - _Reverse: 1
    - _Smoothness: 0.5
    - _SmoothnessTextureChannel: 0
    - _SpecularHighlights: 1
    - _Speed: 5.11
    - _Speed2: 1
    - _SrcBlend: 1
    - _Suction_Bias: 0.9
    - _Teleport: -1.23
    - _Thickness: 0.14
    - _TimeScale: 10
    - _ToggleSwitch0: 0
    - _UVSec: 0
    - _VertexDef_NoiseTilling: 10.4
    - _ZWrite: 1
    - __dirty: 0
    m_Colors:
    - _Color: {r: 1, g: 1, b: 1, a: 1}
    - _EmissionColor: {r: 0, g: 0, b: 0, a: 1}
    - _Emissive_Color: {r: 1, g: 1, b: 1, a: 0}
    - _Emmission_Noise_Tiling: {r: 25, g: 25, b: 0, a: 0}
    - _GlowColor: {r: 0.7058824, g: 3.372549, b: 3.8431373, a: 0.45490196}
    - _Main_Color: {r: 1, g: 1, b: 1, a: 0}
    - _Metallic: {r: 1, g: 1, b: 1, a: 0}
    - _No_Emissive: {r: 1, g: 1, b: 1, a: 0}
    - _NormalNoiseTiling: {r: 25, g: 25, b: 0, a: 0}
    - _OpacityB_NoiseTilling: {r: 10, g: 10, b: 0, a: 0}
    - _Shifting_Direction: {r: 0.5, g: 0, b: 0, a: 0}
    - _Smoothness: {r: 1, g: 1, b: 1, a: 0}
    - _Tiling: {r: 200, g: 200, b: 0, a: 0}
    - _Tilling: {r: 55, g: 55, b: 0, a: 0}
    - _Tint: {r: 0.23529413, g: 0.2627451, b: 0.29803923, a: 1}
    - _Vector0: {r: 25, g: 25, b: 0, a: 0}
