<svg xmlns="http://www.w3.org/2000/svg" width="30.652" height="30.898" viewBox="0 0 30.652 30.898">
  <path id="iconmonstr-magnifier-2" d="M30.652,27.867l-7.988-7.988a12.534,12.534,0,1,0-3.073,2.988L27.621,30.9ZM3.674,12.527a8.854,8.854,0,1,1,8.854,8.854A8.864,8.864,0,0,1,3.674,12.527Z" transform="translate(0)" fill="#fff"/>
</svg>
