{
    "name": "srd-heros-et-dragons",
    "title": "srd-heros-et-dragons",
    "description": "<p>intègre le srd de héros et dragons, s'utilise avec le system DnD5e<p><p> *** Rejoignez la communauté Discord FR :<a href='https://discord.gg/pPSDNJk'> https://discord.gg/pPSDNJk </a></p>",
    "version": "2.0.6",

    "minimumCoreVersion": "0.5",
    "compatibleCoreVersion": "0.7.8",

    "systems": ["dnd5e"],

    "author": "Rwanoux, Rodskin, Elfenduil, Hara, Cimeryl, Ombreloup",


    "esmodules": [
        "./srd-heros-et-dragons.js",
        "./modules/aidecrea/initSuivi.js",
        "./ressources_class.js"
        

    ],

    "styles": [
        "./style/aideRegles.css",
        "./style/ressources_class.css"
    ],
    "packs": [{
            "name": "h-d-dons",
            "label": "H&D - Dons",
            "path": "packs/h-d-dons.db",
            "entity": "Item",
            "module": "srd-heros-et-dragons"
        },
        {
            "name": "h-d-capacites-de-classes",
            "label": "H&D - Capacités de Classes",
            "path": "packs/h-d-capacites-de-classes.db",
            "entity": "Item",
            "module": "srd-heros-et-dragons"
        },
        {
            "name": "h-d-grimoire",
            "label": "H&D - Grimoire",
            "path": "packs/h-d-grimoire.db",
            "entity": "Item",
            "module": "srd-heros-et-dragons"
        },
        {
            "name": "h-d-bestaire",
            "label": "H&D - Bestaire",
            "path": "packs/h-d-bestiaire.db",
            "entity": "Actor",
            "module": "srd-heros-et-dragons"
        },
        {
            "name": "h-d-races",
            "label": "H&D - Races",
            "path": "packs/h-d-races.db",
            "entity": "Item",
            "module": "srd-heros-et-dragons"
        },
        {
            "name": "h-d-traits-raciaux",
            "label": "H&D - Traits raciaux",
            "path": "packs/h-d-traits-raciaux.db",
            "entity": "Item",
            "module": "srd-heros-et-dragons"
        },
        {
            "name": "h-d-capacités-du-bestiaire",
            "label": "H&D - Capacités du bestiaire",
            "path": "packs/h-d-capacites-du-bestiaire.db",
            "entity": "Item",
            "module": "srd-heros-et-dragons"
        },

        {
            "name": "h-d-historiques",
            "label": "H&D - Historiques",
            "path": "packs/h-d-historiques.db",
            "entity": "Item",
            "module": "srd-heros-et-dragons"
        },
        {
            "name": "h-d-équipement-aventurier",
            "label": "H&D - Equipement d'aventurier",
            "path": "packs/h-d-equipement-aventurier.db",
            "entity": "Item",
            "module": "srd-heros-et-dragons"
        },
        {
            "name": "h-d-objets-magiques-et-trésors",
            "label": "H&D - Objets magiques et trésors",
            "path": "packs/h-d-objets-magiques-et-tresors.db",
            "entity": "Item",
            "module": "srd-heros-et-dragons"
        },
        {
            "name": "h-d-classes-et-specialisations",
            "label": "H&D - Classes et spécialisations",
            "path": "packs/h-d-classes-et-specialisations.db",
            "entity": "Item",
            "module": "srd-heros-et-dragons"
        },
        {
            "name": "h-d-tables-de-rencontres-aleatoires",
            "label": "H&D - Tables-de-rencontres-aleatoires",
            "path": "packs/h-d-tables-de-rencontres-aleatoires.db",
            "entity": "RollTable",
            "module": "srd-heros-et-dragons"
        },
        {
            "name": "h-d-tables-d'evenements-aleatoires",
            "label": "H&D - Tables-d'évènements-aleatoires",
            "path": "packs/h-d-tables-d'evenements-aleatoires.db",
            "entity": "RollTable",
            "module": "srd-heros-et-dragons"
        },
        {
            "name": "h-d-poisons-et-maladies",
            "label": "H&D - Poisons et maladies",
            "path": "packs/h-d-poisons-et-maladies.db",
            "entity": "Item",
            "module": "srd-heros-et-dragons"
        },
        {
            "name": "h-d-folies",
            "label": "H&D - Folies",
            "path": "packs/h-d-folies.db",
            "entity": "RollTable",
            "module": "srd-heros-et-dragons"
        },
        {
            "name": "h-d-pieges",
            "label": "H&D - Pièges",
            "path": "packs/h-d-pieges.db",
            "entity": "Actor",
            "module": "srd-heros-et-dragons"
        },
        {
            "name": "h-d-aptitudes-historiques",
            "label": "H&D - Aptitudes d'historiques",
            "path": "packs/h-d-aptitudes-historiques.db",
            "entity": "Item",
            "module": "srd-heros-et-dragons"
        }

    ],
    "languages": [
		{
			"lang": "fr",
			"name": "Français",
			"path": "lang/fr.json"
		}
    ],
    "dependencies": [
    {
        "name": "babele",
        "manifest": "https://gitlab.com/riccisi/foundryvtt-babele/-/blob/master/module/module.json",
        "version": "1.20"
      }, 
      {
        "name": "dnd5e_fr-FR",
        "manifest": "https://gitlab.com/baktov.sugar/foundryvtt-dnd5e-lang-fr-fr/raw/master/dnd5e_fr-FR/module.json",
        "version": "0.99.1"
    }, 
      {
        "name": "dnd5e",
        "type": "system"
      }
    ],

    "url": "https://gitlab.com/lemaire.erw/srd-heros-et-dragons.git",
    "manifest": "https://gitlab.com/lemaire.erw/srd-heros-et-dragons/-/raw/master/module.json",
    "download": "https://gitlab.com/lemaire.erw/srd-heros-et-dragons/-/archive/master/srd-heros-et-dragons-master.zip"


}