{
  "stations": {
    "asdfasdfasdfasdf-generated": {
      "location": "ss",
      "name": "Station A",
      "description": "",
      "sensors": {
        "asdf": "tinkerforge-sensor-id",
        "ssss": "tinkerforge-sensor-id2"
      }
    }
  },
  "measurements": {
    "tinkerforge-sensor-id": {
      "unix-timestamp": "value",
      "1234t5678": "3",
      "1234t5679": "3"
    },
    "tinkerforge-sensor-id2": {
      "unix-timestamp": "value",
      "1234t5678": "34",
      "1234t5679": "34"
    }
  },
  "sensors": {
    "tinkerforge-sensor-id": {
      "station": "asdfasdfasdfasdf-generated",
      "type": "temp",
      "unit": "celsius",
      "description": "Balkon Keusen"
    },
    "tinkerforge-sensor-id2": {
      "station": "asdfasdfasdfasdf-generated",
      "type": "humity",
      "unit": "percent",
      "description": "Balkon Keusen"
    }
  }
}