<mxfile host="65bd71144e">
    <diagram id="nVqXx1LRBY3j861ZDfAL" name="DevOps">
        <mxGraphModel dx="1505" dy="735" grid="1" gridSize="10" guides="1" tooltips="1" connect="1" arrows="1" fold="1" page="1" pageScale="1" pageWidth="827" pageHeight="1169" math="0" shadow="0">
            <root>
                <mxCell id="0"/>
                <mxCell id="1" parent="0"/>
                <mxCell id="ek590261b46Z-MvoifcE-30" value="" style="rounded=1;whiteSpace=wrap;html=1;" vertex="1" parent="1">
                    <mxGeometry x="43" y="120" width="741" height="270" as="geometry"/>
                </mxCell>
                <mxCell id="5" style="edgeStyle=none;html=1;entryX=0;entryY=0.5;entryDx=0;entryDy=0;" edge="1" parent="1" source="ek590261b46Z-MvoifcE-1" target="ek590261b46Z-MvoifcE-2">
                    <mxGeometry relative="1" as="geometry"/>
                </mxCell>
                <mxCell id="ek590261b46Z-MvoifcE-1" value="SDLC vs DevOps" style="rounded=0;whiteSpace=wrap;html=1;glass=0;shadow=0;" vertex="1" parent="1">
                    <mxGeometry x="94" y="560" width="120" height="60" as="geometry"/>
                </mxCell>
                <mxCell id="ek590261b46Z-MvoifcE-11" style="edgeStyle=orthogonalEdgeStyle;rounded=0;orthogonalLoop=1;jettySize=auto;html=1;entryX=0;entryY=0.5;entryDx=0;entryDy=0;" edge="1" parent="1" source="ek590261b46Z-MvoifcE-2" target="ek590261b46Z-MvoifcE-3">
                    <mxGeometry relative="1" as="geometry"/>
                </mxCell>
                <mxCell id="ek590261b46Z-MvoifcE-2" value="DevOps Infrastruktur" style="rounded=0;whiteSpace=wrap;html=1;" vertex="1" parent="1">
                    <mxGeometry x="274" y="560" width="130" height="60" as="geometry"/>
                </mxCell>
                <mxCell id="ek590261b46Z-MvoifcE-12" style="edgeStyle=orthogonalEdgeStyle;rounded=0;orthogonalLoop=1;jettySize=auto;html=1;entryX=0;entryY=0.5;entryDx=0;entryDy=0;" edge="1" parent="1" source="ek590261b46Z-MvoifcE-3" target="ek590261b46Z-MvoifcE-4">
                    <mxGeometry relative="1" as="geometry"/>
                </mxCell>
                <mxCell id="ek590261b46Z-MvoifcE-3" value="Code-Repository / Git flow /&amp;nbsp;&lt;span style=&quot;background-color: initial;&quot;&gt;Working methods&lt;/span&gt;" style="rounded=0;whiteSpace=wrap;html=1;align=center;" vertex="1" parent="1">
                    <mxGeometry x="464" y="560" width="130" height="60" as="geometry"/>
                </mxCell>
                <mxCell id="ek590261b46Z-MvoifcE-13" style="edgeStyle=orthogonalEdgeStyle;rounded=0;orthogonalLoop=1;jettySize=auto;html=1;entryX=0.5;entryY=0;entryDx=0;entryDy=0;" edge="1" parent="1" source="ek590261b46Z-MvoifcE-4" target="ek590261b46Z-MvoifcE-6">
                    <mxGeometry relative="1" as="geometry"/>
                </mxCell>
                <mxCell id="ek590261b46Z-MvoifcE-4" value="Dependencies" style="rounded=0;whiteSpace=wrap;html=1;" vertex="1" parent="1">
                    <mxGeometry x="644" y="560" width="130" height="60" as="geometry"/>
                </mxCell>
                <mxCell id="ek590261b46Z-MvoifcE-14" style="edgeStyle=orthogonalEdgeStyle;rounded=0;orthogonalLoop=1;jettySize=auto;html=1;entryX=0.5;entryY=0;entryDx=0;entryDy=0;" edge="1" parent="1" source="ek590261b46Z-MvoifcE-6" target="ek590261b46Z-MvoifcE-7">
                    <mxGeometry relative="1" as="geometry"/>
                </mxCell>
                <mxCell id="ek590261b46Z-MvoifcE-6" value="CI (continuous integration)" style="rounded=0;whiteSpace=wrap;html=1;" vertex="1" parent="1">
                    <mxGeometry x="644" y="670" width="130" height="60" as="geometry"/>
                </mxCell>
                <mxCell id="14" style="edgeStyle=none;html=1;entryX=0.5;entryY=0;entryDx=0;entryDy=0;" edge="1" parent="1" source="ek590261b46Z-MvoifcE-7" target="13">
                    <mxGeometry relative="1" as="geometry"/>
                </mxCell>
                <mxCell id="ek590261b46Z-MvoifcE-7" value="CD (continuous delivery/deployment)" style="rounded=0;whiteSpace=wrap;html=1;" vertex="1" parent="1">
                    <mxGeometry x="644" y="780" width="130" height="60" as="geometry"/>
                </mxCell>
                <mxCell id="ek590261b46Z-MvoifcE-8" value="Operation" style="rounded=0;whiteSpace=wrap;html=1;dashed=1;" vertex="1" parent="1">
                    <mxGeometry x="644" y="1020" width="130" height="60" as="geometry"/>
                </mxCell>
                <mxCell id="ek590261b46Z-MvoifcE-16" value="&lt;span style=&quot;font-size: 10px;&quot;&gt;- SaaS Tools&lt;/span&gt;&lt;div style=&quot;font-size: 10px;&quot;&gt;- Agile Board&lt;/div&gt;" style="rounded=0;whiteSpace=wrap;html=1;align=left;fontSize=10;labelBackgroundColor=none;fillColor=#3399FF;" vertex="1" parent="1">
                    <mxGeometry x="279" y="650" width="120" height="60" as="geometry"/>
                </mxCell>
                <mxCell id="ek590261b46Z-MvoifcE-22" style="rounded=0;orthogonalLoop=1;jettySize=auto;html=1;entryX=0;entryY=0.5;entryDx=0;entryDy=0;exitX=1;exitY=0.5;exitDx=0;exitDy=0;endArrow=none;endFill=0;dashed=1;dashPattern=1 2;" edge="1" parent="1" source="ek590261b46Z-MvoifcE-17" target="ek590261b46Z-MvoifcE-6">
                    <mxGeometry relative="1" as="geometry"/>
                </mxCell>
                <mxCell id="ek590261b46Z-MvoifcE-17" value="&lt;div style=&quot;font-size: 10px;&quot;&gt;&lt;span style=&quot;font-size: 10px;&quot;&gt;- Build&lt;/span&gt;&lt;/div&gt;&lt;div style=&quot;font-size: 10px;&quot;&gt;- Packaging&lt;/div&gt;&lt;div style=&quot;font-size: 10px;&quot;&gt;- Testing&lt;/div&gt;" style="rounded=0;whiteSpace=wrap;html=1;align=left;fontSize=10;labelBackgroundColor=none;fillColor=#3399FF;" vertex="1" parent="1">
                    <mxGeometry x="469" y="730" width="120" height="60" as="geometry"/>
                </mxCell>
                <mxCell id="ek590261b46Z-MvoifcE-20" value="&lt;div style=&quot;font-size: 10px;&quot;&gt;- Deployment&lt;div style=&quot;font-size: 10px;&quot;&gt;- Release&lt;/div&gt;&lt;div style=&quot;font-size: 10px;&quot;&gt;- Approval&lt;/div&gt;&lt;/div&gt;" style="rounded=0;whiteSpace=wrap;html=1;align=left;fontSize=10;labelBackgroundColor=none;fillColor=#3399FF;" vertex="1" parent="1">
                    <mxGeometry x="469" y="840" width="120" height="60" as="geometry"/>
                </mxCell>
                <mxCell id="ek590261b46Z-MvoifcE-21" value="- Monitoring&lt;div style=&quot;font-size: 10px;&quot;&gt;- Security&lt;/div&gt;&lt;div style=&quot;font-size: 10px;&quot;&gt;- Stabilität&lt;/div&gt;" style="rounded=0;whiteSpace=wrap;html=1;dashed=1;align=left;fontSize=10;labelBackgroundColor=none;fillColor=#3399FF;" vertex="1" parent="1">
                    <mxGeometry x="469" y="1060" width="120" height="60" as="geometry"/>
                </mxCell>
                <mxCell id="ek590261b46Z-MvoifcE-23" style="rounded=0;orthogonalLoop=1;jettySize=auto;html=1;entryX=0;entryY=0.5;entryDx=0;entryDy=0;exitX=1;exitY=0.5;exitDx=0;exitDy=0;endArrow=none;endFill=0;dashed=1;dashPattern=1 2;" edge="1" parent="1" source="ek590261b46Z-MvoifcE-20" target="ek590261b46Z-MvoifcE-7">
                    <mxGeometry relative="1" as="geometry">
                        <mxPoint x="594" y="750" as="sourcePoint"/>
                        <mxPoint x="644" y="710" as="targetPoint"/>
                    </mxGeometry>
                </mxCell>
                <mxCell id="ek590261b46Z-MvoifcE-25" style="rounded=0;orthogonalLoop=1;jettySize=auto;html=1;entryX=0;entryY=0.5;entryDx=0;entryDy=0;exitX=1;exitY=0.5;exitDx=0;exitDy=0;endArrow=none;endFill=0;dashed=1;" edge="1" parent="1" source="ek590261b46Z-MvoifcE-21" target="ek590261b46Z-MvoifcE-8">
                    <mxGeometry relative="1" as="geometry">
                        <mxPoint x="594" y="860" as="sourcePoint"/>
                        <mxPoint x="644" y="820" as="targetPoint"/>
                    </mxGeometry>
                </mxCell>
                <mxCell id="ek590261b46Z-MvoifcE-26" style="rounded=0;orthogonalLoop=1;jettySize=auto;html=1;entryX=0.5;entryY=1;entryDx=0;entryDy=0;exitX=0.5;exitY=0;exitDx=0;exitDy=0;endArrow=none;endFill=0;dashed=1;dashPattern=1 2;" edge="1" parent="1" source="ek590261b46Z-MvoifcE-16" target="ek590261b46Z-MvoifcE-2">
                    <mxGeometry relative="1" as="geometry">
                        <mxPoint x="594" y="960" as="sourcePoint"/>
                        <mxPoint x="644" y="930" as="targetPoint"/>
                    </mxGeometry>
                </mxCell>
                <mxCell id="ek590261b46Z-MvoifcE-29" value="&lt;span style=&quot;color: rgb(0, 0, 0); font-family: Helvetica; font-size: 22px; font-style: normal; font-variant-ligatures: normal; font-variant-caps: normal; font-weight: 400; letter-spacing: normal; orphans: 2; text-align: center; text-indent: 0px; text-transform: none; widows: 2; word-spacing: 0px; -webkit-text-stroke-width: 0px; white-space: nowrap; background-color: rgb(251, 251, 251); text-decoration-thickness: initial; text-decoration-style: initial; text-decoration-color: initial; display: inline !important; float: none;&quot;&gt;DevOps Kultur&lt;/span&gt;" style="text;whiteSpace=wrap;html=1;" vertex="1" parent="1">
                    <mxGeometry x="100" y="125" width="180" height="50" as="geometry"/>
                </mxCell>
                <mxCell id="ek590261b46Z-MvoifcE-33" value="Agile &amp;amp; Lean Methoden" style="rounded=0;whiteSpace=wrap;html=1;fillColor=#dae8fc;strokeColor=#6c8ebf;" vertex="1" parent="1">
                    <mxGeometry x="230" y="175" width="120" height="60" as="geometry"/>
                </mxCell>
                <mxCell id="ek590261b46Z-MvoifcE-34" value="CALMS" style="rounded=0;whiteSpace=wrap;html=1;fillColor=#dae8fc;strokeColor=#6c8ebf;" vertex="1" parent="1">
                    <mxGeometry x="414" y="310" width="120" height="60" as="geometry"/>
                </mxCell>
                <mxCell id="ek590261b46Z-MvoifcE-35" value="The 3 ways" style="rounded=0;whiteSpace=wrap;html=1;fillColor=#dae8fc;strokeColor=#6c8ebf;" vertex="1" parent="1">
                    <mxGeometry x="390" y="140" width="120" height="60" as="geometry"/>
                </mxCell>
                <mxCell id="ek590261b46Z-MvoifcE-36" value="4 kind of work" style="rounded=0;whiteSpace=wrap;html=1;fillColor=#dae8fc;strokeColor=#6c8ebf;" vertex="1" parent="1">
                    <mxGeometry x="520" y="210" width="120" height="60" as="geometry"/>
                </mxCell>
                <mxCell id="ek590261b46Z-MvoifcE-37" value="Story telling: Erfahrungsberichte" style="rounded=0;whiteSpace=wrap;html=1;fillColor=#dae8fc;strokeColor=#6c8ebf;" vertex="1" parent="1">
                    <mxGeometry x="644" y="140" width="120" height="60" as="geometry"/>
                </mxCell>
                <mxCell id="ek590261b46Z-MvoifcE-38" value="MVP" style="rounded=0;whiteSpace=wrap;html=1;fillColor=#dae8fc;strokeColor=#6c8ebf;" vertex="1" parent="1">
                    <mxGeometry x="610" y="310" width="120" height="60" as="geometry"/>
                </mxCell>
                <mxCell id="ek590261b46Z-MvoifcE-39" value="" style="shape=flexArrow;endArrow=classic;html=1;rounded=0;endWidth=111.6346153846154;endSize=19.287499999999998;width=96.25;entryX=0.446;entryY=1.002;entryDx=0;entryDy=0;entryPerimeter=0;fillColor=#dae8fc;strokeColor=#6c8ebf;" edge="1" parent="1">
                    <mxGeometry width="50" height="50" relative="1" as="geometry">
                        <mxPoint x="424" y="500" as="sourcePoint"/>
                        <mxPoint x="423.99599999999987" y="410.00000000000017" as="targetPoint"/>
                        <Array as="points"/>
                    </mxGeometry>
                </mxCell>
                <mxCell id="6" value="Governance" style="rounded=0;whiteSpace=wrap;html=1;fillColor=#dae8fc;strokeColor=#6c8ebf;" vertex="1" parent="1">
                    <mxGeometry x="70" y="210" width="120" height="60" as="geometry"/>
                </mxCell>
                <mxCell id="7" value="DevOps in unterschiedlichen Unternehmen" style="rounded=0;whiteSpace=wrap;html=1;fillColor=#dae8fc;strokeColor=#6c8ebf;" vertex="1" parent="1">
                    <mxGeometry x="120" y="300" width="120" height="60" as="geometry"/>
                </mxCell>
                <mxCell id="15" style="edgeStyle=none;html=1;entryX=0.5;entryY=0;entryDx=0;entryDy=0;" edge="1" parent="1" source="13" target="ek590261b46Z-MvoifcE-8">
                    <mxGeometry relative="1" as="geometry"/>
                </mxCell>
                <mxCell id="13" value="Artefact Repository" style="rounded=0;whiteSpace=wrap;html=1;" vertex="1" parent="1">
                    <mxGeometry x="644" y="900" width="130" height="60" as="geometry"/>
                </mxCell>
                <mxCell id="16" value="&lt;div style=&quot;font-size: 10px;&quot;&gt;&lt;span style=&quot;font-size: 10px;&quot;&gt;- Software Inventar&lt;/span&gt;&lt;/div&gt;&lt;div style=&quot;font-size: 10px;&quot;&gt;- Dependency Scans&lt;/div&gt;&lt;div style=&quot;font-size: 10px;&quot;&gt;- Umgang mit&amp;nbsp; Abhängigkeiten&lt;/div&gt;" style="rounded=0;whiteSpace=wrap;html=1;align=left;fontSize=10;labelBackgroundColor=none;fillColor=#3399FF;" vertex="1" parent="1">
                    <mxGeometry x="469" y="640" width="120" height="60" as="geometry"/>
                </mxCell>
                <mxCell id="17" style="rounded=0;orthogonalLoop=1;jettySize=auto;html=1;exitX=1;exitY=0.5;exitDx=0;exitDy=0;endArrow=none;endFill=0;dashed=1;dashPattern=1 2;entryX=0;entryY=1;entryDx=0;entryDy=0;" edge="1" parent="1" source="16" target="ek590261b46Z-MvoifcE-4">
                    <mxGeometry relative="1" as="geometry">
                        <mxPoint x="599" y="730" as="sourcePoint"/>
                        <mxPoint x="704" y="560" as="targetPoint"/>
                    </mxGeometry>
                </mxCell>
                <mxCell id="2NsR9f0Nl42UqpfDn2xi-17" value="" style="verticalLabelPosition=bottom;sketch=0;html=1;fillColor=#282828;strokeColor=none;verticalAlign=top;pointerEvents=1;align=center;shape=mxgraph.cisco_safe.people_places_things_icons.icon9;" vertex="1" parent="1">
                    <mxGeometry x="50" y="130" width="50" height="45" as="geometry"/>
                </mxCell>
                <mxCell id="18" value="" style="shape=flexArrow;endArrow=classic;html=1;rounded=0;endWidth=111.6346153846154;endSize=19.287499999999998;width=96.25;entryX=0.446;entryY=1.002;entryDx=0;entryDy=0;entryPerimeter=0;fillColor=#dae8fc;strokeColor=#6c8ebf;" edge="1" parent="1">
                    <mxGeometry width="50" height="50" relative="1" as="geometry">
                        <mxPoint x="669.6599999999997" y="500" as="sourcePoint"/>
                        <mxPoint x="669.6559999999998" y="410.0000000000002" as="targetPoint"/>
                        <Array as="points"/>
                    </mxGeometry>
                </mxCell>
                <mxCell id="19" value="" style="shape=flexArrow;endArrow=classic;html=1;rounded=0;endWidth=111.6346153846154;endSize=19.287499999999998;width=96.25;entryX=0.446;entryY=1.002;entryDx=0;entryDy=0;entryPerimeter=0;fillColor=#dae8fc;strokeColor=#6c8ebf;" edge="1" parent="1">
                    <mxGeometry width="50" height="50" relative="1" as="geometry">
                        <mxPoint x="179.99999999999983" y="500" as="sourcePoint"/>
                        <mxPoint x="179.99599999999992" y="410.0000000000002" as="targetPoint"/>
                        <Array as="points"/>
                    </mxGeometry>
                </mxCell>
                <mxCell id="20" value="DevSecOps" style="rounded=0;whiteSpace=wrap;html=1;fillColor=#dae8fc;strokeColor=#6c8ebf;" vertex="1" parent="1">
                    <mxGeometry x="270" y="260" width="120" height="60" as="geometry"/>
                </mxCell>
            </root>
        </mxGraphModel>
    </diagram>
</mxfile>