<mxfile host="Electron" agent="Mozilla/5.0 (Macintosh; Intel Mac OS X 10_15_7) AppleWebKit/537.36 (KHTML, like Gecko) draw.io/24.7.8 Chrome/128.0.6613.36 Electron/32.0.1 Safari/537.36" version="24.7.8">
  <diagram name="Page-1" id="IstlqgeGUJWLY0Mp0zuY">
    <mxGraphModel dx="2074" dy="1139" grid="1" gridSize="10" guides="1" tooltips="1" connect="1" arrows="1" fold="1" page="1" pageScale="1" pageWidth="850" pageHeight="1100" math="0" shadow="0">
      <root>
        <mxCell id="0" />
        <mxCell id="1" parent="0" />
        <mxCell id="K39-28E4HD2hi5PUtjhr-14" style="edgeStyle=orthogonalEdgeStyle;rounded=0;orthogonalLoop=1;jettySize=auto;html=1;" edge="1" parent="1" source="K39-28E4HD2hi5PUtjhr-1" target="K39-28E4HD2hi5PUtjhr-10">
          <mxGeometry relative="1" as="geometry" />
        </mxCell>
        <mxCell id="K39-28E4HD2hi5PUtjhr-15" value="Build" style="edgeLabel;html=1;align=center;verticalAlign=middle;resizable=0;points=[];" vertex="1" connectable="0" parent="K39-28E4HD2hi5PUtjhr-14">
          <mxGeometry x="-0.1851" relative="1" as="geometry">
            <mxPoint as="offset" />
          </mxGeometry>
        </mxCell>
        <mxCell id="K39-28E4HD2hi5PUtjhr-1" value="&lt;span style=&quot;font-family: -apple-system, &amp;quot;system-ui&amp;quot;, &amp;quot;Segoe WPC&amp;quot;, &amp;quot;Segoe UI&amp;quot;, system-ui, Ubuntu, &amp;quot;Droid Sans&amp;quot;, sans-serif; font-style: normal; font-variant-ligatures: normal; font-variant-caps: normal; font-weight: 400; letter-spacing: normal; orphans: 2; text-align: left; text-indent: 0px; text-transform: none; widows: 2; word-spacing: 0px; -webkit-text-stroke-width: 0px; white-space: normal; text-decoration-thickness: initial; text-decoration-style: initial; text-decoration-color: initial; float: none; display: inline !important;&quot;&gt;&lt;font style=&quot;font-size: 13px;&quot;&gt;Artifact-Producer&lt;/font&gt;&lt;/span&gt;" style="rounded=0;whiteSpace=wrap;html=1;" vertex="1" parent="1">
          <mxGeometry x="220" y="390" width="120" height="60" as="geometry" />
        </mxCell>
        <mxCell id="K39-28E4HD2hi5PUtjhr-2" value="" style="shape=image;verticalLabelPosition=bottom;labelBackgroundColor=default;verticalAlign=top;aspect=fixed;imageAspect=0;image=https://th.bing.com/th?id=OIP.1PuzQURJzSdVxP-b00hDJgHaHa&amp;w=250&amp;h=250&amp;c=8&amp;rs=1&amp;qlt=90&amp;o=6&amp;cb=13&amp;dpr=2&amp;pid=3.1&amp;rm=2;" vertex="1" parent="1">
          <mxGeometry x="255" y="460" width="50" height="50" as="geometry" />
        </mxCell>
        <mxCell id="K39-28E4HD2hi5PUtjhr-5" style="edgeStyle=orthogonalEdgeStyle;rounded=0;orthogonalLoop=1;jettySize=auto;html=1;entryX=0;entryY=0.5;entryDx=0;entryDy=0;" edge="1" parent="1" source="K39-28E4HD2hi5PUtjhr-3" target="K39-28E4HD2hi5PUtjhr-4">
          <mxGeometry relative="1" as="geometry" />
        </mxCell>
        <mxCell id="K39-28E4HD2hi5PUtjhr-16" value="Publish" style="edgeLabel;html=1;align=center;verticalAlign=middle;resizable=0;points=[];" vertex="1" connectable="0" parent="K39-28E4HD2hi5PUtjhr-5">
          <mxGeometry x="0.05" y="-1" relative="1" as="geometry">
            <mxPoint as="offset" />
          </mxGeometry>
        </mxCell>
        <mxCell id="K39-28E4HD2hi5PUtjhr-6" style="edgeStyle=orthogonalEdgeStyle;rounded=0;orthogonalLoop=1;jettySize=auto;html=1;entryX=1;entryY=0.5;entryDx=0;entryDy=0;" edge="1" parent="1" source="K39-28E4HD2hi5PUtjhr-3" target="K39-28E4HD2hi5PUtjhr-1">
          <mxGeometry relative="1" as="geometry" />
        </mxCell>
        <mxCell id="K39-28E4HD2hi5PUtjhr-7" value="Download" style="edgeLabel;html=1;align=center;verticalAlign=middle;resizable=0;points=[];" vertex="1" connectable="0" parent="K39-28E4HD2hi5PUtjhr-6">
          <mxGeometry x="0.2364" y="-1" relative="1" as="geometry">
            <mxPoint x="18" y="1" as="offset" />
          </mxGeometry>
        </mxCell>
        <mxCell id="K39-28E4HD2hi5PUtjhr-3" value="&lt;span style=&quot;font-family: -apple-system, &amp;quot;system-ui&amp;quot;, &amp;quot;Segoe WPC&amp;quot;, &amp;quot;Segoe UI&amp;quot;, system-ui, Ubuntu, &amp;quot;Droid Sans&amp;quot;, sans-serif; text-align: left;&quot;&gt;&lt;font style=&quot;font-size: 13px;&quot;&gt;Artifact-Consumer&lt;/font&gt;&lt;/span&gt;" style="rounded=0;whiteSpace=wrap;html=1;" vertex="1" parent="1">
          <mxGeometry x="450" y="390" width="120" height="60" as="geometry" />
        </mxCell>
        <mxCell id="K39-28E4HD2hi5PUtjhr-4" value="" style="shape=image;verticalLabelPosition=bottom;labelBackgroundColor=default;verticalAlign=top;aspect=fixed;imageAspect=0;image=https://th.bing.com/th?id=OIP.7lYkLEQ03AKcHcqNNFvc1gAAAA&amp;w=231&amp;h=232&amp;c=8&amp;rs=1&amp;qlt=90&amp;o=6&amp;cb=13&amp;dpr=2&amp;pid=3.1&amp;rm=2;" vertex="1" parent="1">
          <mxGeometry x="690" y="375" width="89.73" height="90" as="geometry" />
        </mxCell>
        <mxCell id="K39-28E4HD2hi5PUtjhr-8" value="" style="shape=image;verticalLabelPosition=bottom;labelBackgroundColor=default;verticalAlign=top;aspect=fixed;imageAspect=0;image=https://th.bing.com/th?id=OIP.1PuzQURJzSdVxP-b00hDJgHaHa&amp;w=250&amp;h=250&amp;c=8&amp;rs=1&amp;qlt=90&amp;o=6&amp;cb=13&amp;dpr=2&amp;pid=3.1&amp;rm=2;" vertex="1" parent="1">
          <mxGeometry x="485" y="460" width="50" height="50" as="geometry" />
        </mxCell>
        <mxCell id="K39-28E4HD2hi5PUtjhr-12" style="edgeStyle=orthogonalEdgeStyle;rounded=0;orthogonalLoop=1;jettySize=auto;html=1;entryX=0.5;entryY=0;entryDx=0;entryDy=0;" edge="1" parent="1" source="K39-28E4HD2hi5PUtjhr-9" target="K39-28E4HD2hi5PUtjhr-10">
          <mxGeometry relative="1" as="geometry" />
        </mxCell>
        <mxCell id="K39-28E4HD2hi5PUtjhr-13" value="Import" style="edgeLabel;html=1;align=center;verticalAlign=middle;resizable=0;points=[];" vertex="1" connectable="0" parent="K39-28E4HD2hi5PUtjhr-12">
          <mxGeometry x="0.1826" y="4" relative="1" as="geometry">
            <mxPoint x="-4" as="offset" />
          </mxGeometry>
        </mxCell>
        <mxCell id="K39-28E4HD2hi5PUtjhr-9" value="" style="shape=image;verticalLabelPosition=bottom;labelBackgroundColor=default;verticalAlign=top;aspect=fixed;imageAspect=0;image=https://th.bing.com/th?id=OIP.c0iIyE2V0os2corDMYbKswHaHg&amp;w=248&amp;h=251&amp;c=8&amp;rs=1&amp;qlt=90&amp;o=6&amp;cb=13&amp;dpr=2&amp;pid=3.1&amp;rm=2;" vertex="1" parent="1">
          <mxGeometry x="60" y="170" width="98.75" height="100" as="geometry" />
        </mxCell>
        <mxCell id="K39-28E4HD2hi5PUtjhr-10" value="" style="shape=image;verticalLabelPosition=bottom;labelBackgroundColor=default;verticalAlign=top;aspect=fixed;imageAspect=0;image=https://th.bing.com/th/id/OIP.GzW1GjwlhWZnCurZKzammAAAAA?w=137&amp;h=150&amp;c=7&amp;r=0&amp;o=5&amp;dpr=2&amp;pid=1.7;" vertex="1" parent="1">
          <mxGeometry x="77.29" y="385" width="64.17" height="70" as="geometry" />
        </mxCell>
      </root>
    </mxGraphModel>
  </diagram>
</mxfile>
