<mxfile host="Electron" modified="2023-05-10T16:06:58.904Z" agent="Mozilla/5.0 (Macintosh; Intel Mac OS X 10_15_7) AppleWebKit/537.36 (KHTML, like Gecko) draw.io/21.2.8 Chrome/112.0.5615.165 Electron/24.2.0 Safari/537.36" etag="UBcBQ7w4IjK9J2lsQmob" version="21.2.8" type="device">
  <diagram name="Page-1" id="7KeCi9kcIUK0_tRbT7Pt">
    <mxGraphModel dx="1781" dy="1843" grid="1" gridSize="10" guides="1" tooltips="1" connect="1" arrows="1" fold="1" page="1" pageScale="1" pageWidth="827" pageHeight="1169" math="0" shadow="0">
      <root>
        <mxCell id="0" />
        <mxCell id="1" parent="0" />
        <mxCell id="de3uSpLbnVHqse1vQnTu-52" value="Sicheres Umfeld wie dein Office, Admin Rechner in deinem Rechenzentrum" style="rounded=0;whiteSpace=wrap;html=1;align=left;verticalAlign=top;" vertex="1" parent="1">
          <mxGeometry x="-90" y="290" width="910" height="490" as="geometry" />
        </mxCell>
        <mxCell id="de3uSpLbnVHqse1vQnTu-1" value="" style="shape=actor;whiteSpace=wrap;html=1;" vertex="1" parent="1">
          <mxGeometry x="250" y="505" width="40" height="60" as="geometry" />
        </mxCell>
        <mxCell id="de3uSpLbnVHqse1vQnTu-2" value="" style="image;points=[];aspect=fixed;html=1;align=center;shadow=0;dashed=0;image=img/lib/allied_telesis/computer_and_terminals/Personal_Computer.svg;" vertex="1" parent="1">
          <mxGeometry x="284.96" y="370" width="95.92" height="130" as="geometry" />
        </mxCell>
        <mxCell id="de3uSpLbnVHqse1vQnTu-3" value="Cloud-Provider" style="ellipse;shape=cloud;whiteSpace=wrap;html=1;" vertex="1" parent="1">
          <mxGeometry x="20" y="-80" width="270" height="160" as="geometry" />
        </mxCell>
        <mxCell id="de3uSpLbnVHqse1vQnTu-4" value="Gitlab-Repo" style="shape=cylinder3;whiteSpace=wrap;html=1;boundedLbl=1;backgroundOutline=1;size=15;" vertex="1" parent="1">
          <mxGeometry x="530" y="-20" width="60" height="80" as="geometry" />
        </mxCell>
        <mxCell id="de3uSpLbnVHqse1vQnTu-16" style="edgeStyle=orthogonalEdgeStyle;rounded=0;orthogonalLoop=1;jettySize=auto;html=1;entryX=1;entryY=0.5;entryDx=0;entryDy=0;entryPerimeter=0;" edge="1" parent="1" source="de3uSpLbnVHqse1vQnTu-5" target="de3uSpLbnVHqse1vQnTu-14">
          <mxGeometry relative="1" as="geometry" />
        </mxCell>
        <mxCell id="de3uSpLbnVHqse1vQnTu-50" style="edgeStyle=orthogonalEdgeStyle;rounded=0;orthogonalLoop=1;jettySize=auto;html=1;" edge="1" parent="1" source="de3uSpLbnVHqse1vQnTu-5" target="de3uSpLbnVHqse1vQnTu-17">
          <mxGeometry relative="1" as="geometry" />
        </mxCell>
        <mxCell id="de3uSpLbnVHqse1vQnTu-5" value="&lt;b&gt;Auftrag 2:&amp;nbsp;kurzfristig gültige Credentials erstellen&lt;br&gt;&lt;/b&gt;Erzeugen von SSH-Key-Paar auf Lokalem PC oder Admin VM und Public-Key auf Gitlab per API installieren" style="rounded=1;whiteSpace=wrap;html=1;fillColor=#ffe6cc;strokeColor=#d79b00;" vertex="1" parent="1">
          <mxGeometry x="490" y="403.6" width="320" height="46.4" as="geometry" />
        </mxCell>
        <mxCell id="de3uSpLbnVHqse1vQnTu-20" style="edgeStyle=orthogonalEdgeStyle;rounded=0;orthogonalLoop=1;jettySize=auto;html=1;exitX=0.5;exitY=1;exitDx=0;exitDy=0;entryX=0.5;entryY=0;entryDx=0;entryDy=0;entryPerimeter=0;" edge="1" parent="1" source="de3uSpLbnVHqse1vQnTu-8" target="de3uSpLbnVHqse1vQnTu-21">
          <mxGeometry relative="1" as="geometry" />
        </mxCell>
        <mxCell id="de3uSpLbnVHqse1vQnTu-8" value="&lt;b&gt;Auftrag 3:&amp;nbsp;Credentials benutzen um User-Data für Cloud-Init zu erstellen&lt;br&gt;&lt;/b&gt;In User-Data-Template SSH-Private-Key einfuegen" style="rounded=1;whiteSpace=wrap;html=1;fillColor=#ffe6cc;strokeColor=#d79b00;" vertex="1" parent="1">
          <mxGeometry x="80" y="610" width="500" height="58.2" as="geometry" />
        </mxCell>
        <mxCell id="de3uSpLbnVHqse1vQnTu-36" style="edgeStyle=orthogonalEdgeStyle;rounded=0;orthogonalLoop=1;jettySize=auto;html=1;entryX=0;entryY=0.5;entryDx=0;entryDy=0;entryPerimeter=0;" edge="1" parent="1" source="de3uSpLbnVHqse1vQnTu-13" target="de3uSpLbnVHqse1vQnTu-38">
          <mxGeometry relative="1" as="geometry">
            <Array as="points">
              <mxPoint x="40" y="150" />
            </Array>
          </mxGeometry>
        </mxCell>
        <mxCell id="de3uSpLbnVHqse1vQnTu-13" value="user-data.yml" style="strokeWidth=2;html=1;shape=mxgraph.flowchart.document2;whiteSpace=wrap;size=0.25;fillColor=#dae8fc;strokeColor=#6c8ebf;" vertex="1" parent="1">
          <mxGeometry y="680" width="100" height="60" as="geometry" />
        </mxCell>
        <mxCell id="de3uSpLbnVHqse1vQnTu-15" style="edgeStyle=orthogonalEdgeStyle;rounded=0;orthogonalLoop=1;jettySize=auto;html=1;exitX=0;exitY=0;exitDx=10;exitDy=10;exitPerimeter=0;" edge="1" parent="1" source="de3uSpLbnVHqse1vQnTu-14" target="de3uSpLbnVHqse1vQnTu-2">
          <mxGeometry relative="1" as="geometry" />
        </mxCell>
        <mxCell id="de3uSpLbnVHqse1vQnTu-19" style="edgeStyle=orthogonalEdgeStyle;rounded=0;orthogonalLoop=1;jettySize=auto;html=1;exitX=0.5;exitY=1;exitDx=0;exitDy=0;exitPerimeter=0;" edge="1" parent="1" source="de3uSpLbnVHqse1vQnTu-14" target="de3uSpLbnVHqse1vQnTu-8">
          <mxGeometry relative="1" as="geometry" />
        </mxCell>
        <mxCell id="de3uSpLbnVHqse1vQnTu-14" value="SSH-Keypaar" style="verticalLabelPosition=bottom;verticalAlign=top;html=1;shape=card;whiteSpace=wrap;size=20;arcSize=12;fillColor=#f8cecc;strokeColor=#b85450;" vertex="1" parent="1">
          <mxGeometry x="460" y="495" width="60" height="45" as="geometry" />
        </mxCell>
        <mxCell id="de3uSpLbnVHqse1vQnTu-33" style="edgeStyle=orthogonalEdgeStyle;rounded=0;orthogonalLoop=1;jettySize=auto;html=1;entryX=0.2;entryY=0.5;entryDx=0;entryDy=0;entryPerimeter=0;" edge="1" parent="1" source="de3uSpLbnVHqse1vQnTu-21" target="de3uSpLbnVHqse1vQnTu-24">
          <mxGeometry relative="1" as="geometry" />
        </mxCell>
        <mxCell id="de3uSpLbnVHqse1vQnTu-21" value="SSH-Private-Key" style="verticalLabelPosition=bottom;verticalAlign=top;html=1;shape=card;whiteSpace=wrap;size=20;arcSize=12;fillColor=#f8cecc;strokeColor=#b85450;" vertex="1" parent="1">
          <mxGeometry x="310" y="687.5" width="70" height="45" as="geometry" />
        </mxCell>
        <mxCell id="de3uSpLbnVHqse1vQnTu-22" value="user-data-template.yml" style="strokeWidth=2;html=1;shape=mxgraph.flowchart.document2;whiteSpace=wrap;size=0.25;fillColor=#dae8fc;strokeColor=#6c8ebf;" vertex="1" parent="1">
          <mxGeometry x="500" y="680" width="100" height="60" as="geometry" />
        </mxCell>
        <mxCell id="de3uSpLbnVHqse1vQnTu-29" value="" style="edgeStyle=orthogonalEdgeStyle;rounded=0;orthogonalLoop=1;jettySize=auto;html=1;exitX=0;exitY=0.5;exitDx=0;exitDy=0;exitPerimeter=0;" edge="1" parent="1" source="de3uSpLbnVHqse1vQnTu-22" target="de3uSpLbnVHqse1vQnTu-24">
          <mxGeometry relative="1" as="geometry">
            <mxPoint x="220" y="718" as="sourcePoint" />
            <mxPoint x="570" y="710" as="targetPoint" />
          </mxGeometry>
        </mxCell>
        <mxCell id="de3uSpLbnVHqse1vQnTu-34" style="edgeStyle=orthogonalEdgeStyle;rounded=0;orthogonalLoop=1;jettySize=auto;html=1;" edge="1" parent="1" source="de3uSpLbnVHqse1vQnTu-24" target="de3uSpLbnVHqse1vQnTu-13">
          <mxGeometry relative="1" as="geometry">
            <Array as="points">
              <mxPoint x="435" y="770" />
              <mxPoint x="50" y="770" />
            </Array>
          </mxGeometry>
        </mxCell>
        <mxCell id="de3uSpLbnVHqse1vQnTu-24" value="" style="html=1;verticalLabelPosition=bottom;align=center;labelBackgroundColor=#ffffff;verticalAlign=top;strokeWidth=2;strokeColor=#0080F0;shadow=0;dashed=0;shape=mxgraph.ios7.icons.add;" vertex="1" parent="1">
          <mxGeometry x="420" y="695" width="30" height="30" as="geometry" />
        </mxCell>
        <mxCell id="de3uSpLbnVHqse1vQnTu-30" value="&lt;b&gt;Auftrag 4:&amp;nbsp;Deployen der VM&lt;br&gt;&lt;/b&gt;VM mit user-data.yml auf Cloud Deployen (AWSCLI,multipass,...)" style="rounded=1;whiteSpace=wrap;html=1;fillColor=#ffe6cc;strokeColor=#d79b00;" vertex="1" parent="1">
          <mxGeometry x="-70" y="311.8" width="360" height="58.2" as="geometry" />
        </mxCell>
        <mxCell id="de3uSpLbnVHqse1vQnTu-39" style="edgeStyle=orthogonalEdgeStyle;rounded=0;orthogonalLoop=1;jettySize=auto;html=1;entryX=0;entryY=0.5;entryDx=0;entryDy=0;entryPerimeter=0;" edge="1" parent="1" source="de3uSpLbnVHqse1vQnTu-38" target="de3uSpLbnVHqse1vQnTu-4">
          <mxGeometry relative="1" as="geometry" />
        </mxCell>
        <mxCell id="de3uSpLbnVHqse1vQnTu-40" value="&lt;b&gt;Cloud-Init&lt;br&gt;&lt;/b&gt;Privates Repo Clonen mit Hilfe von SSH-Private-Key&lt;br&gt;Installation mit Hilfe von Repo zu Ende führen." style="edgeLabel;html=1;align=center;verticalAlign=middle;resizable=0;points=[];" vertex="1" connectable="0" parent="de3uSpLbnVHqse1vQnTu-39">
          <mxGeometry x="0.097" y="1" relative="1" as="geometry">
            <mxPoint x="1" y="1" as="offset" />
          </mxGeometry>
        </mxCell>
        <mxCell id="de3uSpLbnVHqse1vQnTu-38" value="" style="verticalLabelPosition=bottom;html=1;verticalAlign=top;align=center;strokeColor=none;fillColor=#00BEF2;shape=mxgraph.azure.virtual_machine_feature;pointerEvents=1;" vertex="1" parent="1">
          <mxGeometry x="130" y="15" width="50" height="45" as="geometry" />
        </mxCell>
        <mxCell id="de3uSpLbnVHqse1vQnTu-44" style="edgeStyle=orthogonalEdgeStyle;rounded=0;orthogonalLoop=1;jettySize=auto;html=1;entryX=0.56;entryY=0.422;entryDx=0;entryDy=0;entryPerimeter=0;" edge="1" parent="1" source="de3uSpLbnVHqse1vQnTu-41" target="de3uSpLbnVHqse1vQnTu-38">
          <mxGeometry relative="1" as="geometry">
            <Array as="points">
              <mxPoint x="390" y="230" />
              <mxPoint x="168" y="230" />
            </Array>
          </mxGeometry>
        </mxCell>
        <mxCell id="de3uSpLbnVHqse1vQnTu-45" value="Check Installationsprozess" style="edgeLabel;html=1;align=center;verticalAlign=middle;resizable=0;points=[];" vertex="1" connectable="0" parent="de3uSpLbnVHqse1vQnTu-44">
          <mxGeometry x="-0.1176" y="-4" relative="1" as="geometry">
            <mxPoint as="offset" />
          </mxGeometry>
        </mxCell>
        <mxCell id="de3uSpLbnVHqse1vQnTu-46" style="edgeStyle=orthogonalEdgeStyle;rounded=0;orthogonalLoop=1;jettySize=auto;html=1;entryX=0;entryY=1;entryDx=0;entryDy=-15;entryPerimeter=0;" edge="1" parent="1" source="de3uSpLbnVHqse1vQnTu-41" target="de3uSpLbnVHqse1vQnTu-4">
          <mxGeometry relative="1" as="geometry">
            <Array as="points">
              <mxPoint x="510" y="175" />
            </Array>
          </mxGeometry>
        </mxCell>
        <mxCell id="de3uSpLbnVHqse1vQnTu-47" value="loeschen&lt;br&gt;SSH-Public-Key&lt;br&gt;per GITLAB-API" style="edgeLabel;html=1;align=center;verticalAlign=middle;resizable=0;points=[];" vertex="1" connectable="0" parent="de3uSpLbnVHqse1vQnTu-46">
          <mxGeometry x="0.59" y="-3" relative="1" as="geometry">
            <mxPoint y="32" as="offset" />
          </mxGeometry>
        </mxCell>
        <mxCell id="de3uSpLbnVHqse1vQnTu-41" value="&lt;b&gt;Auftrag 5: Löschen der Credentials&lt;/b&gt;&lt;br&gt;Warten auf Ende der Installation und dann SSH-Public key auf GITLAB löschen" style="rounded=1;whiteSpace=wrap;html=1;fillColor=#ffe6cc;strokeColor=#d79b00;" vertex="1" parent="1">
          <mxGeometry x="300" y="310" width="280" height="58.2" as="geometry" />
        </mxCell>
        <mxCell id="de3uSpLbnVHqse1vQnTu-51" style="edgeStyle=orthogonalEdgeStyle;rounded=0;orthogonalLoop=1;jettySize=auto;html=1;entryX=0.855;entryY=1;entryDx=0;entryDy=-4.35;entryPerimeter=0;" edge="1" parent="1" source="de3uSpLbnVHqse1vQnTu-17" target="de3uSpLbnVHqse1vQnTu-4">
          <mxGeometry relative="1" as="geometry">
            <Array as="points">
              <mxPoint x="650" y="56" />
            </Array>
          </mxGeometry>
        </mxCell>
        <mxCell id="de3uSpLbnVHqse1vQnTu-17" value="SSH-Public-Key" style="verticalLabelPosition=bottom;verticalAlign=top;html=1;shape=card;whiteSpace=wrap;size=20;arcSize=12;fillColor=#f8cecc;strokeColor=#b85450;" vertex="1" parent="1">
          <mxGeometry x="620" y="172.5" width="60" height="45" as="geometry" />
        </mxCell>
      </root>
    </mxGraphModel>
  </diagram>
</mxfile>
