<mxfile host="Electron" modified="2024-09-26T11:50:46.971Z" agent="Mozilla/5.0 (Macintosh; Intel Mac OS X 10_15_7) AppleWebKit/537.36 (KHTML, like Gecko) draw.io/22.1.2 Chrome/114.0.5735.289 Electron/25.9.4 Safari/537.36" etag="e8CUKIOUtqbUp_uEZ95r" version="22.1.2" type="device" pages="2">
  <diagram name="UML-Use-Case" id="kxQpnAZZ137ZIxMeBmQg">
    <mxGraphModel dx="1162" dy="830" grid="1" gridSize="10" guides="1" tooltips="1" connect="1" arrows="1" fold="1" page="1" pageScale="1" pageWidth="1169" pageHeight="827" math="0" shadow="0">
      <root>
        <mxCell id="0" />
        <mxCell id="1" parent="0" />
        <mxCell id="u9Q4sFTmTH1zuAOsAUIx-2" value="Tic Tac Toe" style="rounded=0;whiteSpace=wrap;html=1;align=center;verticalAlign=top;fontSize=21;" parent="1" vertex="1">
          <mxGeometry x="210" y="39" width="670" height="750" as="geometry" />
        </mxCell>
        <mxCell id="u9Q4sFTmTH1zuAOsAUIx-1" value="start Game" style="ellipse;whiteSpace=wrap;html=1;" parent="1" vertex="1">
          <mxGeometry x="410" y="160" width="140" height="70" as="geometry" />
        </mxCell>
        <mxCell id="u9Q4sFTmTH1zuAOsAUIx-3" value="Player make Move" style="ellipse;whiteSpace=wrap;html=1;" parent="1" vertex="1">
          <mxGeometry x="260" y="330" width="140" height="70" as="geometry" />
        </mxCell>
        <mxCell id="u9Q4sFTmTH1zuAOsAUIx-4" value="check Win" style="ellipse;whiteSpace=wrap;html=1;" parent="1" vertex="1">
          <mxGeometry x="475" y="560" width="140" height="70" as="geometry" />
        </mxCell>
        <mxCell id="u9Q4sFTmTH1zuAOsAUIx-5" value="Player" style="shape=umlActor;verticalLabelPosition=bottom;verticalAlign=top;html=1;outlineConnect=0;" parent="1" vertex="1">
          <mxGeometry x="60" y="354" width="30" height="60" as="geometry" />
        </mxCell>
        <mxCell id="u9Q4sFTmTH1zuAOsAUIx-8" value="Computer make Move" style="ellipse;whiteSpace=wrap;html=1;" parent="1" vertex="1">
          <mxGeometry x="680" y="354" width="140" height="70" as="geometry" />
        </mxCell>
        <mxCell id="u9Q4sFTmTH1zuAOsAUIx-9" value="" style="endArrow=none;html=1;rounded=0;exitX=0.5;exitY=0.5;exitDx=0;exitDy=0;exitPerimeter=0;" parent="1" source="u9Q4sFTmTH1zuAOsAUIx-5" target="u9Q4sFTmTH1zuAOsAUIx-1" edge="1">
          <mxGeometry width="50" height="50" relative="1" as="geometry">
            <mxPoint x="560" y="450" as="sourcePoint" />
            <mxPoint x="610" y="400" as="targetPoint" />
          </mxGeometry>
        </mxCell>
        <mxCell id="u9Q4sFTmTH1zuAOsAUIx-10" value="" style="endArrow=none;html=1;rounded=0;exitX=0.5;exitY=0.5;exitDx=0;exitDy=0;exitPerimeter=0;" parent="1" target="u9Q4sFTmTH1zuAOsAUIx-3" edge="1">
          <mxGeometry width="50" height="50" relative="1" as="geometry">
            <mxPoint x="85" y="394" as="sourcePoint" />
            <mxPoint x="439" y="229" as="targetPoint" />
          </mxGeometry>
        </mxCell>
        <mxCell id="u9Q4sFTmTH1zuAOsAUIx-11" value="&amp;lt;&amp;lt;include&amp;gt;&amp;gt;" style="html=1;verticalAlign=bottom;endArrow=open;dashed=1;endSize=8;curved=0;rounded=0;exitX=1;exitY=0.5;exitDx=0;exitDy=0;entryX=0.029;entryY=0.657;entryDx=0;entryDy=0;entryPerimeter=0;" parent="1" source="u9Q4sFTmTH1zuAOsAUIx-3" target="aBGiqEtIGWFDdF685Cp7-1" edge="1">
          <mxGeometry relative="1" as="geometry">
            <mxPoint x="600" y="430" as="sourcePoint" />
            <mxPoint x="520" y="430" as="targetPoint" />
          </mxGeometry>
        </mxCell>
        <mxCell id="u9Q4sFTmTH1zuAOsAUIx-12" value="&amp;lt;&amp;lt;include&amp;gt;&amp;gt;" style="html=1;verticalAlign=bottom;endArrow=open;dashed=1;endSize=8;curved=0;rounded=0;entryX=0.707;entryY=0.043;entryDx=0;entryDy=0;exitX=0.393;exitY=0.986;exitDx=0;exitDy=0;exitPerimeter=0;entryPerimeter=0;" parent="1" source="u9Q4sFTmTH1zuAOsAUIx-8" target="u9Q4sFTmTH1zuAOsAUIx-4" edge="1">
          <mxGeometry relative="1" as="geometry">
            <mxPoint x="679" y="393" as="sourcePoint" />
            <mxPoint x="510" y="510" as="targetPoint" />
          </mxGeometry>
        </mxCell>
        <mxCell id="aBGiqEtIGWFDdF685Cp7-1" value="draw Gameboard" style="ellipse;whiteSpace=wrap;html=1;" parent="1" vertex="1">
          <mxGeometry x="650" y="210" width="140" height="70" as="geometry" />
        </mxCell>
        <mxCell id="gEWwPscBTalk7BH9B4Yf-3" value="&amp;lt;&amp;lt;include&amp;gt;&amp;gt;" style="html=1;verticalAlign=bottom;endArrow=open;dashed=1;endSize=8;curved=0;rounded=0;entryX=0;entryY=0.5;entryDx=0;entryDy=0;exitX=1;exitY=0.5;exitDx=0;exitDy=0;" edge="1" parent="1" source="u9Q4sFTmTH1zuAOsAUIx-1" target="aBGiqEtIGWFDdF685Cp7-1">
          <mxGeometry relative="1" as="geometry">
            <mxPoint x="433" y="398" as="sourcePoint" />
            <mxPoint x="510" y="510" as="targetPoint" />
          </mxGeometry>
        </mxCell>
        <mxCell id="gEWwPscBTalk7BH9B4Yf-4" value="&amp;lt;&amp;lt;include&amp;gt;&amp;gt;" style="html=1;verticalAlign=bottom;endArrow=open;dashed=1;endSize=8;curved=0;rounded=0;entryX=0;entryY=0;entryDx=0;entryDy=0;exitX=0.657;exitY=1.029;exitDx=0;exitDy=0;exitPerimeter=0;" edge="1" parent="1" source="u9Q4sFTmTH1zuAOsAUIx-3" target="u9Q4sFTmTH1zuAOsAUIx-4">
          <mxGeometry relative="1" as="geometry">
            <mxPoint x="433" y="398" as="sourcePoint" />
            <mxPoint x="510" y="510" as="targetPoint" />
          </mxGeometry>
        </mxCell>
        <mxCell id="gEWwPscBTalk7BH9B4Yf-5" value="&amp;lt;&amp;lt;include&amp;gt;&amp;gt;" style="html=1;verticalAlign=bottom;endArrow=open;dashed=1;endSize=8;curved=0;rounded=0;exitX=0.657;exitY=0.057;exitDx=0;exitDy=0;entryX=0.5;entryY=1;entryDx=0;entryDy=0;exitPerimeter=0;" edge="1" parent="1" source="u9Q4sFTmTH1zuAOsAUIx-8" target="aBGiqEtIGWFDdF685Cp7-1">
          <mxGeometry relative="1" as="geometry">
            <mxPoint x="480" y="365" as="sourcePoint" />
            <mxPoint x="675" y="278" as="targetPoint" />
          </mxGeometry>
        </mxCell>
      </root>
    </mxGraphModel>
  </diagram>
  <diagram id="S2Tbx12pc5v2WaUIAEdj" name="UML-Class-Diagram">
    <mxGraphModel dx="1162" dy="830" grid="1" gridSize="10" guides="1" tooltips="1" connect="1" arrows="1" fold="1" page="1" pageScale="1" pageWidth="1169" pageHeight="827" math="0" shadow="0">
      <root>
        <mxCell id="0" />
        <mxCell id="1" parent="0" />
        <mxCell id="SiMf552itZ4AR9hkA2hm-5" value="&lt;p style=&quot;margin:0px;margin-top:4px;text-align:center;&quot;&gt;&lt;b&gt;Player&lt;/b&gt;&lt;/p&gt;&lt;hr size=&quot;1&quot;&gt;&lt;div style=&quot;height:2px;&quot;&gt;&lt;/div&gt;&lt;hr size=&quot;1&quot;&gt;&lt;div style=&quot;height:2px;&quot;&gt;&lt;/div&gt;" style="verticalAlign=top;align=left;overflow=fill;fontSize=12;fontFamily=Helvetica;html=1;whiteSpace=wrap;" parent="1" vertex="1">
          <mxGeometry x="280" y="260" width="140" height="60" as="geometry" />
        </mxCell>
        <mxCell id="SiMf552itZ4AR9hkA2hm-6" value="&lt;p style=&quot;margin:0px;margin-top:4px;text-align:center;&quot;&gt;&lt;b&gt;Game&lt;/b&gt;&lt;/p&gt;&lt;hr size=&quot;1&quot;&gt;&lt;div style=&quot;height:2px;&quot;&gt;&lt;/div&gt;&lt;hr size=&quot;1&quot;&gt;&lt;div style=&quot;height:2px;&quot;&gt;&lt;/div&gt;" style="verticalAlign=top;align=left;overflow=fill;fontSize=12;fontFamily=Helvetica;html=1;whiteSpace=wrap;" parent="1" vertex="1">
          <mxGeometry x="620" y="240" width="140" height="60" as="geometry" />
        </mxCell>
        <mxCell id="SiMf552itZ4AR9hkA2hm-8" value="&lt;p style=&quot;margin:0px;margin-top:4px;text-align:center;&quot;&gt;&lt;b&gt;ComputerPlayer&lt;/b&gt;&lt;/p&gt;&lt;hr size=&quot;1&quot;&gt;&lt;div style=&quot;height:2px;&quot;&gt;&lt;/div&gt;&lt;hr size=&quot;1&quot;&gt;&lt;div style=&quot;height:2px;&quot;&gt;&lt;/div&gt;" style="verticalAlign=top;align=left;overflow=fill;fontSize=12;fontFamily=Helvetica;html=1;whiteSpace=wrap;" parent="1" vertex="1">
          <mxGeometry x="440" y="390" width="140" height="60" as="geometry" />
        </mxCell>
        <mxCell id="SiMf552itZ4AR9hkA2hm-9" value="&lt;p style=&quot;margin:0px;margin-top:4px;text-align:center;&quot;&gt;&lt;b&gt;Main&lt;/b&gt;&lt;/p&gt;&lt;hr size=&quot;1&quot;&gt;&lt;div style=&quot;height:2px;&quot;&gt;&lt;/div&gt;&lt;hr size=&quot;1&quot;&gt;&lt;div style=&quot;height:2px;&quot;&gt;&lt;/div&gt;" style="verticalAlign=top;align=left;overflow=fill;fontSize=12;fontFamily=Helvetica;html=1;whiteSpace=wrap;" parent="1" vertex="1">
          <mxGeometry x="390" y="90" width="140" height="60" as="geometry" />
        </mxCell>
        <mxCell id="SiMf552itZ4AR9hkA2hm-10" value="" style="endArrow=none;html=1;rounded=0;" parent="1" source="SiMf552itZ4AR9hkA2hm-6" target="SiMf552itZ4AR9hkA2hm-9" edge="1">
          <mxGeometry width="50" height="50" relative="1" as="geometry">
            <mxPoint x="560" y="450" as="sourcePoint" />
            <mxPoint x="610" y="400" as="targetPoint" />
          </mxGeometry>
        </mxCell>
        <mxCell id="SiMf552itZ4AR9hkA2hm-11" value="" style="endArrow=none;html=1;rounded=0;" parent="1" source="SiMf552itZ4AR9hkA2hm-5" target="SiMf552itZ4AR9hkA2hm-9" edge="1">
          <mxGeometry width="50" height="50" relative="1" as="geometry">
            <mxPoint x="560" y="450" as="sourcePoint" />
            <mxPoint x="610" y="400" as="targetPoint" />
          </mxGeometry>
        </mxCell>
        <mxCell id="SiMf552itZ4AR9hkA2hm-12" value="" style="endArrow=none;html=1;rounded=0;entryX=0.5;entryY=1;entryDx=0;entryDy=0;exitX=0.5;exitY=0;exitDx=0;exitDy=0;" parent="1" source="SiMf552itZ4AR9hkA2hm-8" target="SiMf552itZ4AR9hkA2hm-9" edge="1">
          <mxGeometry width="50" height="50" relative="1" as="geometry">
            <mxPoint x="560" y="450" as="sourcePoint" />
            <mxPoint x="470" y="190" as="targetPoint" />
          </mxGeometry>
        </mxCell>
        <mxCell id="TFoZerIdZqigsTFFWFPo-1" value="&lt;p style=&quot;margin:0px;margin-top:4px;text-align:center;&quot;&gt;&lt;b&gt;GameBoard&lt;/b&gt;&lt;/p&gt;&lt;hr size=&quot;1&quot;&gt;&lt;div style=&quot;height:2px;&quot;&gt;&lt;/div&gt;&lt;hr size=&quot;1&quot;&gt;&lt;div style=&quot;height:2px;&quot;&gt;&lt;/div&gt;" style="verticalAlign=top;align=left;overflow=fill;fontSize=12;fontFamily=Helvetica;html=1;whiteSpace=wrap;" vertex="1" parent="1">
          <mxGeometry x="840" y="240" width="140" height="60" as="geometry" />
        </mxCell>
        <mxCell id="TFoZerIdZqigsTFFWFPo-2" value="" style="endArrow=none;html=1;rounded=0;entryX=0;entryY=0.5;entryDx=0;entryDy=0;exitX=1;exitY=0.5;exitDx=0;exitDy=0;" edge="1" parent="1" source="SiMf552itZ4AR9hkA2hm-6" target="TFoZerIdZqigsTFFWFPo-1">
          <mxGeometry width="50" height="50" relative="1" as="geometry">
            <mxPoint x="560" y="450" as="sourcePoint" />
            <mxPoint x="610" y="400" as="targetPoint" />
          </mxGeometry>
        </mxCell>
      </root>
    </mxGraphModel>
  </diagram>
</mxfile>
