<?xml version="1.0" encoding="UTF-8"?>
<svg
   xmlns="http://www.w3.org/2000/svg"
   width="210mm" height="297mm"
   viewBox="10 0 210 297">
   <g id="groupId" style="{background-color: #FF00FF}">
	<circle cx="-25" cy="125" r="65" fill="#FF00FF"/>
	<circle cx="115" cy="115" r="25" fill="#0000FF"/>
   </g>
</svg>
