Sepp	Jäger	Elektronik
Tom	Jürgens	Elektronik
Igor	Kustov	Elektronik
Cedric	Kast	Elektronik
Friedlinde	Hieber	Elektronik
Leonie	Storch	Elektronik
Regina	Ellermann	Elektronik
Xaverius	Biehler	Elektronik
Tomas	Brech	Elektronik
Nelli	James	Elektronik
Gunda	Heigl	Elektronik
Collin	Plötz	Elektronik
Priska	Kilger	Elektronik
Sunhild	Bulut	Elektronik
Ignaz	Hüttinger	Elektronik
Sonnhilde	Adolph	Elektronik
Adelhard	Dresler	Elektronik
Rainhard	Ziesche	Elektronik
Jeremy	Davis	Elektronik
Elisabeth	Brettschneider	Elektronik
Silvia	Wendorf	Elektronik
Annehilde	Buder	Elektronik
Reinhart	Schoof	Elektronik
Yvonne	Welk	Elektronik
Siegward	Kannenberg	Elektronik
Anje	Dirks	Elektronik
Ekhard	Kohlmann	Elektronik
Ferdinand	Broll	Elektronik
Wendel	Schmelzer	Elektronik
Hippolytus	Hüppe	Elektronik
Günther	Schleich	Elektronik
Ortrun	Wolke	Elektronik
Lennox	Klütsch	Elektronik
Uranius	Nell	Elektronik
Reimo	Kappes	Elektronik
Hartmann	Rauhut	Elektronik
Janik	Köpp	Elektronik
Deborah	Renate	Elektronik
Didi	Meinert	Elektronik
Erdmuthe	Henne	Elektronik
Ann	Esche	Elektronik
Eberhardt	Wöhrmann	Elektronik
Lona	Larson	Elektronik
Jaqueline	Mildner	Elektronik
Ramona	Eschbach	Elektronik
Erni	Tonn	Elektronik
Irmin	Remondis	Elektronik
Valeska	Westphal	Elektronik
Ingetraud	Drewes	Elektronik
Robby	Koss	Elektronik
Hansludwig	Voß	Elektronik
Utta	Rebmann	Elektronik
Erdfried	Pfitzner	Elektronik
Adele	Weiß	Elektronik
Elfie	Hüttinger	Elektronik
Elke	Genz	Elektronik
Heimgard	Deeg	Elektronik
Larissa	Engelhardt	Elektronik
Gundhard	Fokken	Elektronik
Thusnelda	Schwichtenberg	Elektronik
Harry	Schmidt	Chor
Sepp	Jäger	Chor
Justus	Hasler	Chor
Teresa	Pelka	Chor
Friedlinde	Hieber	Chor
Kord	Graßhoff	Chor
Marga	Göricke	Chor
Cäcilie	Selig	Chor
Rupertus	Dams	Chor
Hadburg	Schmahl	Chor
Dieterich	Wengert	Chor
Theolinde	Plath	Chor
Erkmar	Hoang	Chor
Annegreth	Watkins	Chor
Claudius	Beek	Chor
Wolrad	Spengler	Chor
Ringo	Riedmann	Chor
Eckhart	Abbott	Chor
Hariolf	Wells	Chor
Gerritdina	Lackner	Chor
Theres	Wißmann	Chor
Joel	Landgraf	Chor
Marold	Liebing	Chor
Ilsetraud	Briel	Chor
Claudia	Wever	Chor
Waldtraud	Tröger	Chor
Renatus	Jäschke	Chor
Elfi	Gugel	Chor
Burghardt	Jentzsch	Chor
Adolph	Stuber	Chor
Iven	Hellwig	Chor
Yvonne	Welk	Chor
Karlhorst	Laber	Chor
Adelgund	Schupp	Chor
Ayleen	Steer	Chor
Felizitas	Kopplin	Chor
Neidhard	Belzer	Chor
Sybill	Reid	Chor
Arwed	Marth	Chor
Hermi	Gerl	Chor
Ilseruth	Lieder	Chor
Otfried	Helmecke	Chor
Carsten	Redeker	Chor
Emmerich	Brunn	Chor
Frohwald	Dursun	Chor
Heideliese	Köber	Chor
Roselius	Stern	Chor
Dorkas	Hinck	Chor
Marcel	Gerding	Chor
Malve	Cords	Chor
Mariegret	Pradel	Chor
Irmin	Remondis	Chor
Merlind	Martel	Chor
Mario	Dachs	Chor
Karlernst	Berk	Chor
Sergius	Kagerer	Chor
Trautlinde	Böke	Chor
Ute	Schriever	Chor
Raimar	Felgner	Chor
Burgel	Lück	Chor
Thusnelda	Schwichtenberg	Chor
