Rechnung_90449;Auftrag_A448;Zürich;14.05.2024;14:22:54;ZahlungszielInTagen_15
Herkunft;41010000001234567;CH3089144756318541463;K234;Harald Müller;Rainstrasse 27;8610 Uster;CHE-111.222.333 MWST;harald.mueller@bluewin.ch
Endkunde;41301000000012497;CH1689144136449235957;Herrgott im Himmel;Wolke 7;6666 Himmelsdorf
RechnPos;1;Ticket fürs Himmelreich (D);5;5.00;25.00;MWST_0.00%
RechnPos;2;Ticket To Heaven (E);8;5.00;40.00;MWST_0.00%
RechnPos;3;Billet pour le paradis (F);3;5.00;15.00;MWST_0.00%
RechnPos;4;Boleto al cielo (S);4;5.00;20.00;MWST_0.00%