1656929023477,    333,     2022-07-04,  12:03:43
1656929078109,    467,     2022-07-04,  12:04:38
1656929378952,    330,     2022-07-04,  12:09:38
1656929679843,    333,     2022-07-04,  12:14:39
1656929980673,    353,     2022-07-04,  12:19:40
1656930281596,    331,     2022-07-04,  12:24:41
1656930582446,    335,     2022-07-04,  12:29:42
1656931447649,    386,     2022-07-04,  12:44:07
1656931748572,    330,     2022-07-04,  12:49:08
1656932049474,    328,     2022-07-04,  12:54:09
1656932350387,    325,     2022-07-04,  12:59:10
1656932651310,    346,     2022-07-04,  13:04:11
1656941323404,    321,     2022-07-04,  15:28:43
1656941625004,    325,     2022-07-04,  15:33:45
1656942679722,    452,     2022-07-04,  15:51:19
1656942980642,    330,     2022-07-04,  15:56:20
1656945456825,    418,     2022-07-04,  16:37:36
1656967880055,    184,     2022-07-04,  22:51:20
1656968180891,    213,     2022-07-04,  22:56:20
1656968481770,    229,     2022-07-04,  23:01:21
1656968782641,    253,     2022-07-04,  23:06:22
1656969083471,    268,     2022-07-04,  23:11:23
1656969384391,    289,     2022-07-04,  23:16:24
1656969685304,    290,     2022-07-04,  23:21:25
1656969986142,    284,     2022-07-04,  23:26:26
1656970287011,    307,     2022-07-04,  23:31:27
1656970587911,    351,     2022-07-04,  23:36:27
1656970888797,    299,     2022-07-04,  23:41:28
1656971189720,    317,     2022-07-04,  23:46:29
1656971490581,    327,     2022-07-04,  23:51:30
1656971791445,    325,     2022-07-04,  23:56:31
1656972092310,    324,     2022-07-05,  00:01:32
1656972393211,    331,     2022-07-05,  00:06:33
1656972694133,    339,     2022-07-05,  00:11:34
1656972995056,    342,     2022-07-05,  00:16:35
1656973295978,    348,     2022-07-05,  00:21:35
1656973596901,    354,     2022-07-05,  00:26:36
1656973897823,    340,     2022-07-05,  00:31:37
1656974198746,    348,     2022-07-05,  00:36:38
1656974499668,    360,     2022-07-05,  00:41:39
1656974800492,    358,     2022-07-05,  00:46:40
1656975101354,    356,     2022-07-05,  00:51:41
1657051597554,    365,     2022-07-05,  22:06:37
1657051898472,    343,     2022-07-05,  22:11:38
1657052199328,    347,     2022-07-05,  22:16:39
1657052500228,    354,     2022-07-05,  22:21:40
1657052801150,    402,     2022-07-05,  22:26:41
1657053102028,    361,     2022-07-05,  22:31:42
1657053402951,    375,     2022-07-05,  22:36:42
1657053703873,    362,     2022-07-05,  22:41:43
1657226992908,    415,     2022-07-07,  22:49:52
1657227293831,    385,     2022-07-07,  22:54:53
1657227594710,    388,     2022-07-07,  22:59:54
1657227895631,    380,     2022-07-07,  23:04:55
1657228196521,    396,     2022-07-07,  23:09:56
1657228497391,    386,     2022-07-07,  23:14:57
1657228798221,    337,     2022-07-07,  23:19:58
1657229099144,    359,     2022-07-07,  23:24:59
1657229400066,    361,     2022-07-07,  23:30:00
1657230751786,    442,     2022-07-07,  23:52:31
1657231052702,    363,     2022-07-07,  23:57:32
1657231353624,    386,     2022-07-08,  00:02:33
1657231654511,    368,     2022-07-08,  00:07:34
1657231955428,    375,     2022-07-08,  00:12:35
1657232256351,    383,     2022-07-08,  00:17:36
1657232557231,    377,     2022-07-08,  00:22:37
1657232858145,    377,     2022-07-08,  00:27:38
1657233159067,    373,     2022-07-08,  00:32:39
1657233460584,    379,     2022-07-08,  00:37:40
1657233761506,    373,     2022-07-08,  00:42:41
1657234062346,    375,     2022-07-08,  00:47:42
1657234363238,    386,     2022-07-08,  00:52:43
1657234664104,    379,     2022-07-08,  00:57:44
1657234965026,    383,     2022-07-08,  01:02:45
1657235265948,    378,     2022-07-08,  01:07:45
1657235566870,    379,     2022-07-08,  01:12:46
1657235867793,    392,     2022-07-08,  01:17:47
1657236168715,    390,     2022-07-08,  01:22:48
1657236469638,    388,     2022-07-08,  01:27:49
1657236770560,    397,     2022-07-08,  01:32:50
1657237071476,    382,     2022-07-08,  01:37:51
1657237372398,    399,     2022-07-08,  01:42:52
1657237673320,    398,     2022-07-08,  01:47:53
1657237974159,    395,     2022-07-08,  01:52:54
1657238275081,    398,     2022-07-08,  01:57:55
1657238576004,    392,     2022-07-08,  02:02:56
1657238876843,    395,     2022-07-08,  02:07:56
1657256579869,    432,     2022-07-08,  07:02:59
1657256880751,    370,     2022-07-08,  07:08:00
1657257181628,    330,     2022-07-08,  07:13:01
1657257482528,    388,     2022-07-08,  07:18:02
1657257783450,    344,     2022-07-08,  07:23:03
1657258084292,    337,     2022-07-08,  07:28:04
1657258385215,    340,     2022-07-08,  07:33:05
1657258686137,    407,     2022-07-08,  07:38:06
1657258987060,    333,     2022-07-08,  07:43:07
1657259287982,    340,     2022-07-08,  07:48:07
1657259588905,    343,     2022-07-08,  07:53:08
1657259889827,    349,     2022-07-08,  07:58:09
1657260190749,    354,     2022-07-08,  08:03:10
1657260491631,    356,     2022-07-08,  08:08:11
1657260792531,    362,     2022-07-08,  08:13:12
1657261093454,    373,     2022-07-08,  08:18:13
1657261394351,    367,     2022-07-08,  08:23:14
1657261695274,    382,     2022-07-08,  08:28:15
1657261996196,    379,     2022-07-08,  08:33:16
1657262297071,    378,     2022-07-08,  08:38:17
1657262597994,    395,     2022-07-08,  08:43:17
1657262898916,    379,     2022-07-08,  08:48:18
1657263199791,    389,     2022-07-08,  08:53:19
1657263500714,    381,     2022-07-08,  08:58:20
1657263801636,    386,     2022-07-08,  09:03:21
1657264102511,    384,     2022-07-08,  09:08:22
1657292277866,    383,     2022-07-08,  16:57:57
1657292578696,    341,     2022-07-08,  17:02:58
1657292879619,    347,     2022-07-08,  17:07:59
1657293180496,    347,     2022-07-08,  17:13:00
1657293481391,    368,     2022-07-08,  17:18:01
1657293782314,    372,     2022-07-08,  17:23:02
1657393018666,    404,     2022-07-09,  20:56:58
1657393319589,    341,     2022-07-09,  21:01:59
1657393620431,    359,     2022-07-09,  21:07:00
1657393921327,    377,     2022-07-09,  21:12:01
1657468004205,    328,     2022-07-10,  17:46:44
1657468305129,    350,     2022-07-10,  17:51:45
1657468605971,    330,     2022-07-10,  17:56:45
1657468906892,    336,     2022-07-10,  18:01:46
1657469207814,    339,     2022-07-10,  18:06:47
1657469508660,    346,     2022-07-10,  18:11:48
1657469810296,    315,     2022-07-10,  18:16:50
1657471271496,    519,     2022-07-10,  18:41:11
1657471572384,    158,     2022-07-10,  18:46:12
1657471873236,    169,     2022-07-10,  18:51:13
1657472174158,    235,     2022-07-10,  18:56:14
1657472775941,    227,     2022-07-10,  19:06:15
1657473076864,    243,     2022-07-10,  19:11:16
1657473377741,    256,     2022-07-10,  19:16:17
1657473678664,    268,     2022-07-10,  19:21:18
1657473979586,    279,     2022-07-10,  19:26:19
1657474280467,    289,     2022-07-10,  19:31:20
1657474581389,    304,     2022-07-10,  19:36:21
1657474882275,    310,     2022-07-10,  19:41:22
1657475183146,    312,     2022-07-10,  19:46:23
1657475484068,    318,     2022-07-10,  19:51:24
1657475784990,    319,     2022-07-10,  19:56:24
1657476085853,    328,     2022-07-10,  20:01:25
1657518245643,    406,     2022-07-11,  07:44:05
1657518546515,    320,     2022-07-11,  07:49:06
1657532786261,    113,     2022-07-11,  11:46:26
1657533087184,    120,     2022-07-11,  11:51:27
1657533388106,    157,     2022-07-11,  11:56:28
1657533688983,    177,     2022-07-11,  12:01:28
