Lang,IBAN,Cdtr_AdrTp,Cdtr_Name,Cdtr_StrtNmOrAdrLine1,Cdtr_BldgNbOrAdrLine2,Cdtr_PstCd,Cdtr_TwnNm,Cdtr_Ctry,Amt,Ccy,UltmtDbtr_AdrTp,UltmtDbtr_Name,UltmtDbtr_StrtNmOrAdrLine1,UltmtDbtr_BldgNbOrAdrLine2,UltmtDbtr_PstCd,UltmtDbtr_TwnNm,UltmtDbtr_Ctry,RefTp,Ref,Ustrd,StrdBkgInf,AltPmt1,AltPmt2,Anrede,Nummer
de,CH5800791123000889012,S,"Verein ""Zum Beispiel""",Musterstrasse,123,8000,Seldwyla,CH,50.00,CHF,S,Sarah Beispiel,Musterstrasse,1,8000,Seldwyla,CH,NON,,Mitgliederbeitrag,,,,Sehr geehrte Frau Beispiel,1
de,CH5800791123000889012,S,"Verein ""Zum Beispiel""",Musterstrasse,123,8000,Seldwyla,CH,50.00,CHF,K,Simon Muster,Musterstrasse 1,8000 Seldwyla,,,CH,NON,,Mitgliederbeitrag,,twint/light/02:0123456789abcdef0123456789abcdef#0123456789abcdef0123456789abcdef01234567#,rn/twint/a~AbCdEfGhIjKlMnOpQrStUv~s~AbCdEfGhIjKlMnOpQrStUv/rn,Lieber Simon,1
de,CH5800791123000889012,K,"Verein ""Zum Beispiel""",Musterstrasse 123,8000 Seldwyla,,,CH,100.00,CHF,S,Familie Exempel,Beispielstrasse,1,9490,Vaduz,LI,NON,,Mitgliederbeitrag,,,,Geschätzte Familie Exempel,2
de,CH5800791123000889012,S,"Verein ""Zum Beispiel""",Musterstrasse,123,8000,Seldwyla,CH,200.00,EUR,S,Modell Stiftung,Postfach,,78462,Konstanz,DE,SCOR,RF18539007547034,Gönnerbeitrag,//S1/11/220101/40/0:30,,,Sehr geehrte Damen und Herren,3
fr,CH4431999123000889012,S,"Verein ""Zum Beispiel""",Musterstrasse,123,8000,Seldwyla,CH,123.45,CHF,S,Prototype SA,Place de l'Exemple,2,25000,Besançon,FR,QRR,210000000003139471430009017,Gönnerbeitrag,,,,Cher donateur,5
it,CH5800791123000889012,S,"Verein ""Zum Beispiel""",Musterstrasse,123,8000,Seldwyla,CH,,CHF,S,Modello Sagl,Via Esempio,3,20123,Milano,IT,NON,,Spende,,,,Caro donatore,8
en,CH5800791123000889012,S,"Verein ""Zum Beispiel""",Musterstrasse,123,8000,Seldwyla,CH,0.50,EUR,S,Schema GmbH,Beispielstraße,5,6900,Bregenz,AT,NON,,Spende,,,,Sehr geehrter Spender,13
de,CH5800791123000889012,S,"Verein ""Zum Beispiel""",Musterstrasse,123,8000,Seldwyla,CH,,CHF,S,,,,,,,NON,,Spende,,,,,
