NAME,MLST ST (PubMLST),MLST PROFILE (PubMLST),NG-STAR TYPE,NG-STAR PROFILE,NG-MAST TYPE,NG-MAST POR,NG-MAST TBPB
ERR3908656,7827,59_39_67_158_148_153_65,1225,13.001_19_3_1_1_9_100,14700,3031,4
ERR3894271,7827,59_39_67_158_148_153_65,38,13.001_19_8_1_1_9_100,8883,155,4
ERR3326165,7827,59_39_67_158_148_153_65,1225,13.001_19_3_1_1_9_100,14700,3031,4
ERR3894580,7827,59_39_67_158_148_153_65,1225,13.001_19_3_1_1_9_100,14700,3031,4
ERR3894187,7827,59_39_67_158_148_153_65,1975,13.001_19_3_1_7_9_100,292,28,4
ERR3894474,7827,59_39_67_158_148_153_65,*9cae,(4773)_89_4_1_1_4_100,-,new,new
ERR3894200,7827,59_39_67_158_148_153_65,1975,13.001_19_3_1_7_9_100,292,28,4
ERR3326161,7827,59_39_67_158_148_153_65,38,13.001_19_8_1_1_9_100,10386,246,4
ERR3326163,7827,59_39_67_158_148_153_65,1225,13.001_19_3_1_1_9_100,14700,3031,4
ERR3894624,7827,59_39_67_158_148_153_65,1225,13.001_19_3_1_1_9_100,-,new,4
ERR3894297,7827,59_39_67_158_148_153_65,1975,13.001_19_3_1_7_9_100,292,28,4
ERR3894566,7827,59_39_67_158_148_153_65,1225,13.001_19_3_1_1_9_100,14700,3031,4
ERR3894245,7827,59_39_67_158_148_153_65,1225,13.001_19_3_1_1_9_100,14700,3031,4
ERR3894459,7827,59_39_67_158_148_153_65,1225,13.001_19_3_1_1_9_100,14700,3031,4
ERR3326172,7827,59_39_67_158_148_153_65,1225,13.001_19_3_1_1_9_100,14700,3031,4
ERR3894538,7827,59_39_67_158_148_153_65,1225,13.001_19_3_1_1_9_100,14700,3031,4
ERR3326183,7827,59_39_67_158_148_153_65,1225,13.001_19_3_1_1_9_100,14700,3031,4
ERR3894208,7827,59_39_67_158_148_153_65,1225,13.001_19_3_1_1_9_100,14700,3031,4
ERR3894290,7827,59_39_67_158_148_153_65,*9cae,(4773)_89_4_1_1_4_100,-,new,new
ERR3894473,7827,59_39_67_158_148_153_65,1225,13.001_19_3_1_1_9_100,14700,3031,4
ERR3894558,7827,59_39_67_158_148_153_65,*525b,13.001_19_10_1_1_9_100,-,new,4
ERR3894324,7827,59_39_67_158_148_153_65,1975,13.001_19_3_1_7_9_100,292,28,4
ERR3908654,7827,59_39_67_158_148_153_65,38,13.001_19_8_1_1_9_100,7986,4700,4
ERR3894211,7827,59_39_67_158_148_153_65,1225,13.001_19_3_1_1_9_100,14700,3031,4
ERR3894081,7827,59_39_67_158_148_153_65,38,13.001_19_8_1_1_9_100,10569,6176,4
ERR3908657,7827,59_39_67_158_148_153_65,1225,13.001_19_3_1_1_9_100,14700,3031,4
ERR3894348,7827,59_39_67_158_148_153_65,175,13.001_19_1_1_1_9_100,-,2703,4
ERR3908658,7827,59_39_67_158_148_153_65,1225,13.001_19_3_1_1_9_100,14700,3031,4
ERR3894310,7827,59_39_67_158_148_153_65,1225,13.001_19_3_1_1_9_100,14700,3031,4
ERR3894555,7827,59_39_67_158_148_153_65,1225,13.001_19_3_1_1_9_100,14700,3031,4
ERR3894199,7827,59_39_67_158_148_153_65,1225,13.001_19_3_1_1_9_100,14700,3031,4
ERR3894226,7827,59_39_67_158_148_153_65,1225,13.001_19_3_1_1_9_100,14700,3031,4
ERR3326160,7827,59_39_67_158_148_153_65,1225,13.001_19_3_1_1_9_100,14700,3031,4
ERR3894202,7827,59_39_67_158_148_153_65,1225,13.001_19_3_1_1_9_100,14700,3031,4
ERR3894347,7827,59_39_67_158_148_153_65,1225,13.001_19_3_1_1_9_100,14700,3031,4
ERR3894416,7827,59_39_67_158_148_153_65,1225,13.001_19_3_1_1_9_100,14700,3031,4
ERR3894530,7827,59_39_67_158_148_153_65,1225,13.001_19_3_1_1_9_100,14700,3031,4
ERR3894183,7827,59_39_67_158_148_153_65,1225,13.001_19_3_1_1_9_100,14700,3031,4
ERR3894197,7827,59_39_67_158_148_153_65,175,13.001_19_1_1_1_9_100,2992,1808,29
ERR3894261,7827,59_39_67_158_148_153_65,1225,13.001_19_3_1_1_9_100,14700,3031,4
ERR3894379,7827,59_39_67_158_148_153_65,1225,13.001_19_3_1_1_9_100,14700,3031,4
ERR3894128,7827,59_39_67_158_148_153_65,1225,13.001_19_3_1_1_9_100,14700,3031,4
ERR3894336,7827,59_39_67_158_148_153_65,*9cae,(4773)_89_4_1_1_4_100,-,new,new
ERR3894557,7827,59_39_67_158_148_153_65,*525b,13.001_19_10_1_1_9_100,-,new,4
ERR3908661,7827,59_39_67_158_148_153_65,38,13.001_19_8_1_1_9_100,-,2100,4
ERR3894428,7827,59_39_67_158_148_153_65,1225,13.001_19_3_1_1_9_100,14700,3031,4
ERR3894179,7827,59_39_67_158_148_153_65,1225,13.001_19_3_1_1_9_100,14700,3031,4
ERR3894640,7827,59_39_67_158_148_153_65,1225,13.001_19_3_1_1_9_100,14700,3031,4
ERR3894384,7827,59_39_67_158_148_153_65,1225,13.001_19_3_1_1_9_100,14700,3031,4
ERR3908655,18e17f3370b780626b39c524d7ea8b19cd26303a,59_39_67_7c3edff7ba0c726feafa0b8eb883fdc57b30daf8_148_153_65,38,13.001_19_8_1_1_9_100,2318,1053,4
ERR3894375,7827,59_39_67_158_148_153_65,38,13.001_19_8_1_1_9_100,10386,246,4
ERR3894240,7827,59_39_67_158_148_153_65,1225,13.001_19_3_1_1_9_100,14700,3031,4
ERR3894219,7827,59_39_67_158_148_153_65,1225,13.001_19_3_1_1_9_100,14700,3031,4
ERR3894160,7827,59_39_67_158_148_153_65,1225,13.001_19_3_1_1_9_100,14700,3031,4
ERR3894265,7827,59_39_67_158_148_153_65,1225,13.001_19_3_1_1_9_100,14700,3031,4
ERR3894296,7827,59_39_67_158_148_153_65,1225,13.001_19_3_1_1_9_100,14700,3031,4
ERR3894606,7827,59_39_67_158_148_153_65,1225,13.001_19_3_1_1_9_100,14700,3031,4
ERR3894549,7827,59_39_67_158_148_153_65,38,13.001_19_8_1_1_9_100,10386,246,4
ERR3326186,7827,59_39_67_158_148_153_65,1225,13.001_19_3_1_1_9_100,14700,3031,4
ERR3894112,7827,59_39_67_158_148_153_65,1225,13.001_19_3_1_1_9_100,14700,3031,4
ERR3894188,7827,59_39_67_158_148_153_65,1225,13.001_19_3_1_1_9_100,14700,3031,4
ERR3894209,7827,59_39_67_158_148_153_65,1225,13.001_19_3_1_1_9_100,14700,3031,4
ERR3908659,7827,59_39_67_158_148_153_65,1225,13.001_19_3_1_1_9_100,14700,3031,4
ERR3894266,7827,59_39_67_158_148_153_65,1225,13.001_19_3_1_1_9_100,14700,3031,4
ERR3326154,7827,59_39_67_158_148_153_65,1225,13.001_19_3_1_1_9_100,14700,3031,4
ERR3894137,7827,59_39_67_158_148_153_65,1225,13.001_19_3_1_1_9_100,14700,3031,4
ERR3326184,7827,59_39_67_158_148_153_65,1225,13.001_19_3_1_1_9_100,14700,3031,4
ERR3894218,7827,59_39_67_158_148_153_65,1225,13.001_19_3_1_1_9_100,14700,3031,4
ERR3894143,7827,59_39_67_158_148_153_65,1225,13.001_19_3_1_1_9_100,14700,3031,4
ERR3894260,7827,59_39_67_158_148_153_65,1225,13.001_19_3_1_1_9_100,14700,3031,4
ERR3894479,7827,59_39_67_158_148_153_65,1225,13.001_19_3_1_1_9_100,14700,3031,4
ERR3894139,7827,59_39_67_158_148_153_65,1225,13.001_19_3_1_1_9_100,14700,3031,4
ERR3894212,7827,59_39_67_158_148_153_65,1225,13.001_19_3_1_1_9_100,14700,3031,4
ERR3894461,7827,59_39_67_158_148_153_65,1225,13.001_19_3_1_1_9_100,14700,3031,4
ERR3894340,7827,59_39_67_158_148_153_65,1225,13.001_19_3_1_1_9_100,14700,3031,4
ERR3894345,7827,59_39_67_158_148_153_65,1225,13.001_19_3_1_1_9_100,14700,3031,4
ERR3894358,7827,59_39_67_158_148_153_65,1225,13.001_19_3_1_1_9_100,14700,3031,4
ERR3894370,7827,59_39_67_158_148_153_65,1225,13.001_19_3_1_1_9_100,14700,3031,4
ERR3894522,7827,59_39_67_158_148_153_65,38,13.001_19_8_1_1_9_100,10386,246,4
ERR3894408,7827,59_39_67_158_148_153_65,1225,13.001_19_3_1_1_9_100,14700,3031,4
ERR3326168,7827,59_39_67_158_148_153_65,1225,13.001_19_3_1_1_9_100,14700,3031,4
ERR3894242,7827,59_39_67_158_148_153_65,1225,13.001_19_3_1_1_9_100,14700,3031,4
ERR3894178,7827,59_39_67_158_148_153_65,1225,13.001_19_3_1_1_9_100,14700,3031,4
ERR3894390,7827,59_39_67_158_148_153_65,1225,13.001_19_3_1_1_9_100,14700,3031,4
ERR3894116,7827,59_39_67_158_148_153_65,38,13.001_19_8_1_1_9_100,10386,246,4
ERR3894521,7827,59_39_67_158_148_153_65,1225,13.001_19_3_1_1_9_100,14700,3031,4
ERR3894270,7827,59_39_67_158_148_153_65,1225,13.001_19_3_1_1_9_100,14700,3031,4
ERR3326164,7827,59_39_67_158_148_153_65,1225,13.001_19_3_1_1_9_100,14700,3031,4
ERR3894366,7827,59_39_67_158_148_153_65,1225,13.001_19_3_1_1_9_100,14700,3031,4
ERR3894402,7827,59_39_67_158_148_153_65,1225,13.001_19_3_1_1_9_100,14700,3031,4
ERR3894280,7827,59_39_67_158_148_153_65,1225,13.001_19_3_1_1_9_100,14700,3031,4
ERR3894403,7827,59_39_67_158_148_153_65,1225,13.001_19_3_1_1_9_100,14700,3031,4
ERR3894241,7827,59_39_67_158_148_153_65,1225,13.001_19_3_1_1_9_100,14700,3031,4
ERR3894243,7827,59_39_67_158_148_153_65,1225,13.001_19_3_1_1_9_100,14700,3031,4
ERR3894328,7827,59_39_67_158_148_153_65,1225,13.001_19_3_1_1_9_100,14700,3031,4
ERR3894444,7827,59_39_67_158_148_153_65,*0eb2,(4773)_(9add)_4_1_1_4_100,-,new,new
ERR3894307,7827,59_39_67_158_148_153_65,1225,13.001_19_3_1_1_9_100,14700,3031,4
ERR3894056,7827,59_39_67_158_148_153_65,175,13.001_19_1_1_1_9_100,-,new,4
ERR3894305,7827,59_39_67_158_148_153_65,1225,13.001_19_3_1_1_9_100,14700,3031,4
ERR3326199,7827,59_39_67_158_148_153_65,1225,13.001_19_3_1_1_9_100,14700,3031,4
ERR3894433,7827,59_39_67_158_148_153_65,38,13.001_19_8_1_1_9_100,-,new,4
ERR3894359,7827,59_39_67_158_148_153_65,*9cae,(4773)_89_4_1_1_4_100,-,new,new
ERR3894556,7827,59_39_67_158_148_153_65,1225,13.001_19_3_1_1_9_100,14700,3031,4
ERR3326176,7827,59_39_67_158_148_153_65,1225,13.001_19_3_1_1_9_100,14700,3031,4
ERR3894221,7827,59_39_67_158_148_153_65,1225,13.001_19_3_1_1_9_100,14700,3031,4
ERR3908653,7827,59_39_67_158_148_153_65,38,13.001_19_8_1_1_9_100,7986,4700,4
ERR3326189,7827,59_39_67_158_148_153_65,1225,13.001_19_3_1_1_9_100,14700,3031,4
ERR3894205,7827,59_39_67_158_148_153_65,1225,13.001_19_3_1_1_9_100,14700,3031,4
ERR3325613,7827,59_39_67_158_148_153_65,38,13.001_19_8_1_1_9_100,2318,1053,4
ERR3326008,7827,59_39_67_158_148_153_65,38,13.001_19_8_1_1_9_100,10386,246,4
ERR3326042,7827,59_39_67_158_148_153_65,38,13.001_19_8_1_1_9_100,-,new,4
ERR3326111,7827,59_39_67_158_148_153_65,38,13.001_19_8_1_1_9_100,10386,246,4
ERR3326115,7827,59_39_67_158_148_153_65,175,13.001_19_1_1_1_9_100,-,new,4
ERR3326112,7827,59_39_67_158_148_153_65,38,13.001_19_8_1_1_9_100,10386,246,4
ERR3326055,7827,59_39_67_158_148_153_65,38,13.001_19_8_1_1_9_100,10386,246,4
ERR3325435,7827,59_39_67_158_148_153_65,38,13.001_19_8_1_1_9_100,2318,1053,4
ERR3325898,7827,59_39_67_158_148_153_65,38,13.001_19_8_1_1_9_100,10386,246,4
ERR3325389,7827,59_39_67_158_148_153_65,*b07c,19.001_25_1_1_7_51_100,15188,8843,98
ERR3325189,7827,59_39_67_158_148_153_65,38,13.001_19_8_1_1_9_100,7986,4700,4
ERR3325982,7827,59_39_67_158_148_153_65,38,13.001_19_8_1_1_9_100,10386,246,4
ERR3325440,7827,59_39_67_158_148_153_65,38,13.001_19_8_1_1_9_100,2318,1053,4
ERR3325394,7827,59_39_67_158_148_153_65,*b07c,19.001_25_1_1_7_51_100,15188,8843,98
ERR3325901,7827,59_39_67_158_148_153_65,38,13.001_19_8_1_1_9_100,10386,246,4
ERR3325439,7827,59_39_67_158_148_153_65,38,13.001_19_8_1_1_9_100,2318,1053,4
ERR3325958,7827,59_39_67_158_148_153_65,38,13.001_19_8_1_1_9_100,12159,7111,4
ERR3325845,7827,59_39_67_158_148_153_65,175,13.001_19_1_1_1_9_100,-,new,4
ERR3325967,7827,59_39_67_158_148_153_65,1847,5.002_19_3_1_1_3_100,-,6094,1145
ERR3326029,7827,59_39_67_158_148_153_65,38,13.001_19_8_1_1_9_100,10386,246,4
ERR3325857,7827,59_39_67_158_148_153_65,38,13.001_19_8_1_1_9_100,10386,246,4
ERR3326125,7827,59_39_67_158_148_153_65,38,13.001_19_8_1_1_9_100,10386,246,4
ERR3325516,7827,59_39_67_158_148_153_65,38,13.001_19_8_1_1_9_100,14051,8111,4
ERR3325850,7827,59_39_67_158_148_153_65,175,13.001_19_1_1_1_9_100,-,new,4
ERR3326041,7827,59_39_67_158_148_153_65,38,13.001_19_8_1_1_9_100,-,new,4