sample_name	result	bactinspector.result.metric_value	bactinspector.result.check_result	bactinspector.species.metric_value	bactinspector.species.check_result	confindr.contam_status.metric_value	confindr.contam_status.check_result	fastqc 1.Adapter Content.metric_value	fastqc 1.Adapter Content.check_result	fastqc 1.Basic Statistics.metric_value	fastqc 1.Basic Statistics.check_result	fastqc 1.Overrepresented sequences.metric_value	fastqc 1.Overrepresented sequences.check_result	fastqc 1.Per base N content.metric_value	fastqc 1.Per base N content.check_result	fastqc 1.Per base sequence quality.metric_value	fastqc 1.Per base sequence quality.check_result	fastqc 1.Per sequence GC content.metric_value	fastqc 1.Per sequence GC content.check_result	fastqc 1.Per sequence quality scores.metric_value	fastqc 1.Per sequence quality scores.check_result	fastqc 1.Sequence Duplication Levels.metric_value	fastqc 1.Sequence Duplication Levels.check_result	fastqc 1.Sequence Length Distribution.metric_value	fastqc 1.Sequence Length Distribution.check_result	fastqc 2.Adapter Content.metric_value	fastqc 2.Adapter Content.check_result	fastqc 2.Basic Statistics.metric_value	fastqc 2.Basic Statistics.check_result	fastqc 2.Overrepresented sequences.metric_value	fastqc 2.Overrepresented sequences.check_result	fastqc 2.Per base N content.metric_value	fastqc 2.Per base N content.check_result	fastqc 2.Per base sequence quality.metric_value	fastqc 2.Per base sequence quality.check_result	fastqc 2.Per sequence GC content.metric_value	fastqc 2.Per sequence GC content.check_result	fastqc 2.Per sequence quality scores.metric_value	fastqc 2.Per sequence quality scores.check_result	fastqc 2.Sequence Duplication Levels.metric_value	fastqc 2.Sequence Duplication Levels.check_result	fastqc 2.Sequence Length Distribution.metric_value	fastqc 2.Sequence Length Distribution.check_result	file_size_check.size.metric_value	file_size_check.size.check_result	quast.# contigs (>= 1000 bp).metric_value	quast.# contigs (>= 1000 bp).check_result	quast.N50.metric_value	quast.N50.check_result	quast.Total length (>= 1000 bp).metric_value	quast.Total length (>= 1000 bp).check_result
AAA-087-BF	WARNING	uncertain	WARNING	Staphylococcus haemolyticus	PASS	False	PASS	PASS	PASS	PASS	PASS	PASS	PASS	PASS	PASS	PASS	PASS	PASS	PASS	PASS	PASS	PASS	PASS	WARN	PASS	PASS	PASS	PASS	PASS	PASS	PASS	PASS	PASS	PASS	PASS	PASS	PASS	PASS	PASS	PASS	PASS	WARN	PASS	80.334919	PASS	50	PASS	103044	PASS	2555552	WARNING
AAA-090-AF	PASS	good	PASS	Staphylococcus saprophyticus	PASS	False	PASS	PASS	PASS	PASS	PASS	PASS	PASS	PASS	PASS	PASS	PASS	PASS	PASS	PASS	PASS	PASS	PASS	WARN	PASS	PASS	PASS	PASS	PASS	PASS	PASS	PASS	PASS	PASS	PASS	PASS	PASS	PASS	PASS	PASS	PASS	WARN	PASS	78.218277	PASS	19	PASS	355483	PASS	2584434	PASS
AAA-090-BF	PASS	good	PASS	Staphylococcus saprophyticus	PASS	False	PASS	PASS	PASS	PASS	PASS	PASS	PASS	PASS	PASS	PASS	PASS	PASS	PASS	PASS	PASS	PASS	PASS	WARN	PASS	PASS	PASS	PASS	PASS	PASS	PASS	PASS	PASS	PASS	PASS	PASS	PASS	PASS	PASS	PASS	PASS	WARN	PASS	83.629935	PASS	20	PASS	355483	PASS	2586726	PASS
BL-0047-AF	PASS	good	PASS	Escherichia coli	PASS	False	PASS	PASS	PASS	PASS	PASS	PASS	PASS	PASS	PASS	PASS	PASS	WARN	PASS	PASS	PASS	PASS	PASS	WARN	PASS	PASS	PASS	PASS	PASS	PASS	PASS	PASS	PASS	PASS	PASS	WARN	PASS	PASS	PASS	PASS	PASS	WARN	PASS	65.077321	PASS	62	PASS	205424	PASS	4964691	PASS
BL-0047-AP	PASS	good	PASS	Escherichia coli	PASS	False	PASS	PASS	PASS	PASS	PASS	PASS	PASS	PASS	PASS	PASS	PASS	WARN	PASS	PASS	PASS	PASS	PASS	WARN	PASS	PASS	PASS	PASS	PASS	WARN	PASS	PASS	PASS	PASS	PASS	WARN	PASS	PASS	PASS	PASS	PASS	WARN	PASS	61.581968	PASS	63	PASS	192124	PASS	4963444	PASS
BL-0047-BP	PASS	good	PASS	Escherichia coli	PASS	False	PASS	PASS	PASS	PASS	PASS	PASS	PASS	PASS	PASS	PASS	PASS	WARN	PASS	PASS	PASS	PASS	PASS	WARN	PASS	PASS	PASS	PASS	PASS	PASS	PASS	PASS	PASS	PASS	PASS	WARN	PASS	PASS	PASS	PASS	PASS	WARN	PASS	57.576773	PASS	60	PASS	196955	PASS	4964339	PASS
EOI-017-BP	FAILURE	good	PASS	Pseudomonas aeruginosa	PASS	True	FAILURE	PASS	PASS	PASS	PASS	PASS	PASS	PASS	PASS	PASS	PASS	WARN	PASS	PASS	PASS	PASS	PASS	WARN	PASS	PASS	PASS	PASS	PASS	PASS	PASS	PASS	PASS	PASS	PASS	WARN	PASS	PASS	PASS	PASS	PASS	WARN	PASS	100.315035	PASS	139	PASS	199456	PASS	11804888	WARNING
GH_ABA-1	PASS	good	PASS	Acinetobacter baumannii	PASS	False	PASS	PASS	PASS	PASS	PASS	PASS	PASS	PASS	PASS	PASS	PASS	PASS	PASS	PASS	PASS	PASS	PASS	WARN	PASS	PASS	PASS	PASS	PASS	PASS	PASS	PASS	PASS	PASS	PASS	PASS	PASS	PASS	PASS	PASS	PASS	WARN	PASS	63.545956	PASS	73	PASS	124275	PASS	4046709	PASS
GH_ABA-2	PASS	good	PASS	Acinetobacter baumannii	PASS	False	PASS	PASS	PASS	PASS	PASS	PASS	PASS	PASS	PASS	PASS	PASS	WARN	PASS	PASS	PASS	PASS	PASS	WARN	PASS	PASS	PASS	PASS	PASS	PASS	PASS	PASS	PASS	PASS	PASS	PASS	PASS	PASS	PASS	PASS	PASS	WARN	PASS	64.9037	PASS	75	PASS	124275	PASS	4048022	PASS
GH_ABA-3	PASS	good	PASS	Acinetobacter baumannii	PASS	False	PASS	PASS	PASS	PASS	PASS	PASS	PASS	PASS	PASS	PASS	PASS	PASS	PASS	PASS	PASS	PASS	PASS	WARN	PASS	PASS	PASS	PASS	PASS	PASS	PASS	PASS	PASS	PASS	PASS	WARN	PASS	PASS	PASS	PASS	PASS	WARN	PASS	65.563907	PASS	75	PASS	124275	PASS	4049048	PASS
GH_ABA-4	PASS	good	PASS	Acinetobacter baumannii	PASS	False	PASS	PASS	PASS	PASS	PASS	PASS	PASS	PASS	PASS	PASS	PASS	WARN	PASS	PASS	PASS	PASS	PASS	WARN	PASS	PASS	PASS	PASS	PASS	PASS	PASS	PASS	PASS	PASS	PASS	PASS	PASS	PASS	PASS	PASS	PASS	WARN	PASS	62.971984	PASS	75	PASS	124275	PASS	4048141	PASS
GH_ABA-5	PASS	good	PASS	Acinetobacter baumannii	PASS	False	PASS	PASS	PASS	PASS	PASS	PASS	PASS	PASS	PASS	PASS	PASS	PASS	PASS	PASS	PASS	PASS	PASS	WARN	PASS	PASS	PASS	PASS	PASS	PASS	PASS	PASS	PASS	PASS	PASS	PASS	PASS	PASS	PASS	PASS	PASS	WARN	PASS	58.9896	PASS	75	PASS	124275	PASS	4048495	PASS
GH_ABA-6	PASS	good	PASS	Acinetobacter baumannii	PASS	False	PASS	PASS	PASS	PASS	PASS	PASS	PASS	PASS	PASS	PASS	PASS	PASS	PASS	PASS	PASS	PASS	PASS	WARN	PASS	PASS	PASS	PASS	PASS	PASS	PASS	PASS	PASS	PASS	PASS	WARN	PASS	PASS	PASS	PASS	PASS	WARN	PASS	44.299376	PASS	75	PASS	124275	PASS	4045043	PASS
GH_ABA-7	PASS	good	PASS	Acinetobacter baumannii	PASS	False	PASS	PASS	PASS	PASS	PASS	PASS	PASS	PASS	PASS	PASS	PASS	PASS	PASS	PASS	PASS	PASS	PASS	WARN	PASS	PASS	PASS	PASS	PASS	PASS	PASS	PASS	PASS	PASS	PASS	PASS	PASS	PASS	PASS	PASS	PASS	WARN	PASS	61.20884	PASS	75	PASS	124275	PASS	4049459	PASS
GH_ABA-8	PASS	good	PASS	Acinetobacter baumannii	PASS	False	PASS	PASS	PASS	PASS	PASS	PASS	PASS	PASS	PASS	PASS	PASS	WARN	PASS	PASS	PASS	PASS	PASS	WARN	PASS	PASS	PASS	PASS	PASS	PASS	PASS	PASS	PASS	PASS	PASS	WARN	PASS	PASS	PASS	PASS	PASS	WARN	PASS	60.807778	PASS	78	PASS	124275	PASS	4049855	PASS
GH_ECO-1	PASS	good	PASS	Escherichia coli	PASS	False	PASS	PASS	PASS	PASS	PASS	PASS	PASS	PASS	PASS	PASS	PASS	WARN	PASS	PASS	PASS	PASS	PASS	WARN	PASS	PASS	PASS	PASS	PASS	PASS	PASS	PASS	PASS	PASS	PASS	WARN	PASS	PASS	PASS	PASS	PASS	WARN	PASS	68.372536	PASS	98	PASS	139350	PASS	4964557	PASS
GH_ECO-2	PASS	good	PASS	Escherichia coli	PASS	False	PASS	PASS	PASS	PASS	PASS	PASS	PASS	PASS	PASS	PASS	PASS	WARN	PASS	PASS	PASS	PASS	PASS	WARN	PASS	PASS	PASS	PASS	PASS	PASS	PASS	PASS	PASS	PASS	PASS	WARN	PASS	PASS	PASS	PASS	PASS	WARN	PASS	67.321188	PASS	94	PASS	191161	PASS	4964703	PASS
GH_ECO-3	PASS	good	PASS	Escherichia coli	PASS	False	PASS	PASS	PASS	PASS	PASS	PASS	PASS	PASS	PASS	PASS	PASS	WARN	PASS	PASS	PASS	PASS	PASS	WARN	PASS	PASS	PASS	PASS	PASS	PASS	PASS	PASS	PASS	PASS	PASS	WARN	PASS	PASS	PASS	PASS	PASS	WARN	PASS	63.910094	PASS	95	PASS	139319	PASS	4965688	PASS
GH_ECO-4	PASS	good	PASS	Escherichia coli	PASS	False	PASS	PASS	PASS	PASS	PASS	PASS	PASS	PASS	PASS	PASS	PASS	WARN	PASS	PASS	PASS	PASS	PASS	WARN	PASS	PASS	PASS	PASS	PASS	PASS	PASS	PASS	PASS	PASS	PASS	WARN	PASS	PASS	PASS	PASS	PASS	WARN	PASS	64.615612	PASS	93	PASS	139350	PASS	4965756	PASS
GH_ECO-5	PASS	good	PASS	Escherichia coli	PASS	False	PASS	PASS	PASS	PASS	PASS	PASS	PASS	PASS	PASS	PASS	PASS	WARN	PASS	PASS	PASS	PASS	PASS	WARN	PASS	PASS	PASS	PASS	PASS	PASS	PASS	PASS	PASS	PASS	PASS	WARN	PASS	PASS	PASS	PASS	PASS	WARN	PASS	62.348979	PASS	96	PASS	132728	PASS	4962787	PASS
GH_ECO-6	PASS	good	PASS	Escherichia coli	PASS	False	PASS	PASS	PASS	PASS	PASS	PASS	PASS	PASS	PASS	PASS	PASS	WARN	PASS	PASS	PASS	PASS	PASS	WARN	PASS	PASS	PASS	PASS	PASS	PASS	PASS	PASS	PASS	PASS	PASS	WARN	PASS	PASS	PASS	PASS	PASS	WARN	PASS	73.922311	PASS	97	PASS	139319	PASS	4963123	PASS
GH_ECO-7	PASS	good	PASS	Escherichia coli	PASS	False	PASS	PASS	PASS	PASS	PASS	PASS	PASS	PASS	PASS	PASS	PASS	WARN	PASS	PASS	PASS	PASS	PASS	WARN	PASS	PASS	PASS	PASS	PASS	PASS	PASS	PASS	PASS	PASS	PASS	WARN	PASS	PASS	PASS	PASS	PASS	WARN	PASS	73.949565	PASS	93	PASS	139350	PASS	4963237	PASS
GH_ECO-8	PASS	good	PASS	Escherichia coli	PASS	False	PASS	PASS	PASS	PASS	PASS	PASS	PASS	PASS	PASS	PASS	PASS	WARN	PASS	PASS	PASS	PASS	PASS	WARN	PASS	PASS	PASS	PASS	PASS	PASS	PASS	PASS	PASS	PASS	PASS	WARN	PASS	PASS	PASS	PASS	PASS	WARN	PASS	68.16794	PASS	95	PASS	139350	PASS	4963426	PASS
GH_KPN-1	PASS	good	PASS	Klebsiella pneumoniae	PASS	False	PASS	PASS	PASS	PASS	PASS	PASS	PASS	PASS	PASS	PASS	PASS	WARN	PASS	PASS	PASS	PASS	PASS	WARN	PASS	PASS	PASS	PASS	PASS	PASS	PASS	PASS	PASS	PASS	PASS	WARN	PASS	PASS	PASS	PASS	PASS	WARN	PASS	85.849086	PASS	57	PASS	295721	PASS	5609367	PASS
GH_KPN-2	PASS	good	PASS	Klebsiella pneumoniae	PASS	False	PASS	PASS	PASS	PASS	PASS	PASS	PASS	PASS	PASS	PASS	PASS	WARN	PASS	PASS	PASS	PASS	PASS	WARN	PASS	PASS	PASS	PASS	PASS	PASS	PASS	PASS	PASS	PASS	PASS	WARN	PASS	PASS	PASS	PASS	PASS	WARN	PASS	82.315512	PASS	55	PASS	308478	PASS	5609816	PASS
GH_KPN-3	PASS	good	PASS	Klebsiella pneumoniae	PASS	False	PASS	PASS	PASS	PASS	PASS	PASS	PASS	PASS	PASS	PASS	PASS	WARN	PASS	PASS	PASS	PASS	PASS	WARN	PASS	PASS	PASS	PASS	PASS	PASS	PASS	PASS	PASS	PASS	PASS	WARN	PASS	PASS	PASS	PASS	PASS	WARN	PASS	58.699658	PASS	57	PASS	230067	PASS	5608458	PASS
GH_KPN-4	PASS	good	PASS	Klebsiella pneumoniae	PASS	False	PASS	PASS	PASS	PASS	PASS	PASS	PASS	PASS	PASS	PASS	PASS	WARN	PASS	PASS	PASS	PASS	PASS	WARN	PASS	PASS	PASS	PASS	PASS	PASS	PASS	PASS	PASS	PASS	PASS	WARN	PASS	PASS	PASS	PASS	PASS	WARN	PASS	64.534318	PASS	58	PASS	224403	PASS	5607882	PASS
GH_KPN-5	PASS	good	PASS	Klebsiella pneumoniae	PASS	False	PASS	PASS	PASS	PASS	PASS	PASS	PASS	PASS	PASS	PASS	PASS	WARN	PASS	PASS	PASS	PASS	PASS	WARN	PASS	PASS	PASS	PASS	PASS	PASS	PASS	PASS	PASS	PASS	PASS	WARN	PASS	PASS	PASS	PASS	PASS	WARN	PASS	67.894493	PASS	57	PASS	295721	PASS	5608820	PASS
GH_KPN-6	PASS	good	PASS	Klebsiella pneumoniae	PASS	False	PASS	PASS	PASS	PASS	PASS	PASS	PASS	PASS	PASS	PASS	PASS	WARN	PASS	PASS	PASS	PASS	PASS	WARN	PASS	PASS	PASS	PASS	PASS	PASS	PASS	PASS	PASS	PASS	PASS	WARN	PASS	PASS	PASS	PASS	PASS	WARN	PASS	72.353025	PASS	57	PASS	273306	PASS	5609477	PASS
GH_KPN-7	PASS	good	PASS	Klebsiella pneumoniae	PASS	False	PASS	PASS	PASS	PASS	PASS	PASS	PASS	PASS	PASS	PASS	PASS	WARN	PASS	PASS	PASS	PASS	PASS	WARN	PASS	PASS	PASS	PASS	PASS	PASS	PASS	PASS	PASS	PASS	PASS	WARN	PASS	PASS	PASS	PASS	PASS	WARN	PASS	71.751119	PASS	59	PASS	230286	PASS	5608682	PASS
GH_KPN-8	PASS	good	PASS	Klebsiella pneumoniae	PASS	False	PASS	PASS	PASS	PASS	PASS	PASS	PASS	PASS	PASS	PASS	PASS	WARN	PASS	PASS	PASS	PASS	PASS	WARN	PASS	PASS	PASS	PASS	PASS	PASS	PASS	PASS	PASS	PASS	PASS	WARN	PASS	PASS	PASS	PASS	PASS	WARN	PASS	72.688837	PASS	58	PASS	295721	PASS	5609591	PASS
GH_SAU-1	PASS	good	PASS	Staphylococcus aureus	PASS	False	PASS	PASS	PASS	PASS	PASS	PASS	PASS	PASS	PASS	PASS	PASS	PASS	PASS	PASS	PASS	PASS	PASS	WARN	PASS	PASS	PASS	PASS	PASS	PASS	PASS	PASS	PASS	PASS	PASS	PASS	PASS	PASS	PASS	PASS	PASS	WARN	PASS	61.576562	PASS	28	PASS	302531	PASS	2771645	PASS
GH_SAU-2	PASS	good	PASS	Staphylococcus aureus	PASS	False	PASS	PASS	PASS	PASS	PASS	PASS	PASS	PASS	PASS	PASS	PASS	PASS	PASS	PASS	PASS	PASS	PASS	WARN	PASS	PASS	PASS	PASS	PASS	PASS	PASS	PASS	PASS	PASS	PASS	PASS	PASS	PASS	PASS	PASS	PASS	WARN	PASS	55.810683	PASS	29	PASS	224629	PASS	2772966	PASS
GH_SAU-3	PASS	good	PASS	Staphylococcus aureus	PASS	False	PASS	PASS	PASS	PASS	PASS	PASS	PASS	PASS	PASS	PASS	PASS	PASS	PASS	PASS	PASS	PASS	PASS	WARN	PASS	PASS	PASS	PASS	PASS	PASS	PASS	PASS	PASS	PASS	PASS	PASS	PASS	PASS	PASS	PASS	PASS	WARN	PASS	57.736187	PASS	29	PASS	224931	PASS	2771754	PASS
GH_SAU-4	PASS	good	PASS	Staphylococcus aureus	PASS	False	PASS	PASS	PASS	PASS	PASS	PASS	PASS	PASS	PASS	PASS	PASS	PASS	PASS	PASS	PASS	PASS	PASS	WARN	PASS	PASS	PASS	PASS	PASS	PASS	PASS	PASS	PASS	PASS	PASS	PASS	PASS	PASS	PASS	PASS	PASS	WARN	PASS	56.288204	PASS	28	PASS	224819	PASS	2773420	PASS
GH_SAU-5	PASS	good	PASS	Staphylococcus aureus	PASS	False	PASS	PASS	PASS	PASS	PASS	PASS	PASS	PASS	PASS	PASS	PASS	PASS	PASS	PASS	PASS	PASS	PASS	WARN	PASS	PASS	PASS	PASS	PASS	PASS	PASS	PASS	PASS	PASS	PASS	PASS	PASS	PASS	PASS	PASS	PASS	WARN	PASS	57.214785	PASS	26	PASS	302151	PASS	2772830	PASS
GH_SAU-6	PASS	good	PASS	Staphylococcus aureus	PASS	False	PASS	PASS	PASS	PASS	PASS	PASS	PASS	PASS	PASS	PASS	PASS	PASS	PASS	PASS	PASS	PASS	PASS	WARN	PASS	PASS	PASS	PASS	PASS	PASS	PASS	PASS	PASS	PASS	PASS	PASS	PASS	PASS	PASS	PASS	PASS	WARN	PASS	53.757748	PASS	24	PASS	410876	PASS	2774888	PASS
GH_SAU-7	PASS	good	PASS	Staphylococcus aureus	PASS	False	PASS	PASS	PASS	PASS	PASS	PASS	PASS	PASS	PASS	PASS	PASS	PASS	PASS	PASS	PASS	PASS	PASS	WARN	PASS	PASS	PASS	PASS	PASS	PASS	PASS	PASS	PASS	PASS	PASS	PASS	PASS	PASS	PASS	PASS	PASS	WARN	PASS	61.033061	PASS	28	PASS	224827	PASS	2772739	PASS
GH_SAU-8	PASS	good	PASS	Staphylococcus aureus	PASS	False	PASS	PASS	PASS	PASS	PASS	PASS	PASS	PASS	PASS	PASS	PASS	PASS	PASS	PASS	PASS	PASS	PASS	WARN	PASS	PASS	PASS	PASS	PASS	PASS	PASS	PASS	PASS	PASS	PASS	PASS	PASS	PASS	PASS	PASS	PASS	WARN	PASS	53.687028	PASS	30	PASS	224715	PASS	2772577	PASS
P-945-AP	FAILURE	good	PASS	Klebsiella pneumoniae	PASS	True	FAILURE	PASS	PASS	PASS	PASS	PASS	PASS	PASS	PASS	PASS	PASS	WARN	PASS	PASS	PASS	PASS	PASS	WARN	PASS	PASS	PASS	PASS	PASS	PASS	PASS	PASS	PASS	PASS	PASS	WARN	PASS	PASS	PASS	PASS	PASS	WARN	PASS	77.166311	PASS	904	FAILURE	181152	PASS	7157517	WARNING
PO-267-AP	FAILURE	good	PASS	Escherichia coli	PASS	True	FAILURE	PASS	PASS	PASS	PASS	PASS	PASS	PASS	PASS	PASS	PASS	WARN	PASS	PASS	PASS	PASS	PASS	WARN	PASS	PASS	PASS	PASS	PASS	PASS	PASS	PASS	PASS	PASS	PASS	WARN	PASS	PASS	PASS	PASS	PASS	WARN	PASS	55.975552	PASS	1531	FAILURE	4528	FAILURE	5830539	PASS
PO-267-BP	FAILURE	good	PASS	Escherichia coli	PASS	True	FAILURE	PASS	PASS	PASS	PASS	PASS	PASS	PASS	PASS	PASS	PASS	WARN	PASS	PASS	PASS	PASS	PASS	WARN	PASS	PASS	PASS	PASS	PASS	PASS	PASS	PASS	PASS	PASS	PASS	WARN	PASS	PASS	PASS	PASS	PASS	WARN	PASS	69.07197	PASS	1670	FAILURE	3562	FAILURE	5792191	PASS
PO-413-BF	PASS	good	PASS	Salmonella enterica subsp. enterica serovar Typhimurium	PASS	False	PASS	PASS	PASS	PASS	PASS	PASS	PASS	PASS	PASS	PASS	PASS	WARN	PASS	PASS	PASS	PASS	PASS	WARN	PASS	PASS	PASS	PASS	PASS	PASS	PASS	PASS	PASS	PASS	PASS	WARN	PASS	PASS	PASS	PASS	PASS	WARN	PASS	115.495202	PASS	42	PASS	270705	PASS	4901998	PASS
PO-610-BF	PASS	good	PASS	Salmonella enterica subsp. enterica serovar Typhi	PASS	False	PASS	PASS	PASS	PASS	PASS	PASS	PASS	PASS	PASS	PASS	PASS	WARN	PASS	PASS	PASS	PASS	PASS	WARN	PASS	PASS	PASS	PASS	PASS	PASS	PASS	PASS	PASS	PASS	PASS	WARN	PASS	PASS	PASS	PASS	PASS	WARN	PASS	95.646452	PASS	57	PASS	173301	PASS	4823500	PASS
PO-712-BP	FAILURE	good	PASS	Escherichia coli	PASS	True	FAILURE	PASS	PASS	PASS	PASS	PASS	PASS	PASS	PASS	PASS	PASS	WARN	PASS	PASS	PASS	PASS	PASS	WARN	PASS	PASS	PASS	PASS	PASS	PASS	PASS	PASS	PASS	PASS	PASS	WARN	PASS	PASS	PASS	PASS	PASS	WARN	PASS	71.169483	PASS	1618	FAILURE	3784	FAILURE	5828993	PASS
PO-816-BF	PASS	good	PASS	Salmonella enterica subsp. enterica serovar Typhi	PASS	False	PASS	PASS	PASS	PASS	PASS	PASS	PASS	PASS	PASS	PASS	PASS	WARN	PASS	PASS	PASS	PASS	PASS	WARN	PASS	PASS	PASS	PASS	PASS	PASS	PASS	PASS	PASS	PASS	PASS	WARN	PASS	PASS	PASS	PASS	PASS	WARN	PASS	95.729296	PASS	58	PASS	185337	PASS	4826361	PASS
VC-5-BF	PASS	good	PASS	Vibrio cholerae	PASS	False	PASS	PASS	PASS	PASS	PASS	PASS	PASS	PASS	PASS	PASS	PASS	WARN	PASS	PASS	PASS	PASS	PASS	WARN	PASS	PASS	PASS	PASS	PASS	PASS	PASS	PASS	PASS	PASS	PASS	PASS	PASS	PASS	PASS	PASS	PASS	WARN	PASS	56.639941	PASS	50	PASS	235735	PASS	3995151	PASS
VOA-019-BP	FAILURE	uncertain	WARNING	Salmonella enterica subsp. enterica serovar Typhimurium	PASS	True	FAILURE	PASS	PASS	PASS	PASS	PASS	PASS	PASS	PASS	PASS	PASS	PASS	PASS	PASS	PASS	PASS	PASS	WARN	PASS	PASS	PASS	PASS	PASS	PASS	PASS	PASS	PASS	PASS	PASS	PASS	PASS	PASS	PASS	PASS	PASS	WARN	PASS	94.38249	PASS	140	PASS	222912	PASS	11526779	WARNING
