atpD.1	atpD.10	atpD.100	atpD.101	atpD.102	atpD.103	atpD.104	atpD.105	atpD.106	atpD.107	atpD.108	atpD.109	atpD.11	atpD.110	atpD.111	atpD.112	atpD.113	atpD.114	atpD.115	atpD.116	atpD.117	atpD.118	atpD.119	atpD.12	atpD.120	atpD.121	atpD.122	atpD.123	atpD.124	atpD.125	atpD.126	atpD.127	atpD.128	atpD.129	atpD.13	atpD.130	atpD.131	atpD.132	atpD.133	atpD.134	atpD.135	atpD.136	atpD.137	atpD.138	atpD.139	atpD.14	atpD.140	atpD.141	atpD.142	atpD.143	atpD.144	atpD.145	atpD.146	atpD.147	atpD.148	atpD.149	atpD.15	atpD.150	atpD.151	atpD.152	atpD.153	atpD.154	atpD.155	atpD.156	atpD.157	atpD.158	atpD.159	atpD.16	atpD.160	atpD.161	atpD.162	atpD.163	atpD.164	atpD.165	atpD.166	atpD.167	atpD.168	atpD.169	atpD.17	atpD.170	atpD.171	atpD.172	atpD.173	atpD.174	atpD.175	atpD.176	atpD.177	atpD.178	atpD.179	atpD.18	atpD.180	atpD.181	atpD.182	atpD.183	atpD.184	atpD.185	atpD.186	atpD.187	atpD.19	atpD.2	atpD.20	atpD.21	atpD.22	atpD.23	atpD.24	atpD.25	atpD.26	atpD.27	atpD.28	atpD.29	atpD.3	atpD.30	atpD.31	atpD.32	atpD.33	atpD.34	atpD.35	atpD.36	atpD.37	atpD.38	atpD.39	atpD.4	atpD.40	atpD.41	atpD.42	atpD.43	atpD.44	atpD.45	atpD.46	atpD.47	atpD.48	atpD.49	atpD.5	atpD.50	atpD.51	atpD.52	atpD.53	atpD.54	atpD.55	atpD.56	atpD.57	atpD.58	atpD.59	atpD.6	atpD.60	atpD.61	atpD.62	atpD.63	atpD.64	atpD.65	atpD.66	atpD.67	atpD.68	atpD.69	atpD.7	atpD.70	atpD.71	atpD.72	atpD.73	atpD.74	atpD.75	atpD.76	atpD.77	atpD.78	atpD.79	atpD.8	atpD.80	atpD.81	atpD.82	atpD.83	atpD.84	atpD.85	atpD.86	atpD.87	atpD.88	atpD.89	atpD.9	atpD.90	atpD.91	atpD.92	atpD.93	atpD.94	atpD.95	atpD.96	atpD.97	atpD.98	atpD.99
gapA.1	gapA.10	gapA.100	gapA.101	gapA.102	gapA.103	gapA.104	gapA.105	gapA.106	gapA.107	gapA.108	gapA.109	gapA.11	gapA.110	gapA.111	gapA.112	gapA.113	gapA.114	gapA.115	gapA.116	gapA.117	gapA.118	gapA.119	gapA.12	gapA.120	gapA.121	gapA.122	gapA.123	gapA.124	gapA.125	gapA.126	gapA.127	gapA.128	gapA.129	gapA.13	gapA.130	gapA.131	gapA.132	gapA.133	gapA.134	gapA.135	gapA.136	gapA.137	gapA.138	gapA.139	gapA.14	gapA.140	gapA.141	gapA.142	gapA.143	gapA.144	gapA.145	gapA.146	gapA.147	gapA.148	gapA.149	gapA.15	gapA.150	gapA.151	gapA.152	gapA.153	gapA.154	gapA.155	gapA.156	gapA.157	gapA.158	gapA.159	gapA.16	gapA.160	gapA.161	gapA.162	gapA.163	gapA.164	gapA.165	gapA.166	gapA.167	gapA.168	gapA.169	gapA.17	gapA.170	gapA.171	gapA.172	gapA.173	gapA.174	gapA.175	gapA.176	gapA.177	gapA.178	gapA.179	gapA.18	gapA.180	gapA.181	gapA.182	gapA.183	gapA.184	gapA.185	gapA.186	gapA.187	gapA.188	gapA.189	gapA.19	gapA.190	gapA.191	gapA.192	gapA.193	gapA.194	gapA.195	gapA.196	gapA.197	gapA.198	gapA.199	gapA.2	gapA.20	gapA.200	gapA.201	gapA.202	gapA.203	gapA.204	gapA.205	gapA.206	gapA.207	gapA.208	gapA.209	gapA.21	gapA.210	gapA.211	gapA.212	gapA.213	gapA.214	gapA.215	gapA.216	gapA.217	gapA.218	gapA.219	gapA.22	gapA.220	gapA.221	gapA.222	gapA.223	gapA.224	gapA.225	gapA.226	gapA.227	gapA.228	gapA.229	gapA.23	gapA.230	gapA.231	gapA.232	gapA.233	gapA.234	gapA.235	gapA.236	gapA.237	gapA.24	gapA.25	gapA.26	gapA.27	gapA.28	gapA.29	gapA.3	gapA.30	gapA.31	gapA.32	gapA.33	gapA.34	gapA.35	gapA.36	gapA.37	gapA.38	gapA.39	gapA.4	gapA.40	gapA.41	gapA.42	gapA.43	gapA.44	gapA.45	gapA.46	gapA.47	gapA.48	gapA.49	gapA.5	gapA.50	gapA.51	gapA.52	gapA.53	gapA.54	gapA.55	gapA.56	gapA.57	gapA.58	gapA.59	gapA.6	gapA.60	gapA.61	gapA.62	gapA.63	gapA.64	gapA.65	gapA.66	gapA.67	gapA.68	gapA.69	gapA.7	gapA.70	gapA.71	gapA.72	gapA.73	gapA.74	gapA.75	gapA.76	gapA.77	gapA.78	gapA.79	gapA.8	gapA.80	gapA.81	gapA.82	gapA.83	gapA.84	gapA.85	gapA.86	gapA.87	gapA.88	gapA.89	gapA.9	gapA.90	gapA.91	gapA.92	gapA.93	gapA.94	gapA.95	gapA.96	gapA.97	gapA.98	gapA.99
guaA.1	guaA.10	guaA.100	guaA.101	guaA.102	guaA.103	guaA.104	guaA.105	guaA.106	guaA.107	guaA.108	guaA.109	guaA.11	guaA.110	guaA.111	guaA.112	guaA.113	guaA.114	guaA.115	guaA.116	guaA.117	guaA.118	guaA.119	guaA.12	guaA.120	guaA.121	guaA.122	guaA.123	guaA.124	guaA.125	guaA.126	guaA.127	guaA.128	guaA.129	guaA.13	guaA.130	guaA.131	guaA.132	guaA.133	guaA.134	guaA.135	guaA.136	guaA.137	guaA.138	guaA.139	guaA.14	guaA.140	guaA.141	guaA.142	guaA.143	guaA.144	guaA.145	guaA.146	guaA.147	guaA.148	guaA.149	guaA.15	guaA.150	guaA.151	guaA.152	guaA.153	guaA.154	guaA.155	guaA.156	guaA.157	guaA.158	guaA.159	guaA.16	guaA.160	guaA.161	guaA.162	guaA.163	guaA.164	guaA.165	guaA.166	guaA.167	guaA.168	guaA.169	guaA.17	guaA.170	guaA.171	guaA.172	guaA.173	guaA.174	guaA.175	guaA.176	guaA.177	guaA.178	guaA.179	guaA.18	guaA.180	guaA.181	guaA.182	guaA.183	guaA.184	guaA.185	guaA.186	guaA.187	guaA.188	guaA.189	guaA.19	guaA.190	guaA.191	guaA.192	guaA.193	guaA.194	guaA.195	guaA.196	guaA.197	guaA.198	guaA.199	guaA.2	guaA.20	guaA.200	guaA.201	guaA.202	guaA.203	guaA.204	guaA.205	guaA.206	guaA.207	guaA.208	guaA.209	guaA.21	guaA.210	guaA.211	guaA.212	guaA.213	guaA.214	guaA.215	guaA.216	guaA.217	guaA.218	guaA.219	guaA.22	guaA.220	guaA.221	guaA.222	guaA.223	guaA.224	guaA.225	guaA.226	guaA.227	guaA.228	guaA.229	guaA.23	guaA.230	guaA.231	guaA.232	guaA.233	guaA.234	guaA.235	guaA.236	guaA.237	guaA.238	guaA.239	guaA.24	guaA.240	guaA.241	guaA.242	guaA.243	guaA.244	guaA.245	guaA.246	guaA.247	guaA.248	guaA.249	guaA.25	guaA.250	guaA.251	guaA.252	guaA.253	guaA.254	guaA.255	guaA.256	guaA.257	guaA.258	guaA.259	guaA.26	guaA.260	guaA.261	guaA.262	guaA.263	guaA.264	guaA.265	guaA.266	guaA.267	guaA.268	guaA.269	guaA.27	guaA.270	guaA.271	guaA.272	guaA.273	guaA.274	guaA.275	guaA.276	guaA.277	guaA.278	guaA.279	guaA.28	guaA.280	guaA.281	guaA.282	guaA.283	guaA.284	guaA.285	guaA.286	guaA.287	guaA.288	guaA.289	guaA.29	guaA.290	guaA.291	guaA.292	guaA.293	guaA.294	guaA.295	guaA.296	guaA.297	guaA.298	guaA.299	guaA.3	guaA.30	guaA.300	guaA.301	guaA.302	guaA.303	guaA.304	guaA.305	guaA.306	guaA.307	guaA.308	guaA.309	guaA.31	guaA.310	guaA.311	guaA.312	guaA.313	guaA.314	guaA.315	guaA.316	guaA.317	guaA.318	guaA.319	guaA.32	guaA.320	guaA.321	guaA.322	guaA.323	guaA.324	guaA.325	guaA.326	guaA.327	guaA.328	guaA.329	guaA.33	guaA.330	guaA.331	guaA.332	guaA.333	guaA.334	guaA.335	guaA.336	guaA.337	guaA.338	guaA.339	guaA.34	guaA.340	guaA.341	guaA.342	guaA.343	guaA.344	guaA.345	guaA.346	guaA.347	guaA.348	guaA.349	guaA.35	guaA.350	guaA.351	guaA.352	guaA.353	guaA.354	guaA.355	guaA.356	guaA.357	guaA.358	guaA.359	guaA.36	guaA.360	guaA.361	guaA.362	guaA.363	guaA.364	guaA.365	guaA.366	guaA.367	guaA.368	guaA.369	guaA.37	guaA.370	guaA.371	guaA.372	guaA.373	guaA.374	guaA.375	guaA.376	guaA.377	guaA.378	guaA.379	guaA.38	guaA.380	guaA.381	guaA.382	guaA.383	guaA.384	guaA.385	guaA.386	guaA.387	guaA.388	guaA.389	guaA.39	guaA.390	guaA.391	guaA.392	guaA.393	guaA.394	guaA.395	guaA.396	guaA.397	guaA.398	guaA.399	guaA.4	guaA.40	guaA.400	guaA.401	guaA.402	guaA.403	guaA.404	guaA.405	guaA.406	guaA.407	guaA.408	guaA.409	guaA.41	guaA.410	guaA.411	guaA.412	guaA.413	guaA.414	guaA.415	guaA.416	guaA.417	guaA.418	guaA.419	guaA.42	guaA.420	guaA.421	guaA.422	guaA.423	guaA.424	guaA.425	guaA.426	guaA.427	guaA.428	guaA.429	guaA.43	guaA.430	guaA.431	guaA.432	guaA.433	guaA.434	guaA.435	guaA.436	guaA.437	guaA.438	guaA.439	guaA.44	guaA.440	guaA.441	guaA.442	guaA.443	guaA.444	guaA.445	guaA.446	guaA.447	guaA.448	guaA.449	guaA.45	guaA.450	guaA.451	guaA.452	guaA.453	guaA.454	guaA.455	guaA.456	guaA.457	guaA.458	guaA.459	guaA.46	guaA.460	guaA.461	guaA.462	guaA.463	guaA.464	guaA.465	guaA.466	guaA.467	guaA.468	guaA.469	guaA.47	guaA.470	guaA.471	guaA.472	guaA.473	guaA.474	guaA.475	guaA.476	guaA.477	guaA.478	guaA.479	guaA.48	guaA.480	guaA.481	guaA.482	guaA.483	guaA.484	guaA.485	guaA.486	guaA.487	guaA.488	guaA.489	guaA.49	guaA.490	guaA.491	guaA.492	guaA.493	guaA.494	guaA.495	guaA.5	guaA.50	guaA.51	guaA.52	guaA.53	guaA.54	guaA.55	guaA.56	guaA.57	guaA.58	guaA.59	guaA.6	guaA.60	guaA.61	guaA.62	guaA.63	guaA.64	guaA.65	guaA.66	guaA.67	guaA.68	guaA.69	guaA.7	guaA.70	guaA.71	guaA.72	guaA.73	guaA.74	guaA.75	guaA.76	guaA.77	guaA.78	guaA.79	guaA.8	guaA.80	guaA.81	guaA.82	guaA.83	guaA.84	guaA.85	guaA.86	guaA.87	guaA.88	guaA.89	guaA.9	guaA.90	guaA.91	guaA.92	guaA.93	guaA.94	guaA.95	guaA.96	guaA.97	guaA.98	guaA.99
mutM.1	mutM.10	mutM.100	mutM.101	mutM.102	mutM.103	mutM.104	mutM.105	mutM.106	mutM.107	mutM.108	mutM.109	mutM.11	mutM.110	mutM.111	mutM.112	mutM.113	mutM.114	mutM.115	mutM.116	mutM.117	mutM.118	mutM.119	mutM.12	mutM.120	mutM.121	mutM.122	mutM.123	mutM.124	mutM.125	mutM.126	mutM.127	mutM.128	mutM.129	mutM.13	mutM.130	mutM.131	mutM.132	mutM.133	mutM.134	mutM.135	mutM.136	mutM.137	mutM.138	mutM.139	mutM.14	mutM.140	mutM.141	mutM.142	mutM.143	mutM.144	mutM.145	mutM.146	mutM.147	mutM.148	mutM.149	mutM.15	mutM.150	mutM.151	mutM.152	mutM.153	mutM.154	mutM.155	mutM.156	mutM.157	mutM.158	mutM.159	mutM.16	mutM.160	mutM.161	mutM.162	mutM.163	mutM.164	mutM.165	mutM.166	mutM.167	mutM.168	mutM.169	mutM.17	mutM.170	mutM.171	mutM.172	mutM.173	mutM.174	mutM.175	mutM.176	mutM.177	mutM.178	mutM.179	mutM.18	mutM.180	mutM.181	mutM.182	mutM.183	mutM.184	mutM.185	mutM.186	mutM.187	mutM.188	mutM.189	mutM.19	mutM.190	mutM.191	mutM.192	mutM.193	mutM.194	mutM.195	mutM.196	mutM.197	mutM.198	mutM.199	mutM.2	mutM.20	mutM.200	mutM.201	mutM.202	mutM.203	mutM.204	mutM.205	mutM.206	mutM.207	mutM.208	mutM.209	mutM.21	mutM.210	mutM.211	mutM.212	mutM.213	mutM.214	mutM.215	mutM.216	mutM.217	mutM.218	mutM.219	mutM.22	mutM.220	mutM.221	mutM.222	mutM.223	mutM.224	mutM.225	mutM.226	mutM.227	mutM.228	mutM.229	mutM.23	mutM.230	mutM.231	mutM.232	mutM.233	mutM.234	mutM.235	mutM.236	mutM.237	mutM.24	mutM.25	mutM.26	mutM.27	mutM.28	mutM.29	mutM.3	mutM.30	mutM.31	mutM.32	mutM.33	mutM.34	mutM.35	mutM.36	mutM.37	mutM.38	mutM.39	mutM.4	mutM.40	mutM.41	mutM.42	mutM.43	mutM.44	mutM.45	mutM.46	mutM.47	mutM.48	mutM.49	mutM.5	mutM.50	mutM.51	mutM.52	mutM.53	mutM.54	mutM.55	mutM.56	mutM.57	mutM.58	mutM.59	mutM.6	mutM.60	mutM.61	mutM.62	mutM.63	mutM.64	mutM.65	mutM.66	mutM.67	mutM.68	mutM.69	mutM.7	mutM.70	mutM.71	mutM.72	mutM.73	mutM.74	mutM.75	mutM.76	mutM.77	mutM.78	mutM.79	mutM.8	mutM.80	mutM.81	mutM.82	mutM.83	mutM.84	mutM.85	mutM.86	mutM.87	mutM.88	mutM.89	mutM.9	mutM.90	mutM.91	mutM.92	mutM.93	mutM.94	mutM.95	mutM.96	mutM.97	mutM.98	mutM.99
nuoD.1	nuoD.10	nuoD.100	nuoD.101	nuoD.102	nuoD.103	nuoD.104	nuoD.105	nuoD.106	nuoD.107	nuoD.108	nuoD.109	nuoD.11	nuoD.110	nuoD.111	nuoD.112	nuoD.113	nuoD.114	nuoD.115	nuoD.116	nuoD.117	nuoD.118	nuoD.119	nuoD.12	nuoD.120	nuoD.121	nuoD.122	nuoD.123	nuoD.124	nuoD.125	nuoD.126	nuoD.127	nuoD.128	nuoD.129	nuoD.13	nuoD.130	nuoD.131	nuoD.132	nuoD.133	nuoD.134	nuoD.135	nuoD.136	nuoD.137	nuoD.138	nuoD.139	nuoD.14	nuoD.140	nuoD.141	nuoD.142	nuoD.143	nuoD.144	nuoD.145	nuoD.146	nuoD.147	nuoD.148	nuoD.149	nuoD.15	nuoD.150	nuoD.151	nuoD.152	nuoD.153	nuoD.154	nuoD.155	nuoD.156	nuoD.157	nuoD.158	nuoD.159	nuoD.16	nuoD.160	nuoD.161	nuoD.162	nuoD.163	nuoD.164	nuoD.165	nuoD.166	nuoD.167	nuoD.168	nuoD.169	nuoD.17	nuoD.170	nuoD.171	nuoD.172	nuoD.173	nuoD.174	nuoD.175	nuoD.176	nuoD.177	nuoD.178	nuoD.179	nuoD.18	nuoD.180	nuoD.181	nuoD.182	nuoD.183	nuoD.184	nuoD.185	nuoD.186	nuoD.187	nuoD.188	nuoD.189	nuoD.19	nuoD.190	nuoD.2	nuoD.20	nuoD.21	nuoD.22	nuoD.23	nuoD.24	nuoD.25	nuoD.26	nuoD.27	nuoD.28	nuoD.29	nuoD.3	nuoD.30	nuoD.31	nuoD.32	nuoD.33	nuoD.34	nuoD.35	nuoD.36	nuoD.37	nuoD.38	nuoD.39	nuoD.4	nuoD.40	nuoD.41	nuoD.42	nuoD.43	nuoD.44	nuoD.45	nuoD.46	nuoD.47	nuoD.48	nuoD.49	nuoD.5	nuoD.50	nuoD.51	nuoD.52	nuoD.53	nuoD.54	nuoD.55	nuoD.56	nuoD.57	nuoD.58	nuoD.59	nuoD.6	nuoD.60	nuoD.61	nuoD.62	nuoD.63	nuoD.64	nuoD.65	nuoD.66	nuoD.67	nuoD.68	nuoD.69	nuoD.7	nuoD.70	nuoD.71	nuoD.72	nuoD.73	nuoD.74	nuoD.75	nuoD.76	nuoD.77	nuoD.78	nuoD.79	nuoD.8	nuoD.80	nuoD.81	nuoD.82	nuoD.83	nuoD.84	nuoD.85	nuoD.86	nuoD.87	nuoD.88	nuoD.89	nuoD.9	nuoD.90	nuoD.91	nuoD.92	nuoD.93	nuoD.94	nuoD.95	nuoD.96	nuoD.97	nuoD.98	nuoD.99
ppsA.1	ppsA.10	ppsA.100	ppsA.101	ppsA.102	ppsA.103	ppsA.104	ppsA.105	ppsA.106	ppsA.107	ppsA.108	ppsA.109	ppsA.11	ppsA.110	ppsA.111	ppsA.112	ppsA.113	ppsA.114	ppsA.115	ppsA.116	ppsA.117	ppsA.118	ppsA.119	ppsA.12	ppsA.120	ppsA.121	ppsA.122	ppsA.123	ppsA.124	ppsA.125	ppsA.126	ppsA.127	ppsA.128	ppsA.129	ppsA.13	ppsA.130	ppsA.131	ppsA.132	ppsA.133	ppsA.134	ppsA.135	ppsA.136	ppsA.137	ppsA.138	ppsA.139	ppsA.14	ppsA.140	ppsA.141	ppsA.142	ppsA.143	ppsA.144	ppsA.145	ppsA.146	ppsA.147	ppsA.148	ppsA.149	ppsA.15	ppsA.150	ppsA.151	ppsA.152	ppsA.153	ppsA.154	ppsA.155	ppsA.156	ppsA.157	ppsA.158	ppsA.159	ppsA.16	ppsA.160	ppsA.161	ppsA.162	ppsA.163	ppsA.164	ppsA.165	ppsA.166	ppsA.167	ppsA.168	ppsA.169	ppsA.17	ppsA.170	ppsA.171	ppsA.172	ppsA.173	ppsA.174	ppsA.175	ppsA.176	ppsA.177	ppsA.178	ppsA.179	ppsA.18	ppsA.180	ppsA.181	ppsA.182	ppsA.183	ppsA.184	ppsA.185	ppsA.186	ppsA.187	ppsA.188	ppsA.189	ppsA.19	ppsA.190	ppsA.191	ppsA.192	ppsA.193	ppsA.194	ppsA.195	ppsA.196	ppsA.197	ppsA.198	ppsA.199	ppsA.2	ppsA.20	ppsA.200	ppsA.201	ppsA.202	ppsA.203	ppsA.204	ppsA.205	ppsA.206	ppsA.207	ppsA.208	ppsA.209	ppsA.21	ppsA.210	ppsA.211	ppsA.212	ppsA.213	ppsA.214	ppsA.215	ppsA.216	ppsA.217	ppsA.218	ppsA.219	ppsA.22	ppsA.220	ppsA.221	ppsA.222	ppsA.223	ppsA.224	ppsA.225	ppsA.226	ppsA.227	ppsA.228	ppsA.229	ppsA.23	ppsA.230	ppsA.231	ppsA.232	ppsA.233	ppsA.234	ppsA.235	ppsA.236	ppsA.237	ppsA.238	ppsA.239	ppsA.24	ppsA.240	ppsA.241	ppsA.242	ppsA.243	ppsA.244	ppsA.245	ppsA.246	ppsA.247	ppsA.248	ppsA.249	ppsA.25	ppsA.250	ppsA.251	ppsA.252	ppsA.253	ppsA.254	ppsA.255	ppsA.256	ppsA.257	ppsA.258	ppsA.259	ppsA.26	ppsA.260	ppsA.261	ppsA.262	ppsA.263	ppsA.264	ppsA.265	ppsA.266	ppsA.27	ppsA.28	ppsA.29	ppsA.3	ppsA.30	ppsA.31	ppsA.32	ppsA.33	ppsA.34	ppsA.35	ppsA.36	ppsA.37	ppsA.38	ppsA.39	ppsA.4	ppsA.40	ppsA.41	ppsA.42	ppsA.43	ppsA.44	ppsA.45	ppsA.46	ppsA.47	ppsA.48	ppsA.49	ppsA.5	ppsA.50	ppsA.51	ppsA.52	ppsA.53	ppsA.54	ppsA.55	ppsA.56	ppsA.57	ppsA.58	ppsA.59	ppsA.6	ppsA.60	ppsA.61	ppsA.62	ppsA.63	ppsA.64	ppsA.65	ppsA.66	ppsA.67	ppsA.68	ppsA.69	ppsA.7	ppsA.70	ppsA.71	ppsA.72	ppsA.73	ppsA.74	ppsA.75	ppsA.76	ppsA.77	ppsA.78	ppsA.79	ppsA.8	ppsA.80	ppsA.81	ppsA.82	ppsA.83	ppsA.84	ppsA.85	ppsA.86	ppsA.87	ppsA.88	ppsA.89	ppsA.9	ppsA.90	ppsA.91	ppsA.92	ppsA.93	ppsA.94	ppsA.95	ppsA.96	ppsA.97	ppsA.98	ppsA.99
recA.1	recA.10	recA.100	recA.101	recA.102	recA.103	recA.104	recA.105	recA.106	recA.107	recA.108	recA.109	recA.11	recA.110	recA.111	recA.112	recA.113	recA.114	recA.115	recA.116	recA.117	recA.118	recA.119	recA.12	recA.120	recA.121	recA.122	recA.123	recA.124	recA.125	recA.126	recA.127	recA.128	recA.129	recA.13	recA.130	recA.131	recA.132	recA.133	recA.134	recA.135	recA.136	recA.137	recA.138	recA.139	recA.14	recA.140	recA.141	recA.142	recA.143	recA.144	recA.145	recA.146	recA.147	recA.148	recA.149	recA.15	recA.150	recA.151	recA.152	recA.153	recA.154	recA.155	recA.156	recA.157	recA.158	recA.159	recA.16	recA.160	recA.161	recA.162	recA.163	recA.164	recA.165	recA.166	recA.167	recA.168	recA.169	recA.17	recA.170	recA.171	recA.172	recA.173	recA.174	recA.175	recA.176	recA.177	recA.178	recA.179	recA.18	recA.180	recA.181	recA.182	recA.183	recA.184	recA.185	recA.186	recA.187	recA.188	recA.189	recA.19	recA.190	recA.191	recA.192	recA.193	recA.194	recA.195	recA.196	recA.197	recA.198	recA.199	recA.2	recA.20	recA.200	recA.201	recA.202	recA.203	recA.204	recA.205	recA.206	recA.207	recA.208	recA.209	recA.21	recA.210	recA.211	recA.212	recA.213	recA.214	recA.215	recA.216	recA.217	recA.218	recA.219	recA.22	recA.220	recA.221	recA.222	recA.223	recA.224	recA.225	recA.226	recA.227	recA.228	recA.23	recA.24	recA.25	recA.26	recA.27	recA.28	recA.29	recA.3	recA.30	recA.31	recA.32	recA.33	recA.34	recA.35	recA.36	recA.37	recA.38	recA.39	recA.4	recA.40	recA.41	recA.42	recA.43	recA.44	recA.45	recA.46	recA.47	recA.48	recA.49	recA.5	recA.50	recA.51	recA.52	recA.53	recA.54	recA.55	recA.56	recA.57	recA.58	recA.59	recA.6	recA.60	recA.61	recA.62	recA.63	recA.64	recA.65	recA.66	recA.67	recA.68	recA.69	recA.7	recA.70	recA.71	recA.72	recA.73	recA.74	recA.75	recA.76	recA.77	recA.78	recA.79	recA.8	recA.80	recA.81	recA.82	recA.83	recA.84	recA.85	recA.86	recA.87	recA.88	recA.89	recA.9	recA.90	recA.91	recA.92	recA.93	recA.94	recA.95	recA.96	recA.97	recA.98	recA.99
