16S	16S.1	16S.2	16S.3	16S.4	16S.5	16S.6	16S.7	16S.8	16S.9
ftsZ	ftsZ.1	ftsZ.10	ftsZ.11	ftsZ.12	ftsZ.13	ftsZ.14	ftsZ.2	ftsZ.3	ftsZ.4	ftsZ.5	ftsZ.6	ftsZ.7	ftsZ.8	ftsZ.9
gltA	gltA.1	gltA.10	gltA.11	gltA.12	gltA.13	gltA.14	gltA.15	gltA.16	gltA.17	gltA.2	gltA.3	gltA.4	gltA.5	gltA.6	gltA.7	gltA.8	gltA.9
groEL	groEL.1	groEL.10	groEL.11	groEL.12	groEL.13	groEL.14	groEL.15	groEL.16	groEL.17	groEL.18	groEL.19	groEL.2	groEL.3	groEL.4	groEL.5	groEL.6	groEL.7	groEL.8	groEL.9
ribC	ribC.1	ribC.10	ribC.11	ribC.12	ribC.13	ribC.14	ribC.15	ribC.16	ribC.17	ribC.18	ribC.19	ribC.2	ribC.3	ribC.4	ribC.5	ribC.6	ribC.7	ribC.8	ribC.9
rpoB	rpoB.1	rpoB.10	rpoB.11	rpoB.12	rpoB.13	rpoB.14	rpoB.15	rpoB.16	rpoB.17	rpoB.2	rpoB.3	rpoB.4	rpoB.5	rpoB.6	rpoB.7	rpoB.8	rpoB.9
