RIRDC_adk	RIRDC_adk.1	RIRDC_adk.10	RIRDC_adk.11	RIRDC_adk.12	RIRDC_adk.13	RIRDC_adk.14	RIRDC_adk.15	RIRDC_adk.16	RIRDC_adk.17	RIRDC_adk.18	RIRDC_adk.19	RIRDC_adk.2	RIRDC_adk.20	RIRDC_adk.21	RIRDC_adk.22	RIRDC_adk.23	RIRDC_adk.24	RIRDC_adk.25	RIRDC_adk.26	RIRDC_adk.27	RIRDC_adk.28	RIRDC_adk.29	RIRDC_adk.3	RIRDC_adk.30	RIRDC_adk.31	RIRDC_adk.32	RIRDC_adk.33	RIRDC_adk.34	RIRDC_adk.35	RIRDC_adk.36	RIRDC_adk.37	RIRDC_adk.38	RIRDC_adk.39	RIRDC_adk.4	RIRDC_adk.40	RIRDC_adk.41	RIRDC_adk.42	RIRDC_adk.43	RIRDC_adk.44	RIRDC_adk.45	RIRDC_adk.46	RIRDC_adk.47	RIRDC_adk.48	RIRDC_adk.49	RIRDC_adk.5	RIRDC_adk.50	RIRDC_adk.51	RIRDC_adk.52	RIRDC_adk.53	RIRDC_adk.54	RIRDC_adk.55	RIRDC_adk.56	RIRDC_adk.57	RIRDC_adk.58	RIRDC_adk.59	RIRDC_adk.6	RIRDC_adk.7	RIRDC_adk.8	RIRDC_adk.9
RIRDC_est	RIRDC_est.1	RIRDC_est.10	RIRDC_est.11	RIRDC_est.12	RIRDC_est.13	RIRDC_est.14	RIRDC_est.15	RIRDC_est.16	RIRDC_est.17	RIRDC_est.18	RIRDC_est.19	RIRDC_est.2	RIRDC_est.20	RIRDC_est.21	RIRDC_est.22	RIRDC_est.23	RIRDC_est.24	RIRDC_est.25	RIRDC_est.26	RIRDC_est.27	RIRDC_est.28	RIRDC_est.29	RIRDC_est.3	RIRDC_est.30	RIRDC_est.31	RIRDC_est.32	RIRDC_est.33	RIRDC_est.34	RIRDC_est.35	RIRDC_est.36	RIRDC_est.37	RIRDC_est.38	RIRDC_est.39	RIRDC_est.4	RIRDC_est.40	RIRDC_est.41	RIRDC_est.42	RIRDC_est.43	RIRDC_est.44	RIRDC_est.45	RIRDC_est.46	RIRDC_est.47	RIRDC_est.48	RIRDC_est.49	RIRDC_est.5	RIRDC_est.50	RIRDC_est.51	RIRDC_est.52	RIRDC_est.53	RIRDC_est.54	RIRDC_est.55	RIRDC_est.56	RIRDC_est.57	RIRDC_est.58	RIRDC_est.59	RIRDC_est.6	RIRDC_est.60	RIRDC_est.61	RIRDC_est.62	RIRDC_est.63	RIRDC_est.64	RIRDC_est.65	RIRDC_est.66	RIRDC_est.67	RIRDC_est.68	RIRDC_est.69	RIRDC_est.7	RIRDC_est.70	RIRDC_est.71	RIRDC_est.72	RIRDC_est.73	RIRDC_est.74	RIRDC_est.75	RIRDC_est.76	RIRDC_est.77	RIRDC_est.78	RIRDC_est.79	RIRDC_est.8	RIRDC_est.80	RIRDC_est.81	RIRDC_est.82	RIRDC_est.83	RIRDC_est.84	RIRDC_est.85	RIRDC_est.86	RIRDC_est.87	RIRDC_est.88	RIRDC_est.89	RIRDC_est.9	RIRDC_est.90	RIRDC_est.91	RIRDC_est.92
RIRDC_gdh	RIRDC_gdh.1	RIRDC_gdh.10	RIRDC_gdh.11	RIRDC_gdh.12	RIRDC_gdh.13	RIRDC_gdh.14	RIRDC_gdh.15	RIRDC_gdh.16	RIRDC_gdh.17	RIRDC_gdh.18	RIRDC_gdh.19	RIRDC_gdh.2	RIRDC_gdh.20	RIRDC_gdh.21	RIRDC_gdh.22	RIRDC_gdh.23	RIRDC_gdh.24	RIRDC_gdh.25	RIRDC_gdh.26	RIRDC_gdh.27	RIRDC_gdh.28	RIRDC_gdh.29	RIRDC_gdh.3	RIRDC_gdh.30	RIRDC_gdh.31	RIRDC_gdh.32	RIRDC_gdh.33	RIRDC_gdh.34	RIRDC_gdh.35	RIRDC_gdh.36	RIRDC_gdh.37	RIRDC_gdh.38	RIRDC_gdh.39	RIRDC_gdh.4	RIRDC_gdh.40	RIRDC_gdh.41	RIRDC_gdh.42	RIRDC_gdh.43	RIRDC_gdh.44	RIRDC_gdh.45	RIRDC_gdh.46	RIRDC_gdh.47	RIRDC_gdh.48	RIRDC_gdh.49	RIRDC_gdh.5	RIRDC_gdh.50	RIRDC_gdh.51	RIRDC_gdh.52	RIRDC_gdh.53	RIRDC_gdh.54	RIRDC_gdh.55	RIRDC_gdh.56	RIRDC_gdh.57	RIRDC_gdh.58	RIRDC_gdh.59	RIRDC_gdh.6	RIRDC_gdh.60	RIRDC_gdh.61	RIRDC_gdh.62	RIRDC_gdh.63	RIRDC_gdh.64	RIRDC_gdh.7	RIRDC_gdh.8	RIRDC_gdh.9
RIRDC_mdh	RIRDC_mdh.1	RIRDC_mdh.10	RIRDC_mdh.11	RIRDC_mdh.12	RIRDC_mdh.13	RIRDC_mdh.14	RIRDC_mdh.15	RIRDC_mdh.16	RIRDC_mdh.17	RIRDC_mdh.18	RIRDC_mdh.19	RIRDC_mdh.2	RIRDC_mdh.20	RIRDC_mdh.21	RIRDC_mdh.22	RIRDC_mdh.23	RIRDC_mdh.24	RIRDC_mdh.25	RIRDC_mdh.26	RIRDC_mdh.27	RIRDC_mdh.28	RIRDC_mdh.29	RIRDC_mdh.3	RIRDC_mdh.30	RIRDC_mdh.31	RIRDC_mdh.32	RIRDC_mdh.33	RIRDC_mdh.34	RIRDC_mdh.35	RIRDC_mdh.36	RIRDC_mdh.37	RIRDC_mdh.38	RIRDC_mdh.39	RIRDC_mdh.4	RIRDC_mdh.40	RIRDC_mdh.41	RIRDC_mdh.42	RIRDC_mdh.43	RIRDC_mdh.44	RIRDC_mdh.45	RIRDC_mdh.46	RIRDC_mdh.47	RIRDC_mdh.48	RIRDC_mdh.5	RIRDC_mdh.6	RIRDC_mdh.7	RIRDC_mdh.8	RIRDC_mdh.9
RIRDC_pgi	RIRDC_pgi.1	RIRDC_pgi.10	RIRDC_pgi.11	RIRDC_pgi.12	RIRDC_pgi.13	RIRDC_pgi.14	RIRDC_pgi.15	RIRDC_pgi.16	RIRDC_pgi.17	RIRDC_pgi.18	RIRDC_pgi.19	RIRDC_pgi.2	RIRDC_pgi.20	RIRDC_pgi.21	RIRDC_pgi.22	RIRDC_pgi.23	RIRDC_pgi.24	RIRDC_pgi.25	RIRDC_pgi.26	RIRDC_pgi.27	RIRDC_pgi.28	RIRDC_pgi.29	RIRDC_pgi.3	RIRDC_pgi.30	RIRDC_pgi.31	RIRDC_pgi.32	RIRDC_pgi.33	RIRDC_pgi.34	RIRDC_pgi.35	RIRDC_pgi.36	RIRDC_pgi.37	RIRDC_pgi.38	RIRDC_pgi.39	RIRDC_pgi.4	RIRDC_pgi.40	RIRDC_pgi.41	RIRDC_pgi.42	RIRDC_pgi.43	RIRDC_pgi.44	RIRDC_pgi.45	RIRDC_pgi.46	RIRDC_pgi.47	RIRDC_pgi.48	RIRDC_pgi.49	RIRDC_pgi.5	RIRDC_pgi.50	RIRDC_pgi.51	RIRDC_pgi.52	RIRDC_pgi.53	RIRDC_pgi.54	RIRDC_pgi.55	RIRDC_pgi.56	RIRDC_pgi.57	RIRDC_pgi.58	RIRDC_pgi.59	RIRDC_pgi.6	RIRDC_pgi.60	RIRDC_pgi.61	RIRDC_pgi.62	RIRDC_pgi.63	RIRDC_pgi.64	RIRDC_pgi.65	RIRDC_pgi.66	RIRDC_pgi.67	RIRDC_pgi.68	RIRDC_pgi.69	RIRDC_pgi.7	RIRDC_pgi.70	RIRDC_pgi.71	RIRDC_pgi.72	RIRDC_pgi.73	RIRDC_pgi.74	RIRDC_pgi.75	RIRDC_pgi.76	RIRDC_pgi.77	RIRDC_pgi.78	RIRDC_pgi.79	RIRDC_pgi.8	RIRDC_pgi.80	RIRDC_pgi.81	RIRDC_pgi.82	RIRDC_pgi.83	RIRDC_pgi.84	RIRDC_pgi.85	RIRDC_pgi.86	RIRDC_pgi.87	RIRDC_pgi.88	RIRDC_pgi.89	RIRDC_pgi.9	RIRDC_pgi.90	RIRDC_pgi.91
RIRDC_pmi	RIRDC_pmi.1	RIRDC_pmi.10	RIRDC_pmi.11	RIRDC_pmi.12	RIRDC_pmi.13	RIRDC_pmi.14	RIRDC_pmi.15	RIRDC_pmi.16	RIRDC_pmi.17	RIRDC_pmi.18	RIRDC_pmi.19	RIRDC_pmi.2	RIRDC_pmi.20	RIRDC_pmi.21	RIRDC_pmi.22	RIRDC_pmi.23	RIRDC_pmi.24	RIRDC_pmi.25	RIRDC_pmi.26	RIRDC_pmi.27	RIRDC_pmi.28	RIRDC_pmi.29	RIRDC_pmi.3	RIRDC_pmi.30	RIRDC_pmi.31	RIRDC_pmi.32	RIRDC_pmi.33	RIRDC_pmi.34	RIRDC_pmi.35	RIRDC_pmi.36	RIRDC_pmi.37	RIRDC_pmi.38	RIRDC_pmi.39	RIRDC_pmi.4	RIRDC_pmi.40	RIRDC_pmi.41	RIRDC_pmi.42	RIRDC_pmi.43	RIRDC_pmi.44	RIRDC_pmi.45	RIRDC_pmi.46	RIRDC_pmi.47	RIRDC_pmi.48	RIRDC_pmi.49	RIRDC_pmi.5	RIRDC_pmi.50	RIRDC_pmi.51	RIRDC_pmi.52	RIRDC_pmi.53	RIRDC_pmi.54	RIRDC_pmi.55	RIRDC_pmi.56	RIRDC_pmi.57	RIRDC_pmi.58	RIRDC_pmi.59	RIRDC_pmi.6	RIRDC_pmi.60	RIRDC_pmi.61	RIRDC_pmi.62	RIRDC_pmi.63	RIRDC_pmi.64	RIRDC_pmi.65	RIRDC_pmi.66	RIRDC_pmi.67	RIRDC_pmi.68	RIRDC_pmi.69	RIRDC_pmi.7	RIRDC_pmi.70	RIRDC_pmi.71	RIRDC_pmi.72	RIRDC_pmi.73	RIRDC_pmi.74	RIRDC_pmi.75	RIRDC_pmi.76	RIRDC_pmi.77	RIRDC_pmi.78	RIRDC_pmi.79	RIRDC_pmi.8	RIRDC_pmi.80	RIRDC_pmi.81	RIRDC_pmi.82	RIRDC_pmi.9
RIRDC_zwf	RIRDC_zwf.1	RIRDC_zwf.10	RIRDC_zwf.11	RIRDC_zwf.12	RIRDC_zwf.13	RIRDC_zwf.14	RIRDC_zwf.15	RIRDC_zwf.16	RIRDC_zwf.17	RIRDC_zwf.18	RIRDC_zwf.19	RIRDC_zwf.2	RIRDC_zwf.20	RIRDC_zwf.21	RIRDC_zwf.22	RIRDC_zwf.23	RIRDC_zwf.24	RIRDC_zwf.25	RIRDC_zwf.26	RIRDC_zwf.27	RIRDC_zwf.28	RIRDC_zwf.29	RIRDC_zwf.3	RIRDC_zwf.30	RIRDC_zwf.31	RIRDC_zwf.32	RIRDC_zwf.33	RIRDC_zwf.34	RIRDC_zwf.35	RIRDC_zwf.36	RIRDC_zwf.37	RIRDC_zwf.38	RIRDC_zwf.39	RIRDC_zwf.4	RIRDC_zwf.40	RIRDC_zwf.41	RIRDC_zwf.42	RIRDC_zwf.43	RIRDC_zwf.44	RIRDC_zwf.45	RIRDC_zwf.46	RIRDC_zwf.47	RIRDC_zwf.48	RIRDC_zwf.49	RIRDC_zwf.5	RIRDC_zwf.50	RIRDC_zwf.51	RIRDC_zwf.52	RIRDC_zwf.53	RIRDC_zwf.54	RIRDC_zwf.55	RIRDC_zwf.56	RIRDC_zwf.57	RIRDC_zwf.58	RIRDC_zwf.59	RIRDC_zwf.6	RIRDC_zwf.60	RIRDC_zwf.61	RIRDC_zwf.62	RIRDC_zwf.63	RIRDC_zwf.64	RIRDC_zwf.65	RIRDC_zwf.66	RIRDC_zwf.67	RIRDC_zwf.68	RIRDC_zwf.69	RIRDC_zwf.7	RIRDC_zwf.70	RIRDC_zwf.71	RIRDC_zwf.72	RIRDC_zwf.73	RIRDC_zwf.74	RIRDC_zwf.75	RIRDC_zwf.76	RIRDC_zwf.77	RIRDC_zwf.78	RIRDC_zwf.79	RIRDC_zwf.8	RIRDC_zwf.80	RIRDC_zwf.81	RIRDC_zwf.9
