dnaA	dnaA.1	dnaA.10	dnaA.11	dnaA.12	dnaA.13	dnaA.14	dnaA.15	dnaA.16	dnaA.17	dnaA.18	dnaA.19	dnaA.2	dnaA.20	dnaA.21	dnaA.3	dnaA.4	dnaA.5	dnaA.6	dnaA.7	dnaA.8	dnaA.9
gltX	gltX.1	gltX.10	gltX.11	gltX.12	gltX.13	gltX.14	gltX.15	gltX.16	gltX.17	gltX.18	gltX.19	gltX.2	gltX.20	gltX.21	gltX.3	gltX.4	gltX.5	gltX.6	gltX.7	gltX.8	gltX.9
gyrB	gyrB.1	gyrB.10	gyrB.11	gyrB.12	gyrB.13	gyrB.14	gyrB.15	gyrB.16	gyrB.17	gyrB.18	gyrB.19	gyrB.2	gyrB.3	gyrB.4	gyrB.5	gyrB.6	gyrB.7	gyrB.8	gyrB.9
metS	metS.1	metS.10	metS.11	metS.12	metS.13	metS.14	metS.15	metS.16	metS.17	metS.18	metS.19	metS.2	metS.20	metS.21	metS.3	metS.4	metS.5	metS.6	metS.7	metS.8	metS.9
tufA	tufA.1	tufA.10	tufA.11	tufA.12	tufA.13	tufA.14	tufA.15	tufA.16	tufA.2	tufA.3	tufA.4	tufA.5	tufA.6	tufA.7	tufA.8	tufA.9
