RIRDC_adk.1	0	0	.	.	.
RIRDC_adk.10	0	0	.	.	.
RIRDC_adk.11	0	0	.	.	.
RIRDC_adk.12	0	0	.	.	.
RIRDC_adk.13	0	0	.	.	.
RIRDC_adk.14	0	0	.	.	.
RIRDC_adk.15	0	0	.	.	.
RIRDC_adk.16	0	0	.	.	.
RIRDC_adk.17	0	0	.	.	.
RIRDC_adk.18	0	0	.	.	.
RIRDC_adk.19	0	0	.	.	.
RIRDC_adk.2	0	0	.	.	.
RIRDC_adk.20	0	0	.	.	.
RIRDC_adk.21	0	0	.	.	.
RIRDC_adk.22	0	0	.	.	.
RIRDC_adk.23	0	0	.	.	.
RIRDC_adk.24	0	0	.	.	.
RIRDC_adk.25	0	0	.	.	.
RIRDC_adk.26	0	0	.	.	.
RIRDC_adk.27	0	0	.	.	.
RIRDC_adk.28	0	0	.	.	.
RIRDC_adk.29	0	0	.	.	.
RIRDC_adk.3	0	0	.	.	.
RIRDC_adk.30	0	0	.	.	.
RIRDC_adk.31	0	0	.	.	.
RIRDC_adk.32	0	0	.	.	.
RIRDC_adk.33	0	0	.	.	.
RIRDC_adk.34	0	0	.	.	.
RIRDC_adk.35	0	0	.	.	.
RIRDC_adk.36	0	0	.	.	.
RIRDC_adk.37	0	0	.	.	.
RIRDC_adk.38	0	0	.	.	.
RIRDC_adk.39	0	0	.	.	.
RIRDC_adk.4	0	0	.	.	.
RIRDC_adk.40	0	0	.	.	.
RIRDC_adk.41	0	0	.	.	.
RIRDC_adk.42	0	0	.	.	.
RIRDC_adk.43	0	0	.	.	.
RIRDC_adk.44	0	0	.	.	.
RIRDC_adk.45	0	0	.	.	.
RIRDC_adk.46	0	0	.	.	.
RIRDC_adk.47	0	0	.	.	.
RIRDC_adk.48	0	0	.	.	.
RIRDC_adk.49	0	0	.	.	.
RIRDC_adk.5	0	0	.	.	.
RIRDC_adk.50	0	0	.	.	.
RIRDC_adk.51	0	0	.	.	.
RIRDC_adk.52	0	0	.	.	.
RIRDC_adk.53	0	0	.	.	.
RIRDC_adk.54	0	0	.	.	.
RIRDC_adk.55	0	0	.	.	.
RIRDC_adk.56	0	0	.	.	.
RIRDC_adk.57	0	0	.	.	.
RIRDC_adk.58	0	0	.	.	.
RIRDC_adk.59	0	0	.	.	.
RIRDC_adk.6	0	0	.	.	.
RIRDC_adk.7	0	0	.	.	.
RIRDC_adk.8	0	0	.	.	.
RIRDC_adk.9	0	0	.	.	.
RIRDC_est.1	0	0	.	.	.
RIRDC_est.10	0	0	.	.	.
RIRDC_est.11	0	0	.	.	.
RIRDC_est.12	0	0	.	.	.
RIRDC_est.13	0	0	.	.	.
RIRDC_est.14	0	0	.	.	.
RIRDC_est.15	0	0	.	.	.
RIRDC_est.16	0	0	.	.	.
RIRDC_est.17	0	0	.	.	.
RIRDC_est.18	0	0	.	.	.
RIRDC_est.19	0	0	.	.	.
RIRDC_est.2	0	0	.	.	.
RIRDC_est.20	0	0	.	.	.
RIRDC_est.21	0	0	.	.	.
RIRDC_est.22	0	0	.	.	.
RIRDC_est.23	0	0	.	.	.
RIRDC_est.24	0	0	.	.	.
RIRDC_est.25	0	0	.	.	.
RIRDC_est.26	0	0	.	.	.
RIRDC_est.27	0	0	.	.	.
RIRDC_est.28	0	0	.	.	.
RIRDC_est.29	0	0	.	.	.
RIRDC_est.3	0	0	.	.	.
RIRDC_est.30	0	0	.	.	.
RIRDC_est.31	0	0	.	.	.
RIRDC_est.32	0	0	.	.	.
RIRDC_est.33	0	0	.	.	.
RIRDC_est.34	0	0	.	.	.
RIRDC_est.35	0	0	.	.	.
RIRDC_est.36	0	0	.	.	.
RIRDC_est.37	0	0	.	.	.
RIRDC_est.38	0	0	.	.	.
RIRDC_est.39	0	0	.	.	.
RIRDC_est.4	0	0	.	.	.
RIRDC_est.40	0	0	.	.	.
RIRDC_est.41	0	0	.	.	.
RIRDC_est.42	0	0	.	.	.
RIRDC_est.43	0	0	.	.	.
RIRDC_est.44	0	0	.	.	.
RIRDC_est.45	0	0	.	.	.
RIRDC_est.46	0	0	.	.	.
RIRDC_est.47	0	0	.	.	.
RIRDC_est.48	0	0	.	.	.
RIRDC_est.49	0	0	.	.	.
RIRDC_est.5	0	0	.	.	.
RIRDC_est.50	0	0	.	.	.
RIRDC_est.51	0	0	.	.	.
RIRDC_est.52	0	0	.	.	.
RIRDC_est.53	0	0	.	.	.
RIRDC_est.54	0	0	.	.	.
RIRDC_est.55	0	0	.	.	.
RIRDC_est.56	0	0	.	.	.
RIRDC_est.57	0	0	.	.	.
RIRDC_est.58	0	0	.	.	.
RIRDC_est.59	0	0	.	.	.
RIRDC_est.6	0	0	.	.	.
RIRDC_est.60	0	0	.	.	.
RIRDC_est.61	0	0	.	.	.
RIRDC_est.62	0	0	.	.	.
RIRDC_est.63	0	0	.	.	.
RIRDC_est.64	0	0	.	.	.
RIRDC_est.65	0	0	.	.	.
RIRDC_est.66	0	0	.	.	.
RIRDC_est.67	0	0	.	.	.
RIRDC_est.68	0	0	.	.	.
RIRDC_est.69	0	0	.	.	.
RIRDC_est.7	0	0	.	.	.
RIRDC_est.70	0	0	.	.	.
RIRDC_est.71	0	0	.	.	.
RIRDC_est.72	0	0	.	.	.
RIRDC_est.73	0	0	.	.	.
RIRDC_est.74	0	0	.	.	.
RIRDC_est.75	0	0	.	.	.
RIRDC_est.76	0	0	.	.	.
RIRDC_est.77	0	0	.	.	.
RIRDC_est.78	0	0	.	.	.
RIRDC_est.79	0	0	.	.	.
RIRDC_est.8	0	0	.	.	.
RIRDC_est.80	0	0	.	.	.
RIRDC_est.81	0	0	.	.	.
RIRDC_est.82	0	0	.	.	.
RIRDC_est.83	0	0	.	.	.
RIRDC_est.84	0	0	.	.	.
RIRDC_est.85	0	0	.	.	.
RIRDC_est.86	0	0	.	.	.
RIRDC_est.87	0	0	.	.	.
RIRDC_est.88	0	0	.	.	.
RIRDC_est.89	0	0	.	.	.
RIRDC_est.9	0	0	.	.	.
RIRDC_est.90	0	0	.	.	.
RIRDC_est.91	0	0	.	.	.
RIRDC_est.92	0	0	.	.	.
RIRDC_gdh.1	0	0	.	.	.
RIRDC_gdh.10	0	0	.	.	.
RIRDC_gdh.11	0	0	.	.	.
RIRDC_gdh.12	0	0	.	.	.
RIRDC_gdh.13	0	0	.	.	.
RIRDC_gdh.14	0	0	.	.	.
RIRDC_gdh.15	0	0	.	.	.
RIRDC_gdh.16	0	0	.	.	.
RIRDC_gdh.17	0	0	.	.	.
RIRDC_gdh.18	0	0	.	.	.
RIRDC_gdh.19	0	0	.	.	.
RIRDC_gdh.2	0	0	.	.	.
RIRDC_gdh.20	0	0	.	.	.
RIRDC_gdh.21	0	0	.	.	.
RIRDC_gdh.22	0	0	.	.	.
RIRDC_gdh.23	0	0	.	.	.
RIRDC_gdh.24	0	0	.	.	.
RIRDC_gdh.25	0	0	.	.	.
RIRDC_gdh.26	0	0	.	.	.
RIRDC_gdh.27	0	0	.	.	.
RIRDC_gdh.28	0	0	.	.	.
RIRDC_gdh.29	0	0	.	.	.
RIRDC_gdh.3	0	0	.	.	.
RIRDC_gdh.30	0	0	.	.	.
RIRDC_gdh.31	0	0	.	.	.
RIRDC_gdh.32	0	0	.	.	.
RIRDC_gdh.33	0	0	.	.	.
RIRDC_gdh.34	0	0	.	.	.
RIRDC_gdh.35	0	0	.	.	.
RIRDC_gdh.36	0	0	.	.	.
RIRDC_gdh.37	0	0	.	.	.
RIRDC_gdh.38	0	0	.	.	.
RIRDC_gdh.39	0	0	.	.	.
RIRDC_gdh.4	0	0	.	.	.
RIRDC_gdh.40	0	0	.	.	.
RIRDC_gdh.41	0	0	.	.	.
RIRDC_gdh.42	0	0	.	.	.
RIRDC_gdh.43	0	0	.	.	.
RIRDC_gdh.44	0	0	.	.	.
RIRDC_gdh.45	0	0	.	.	.
RIRDC_gdh.46	0	0	.	.	.
RIRDC_gdh.47	0	0	.	.	.
RIRDC_gdh.48	0	0	.	.	.
RIRDC_gdh.49	0	0	.	.	.
RIRDC_gdh.5	0	0	.	.	.
RIRDC_gdh.50	0	0	.	.	.
RIRDC_gdh.51	0	0	.	.	.
RIRDC_gdh.52	0	0	.	.	.
RIRDC_gdh.53	0	0	.	.	.
RIRDC_gdh.54	0	0	.	.	.
RIRDC_gdh.55	0	0	.	.	.
RIRDC_gdh.56	0	0	.	.	.
RIRDC_gdh.57	0	0	.	.	.
RIRDC_gdh.58	0	0	.	.	.
RIRDC_gdh.59	0	0	.	.	.
RIRDC_gdh.6	0	0	.	.	.
RIRDC_gdh.60	0	0	.	.	.
RIRDC_gdh.61	0	0	.	.	.
RIRDC_gdh.62	0	0	.	.	.
RIRDC_gdh.63	0	0	.	.	.
RIRDC_gdh.64	0	0	.	.	.
RIRDC_gdh.7	0	0	.	.	.
RIRDC_gdh.8	0	0	.	.	.
RIRDC_gdh.9	0	0	.	.	.
RIRDC_mdh.1	0	0	.	.	.
RIRDC_mdh.10	0	0	.	.	.
RIRDC_mdh.11	0	0	.	.	.
RIRDC_mdh.12	0	0	.	.	.
RIRDC_mdh.13	0	0	.	.	.
RIRDC_mdh.14	0	0	.	.	.
RIRDC_mdh.15	0	0	.	.	.
RIRDC_mdh.16	0	0	.	.	.
RIRDC_mdh.17	0	0	.	.	.
RIRDC_mdh.18	0	0	.	.	.
RIRDC_mdh.19	0	0	.	.	.
RIRDC_mdh.2	0	0	.	.	.
RIRDC_mdh.20	0	0	.	.	.
RIRDC_mdh.21	0	0	.	.	.
RIRDC_mdh.22	0	0	.	.	.
RIRDC_mdh.23	0	0	.	.	.
RIRDC_mdh.24	0	0	.	.	.
RIRDC_mdh.25	0	0	.	.	.
RIRDC_mdh.26	0	0	.	.	.
RIRDC_mdh.27	0	0	.	.	.
RIRDC_mdh.28	0	0	.	.	.
RIRDC_mdh.29	0	0	.	.	.
RIRDC_mdh.3	0	0	.	.	.
RIRDC_mdh.30	0	0	.	.	.
RIRDC_mdh.31	0	0	.	.	.
RIRDC_mdh.32	0	0	.	.	.
RIRDC_mdh.33	0	0	.	.	.
RIRDC_mdh.34	0	0	.	.	.
RIRDC_mdh.35	0	0	.	.	.
RIRDC_mdh.36	0	0	.	.	.
RIRDC_mdh.37	0	0	.	.	.
RIRDC_mdh.38	0	0	.	.	.
RIRDC_mdh.39	0	0	.	.	.
RIRDC_mdh.4	0	0	.	.	.
RIRDC_mdh.40	0	0	.	.	.
RIRDC_mdh.41	0	0	.	.	.
RIRDC_mdh.42	0	0	.	.	.
RIRDC_mdh.43	0	0	.	.	.
RIRDC_mdh.44	0	0	.	.	.
RIRDC_mdh.45	0	0	.	.	.
RIRDC_mdh.46	0	0	.	.	.
RIRDC_mdh.47	0	0	.	.	.
RIRDC_mdh.48	0	0	.	.	.
RIRDC_mdh.5	0	0	.	.	.
RIRDC_mdh.6	0	0	.	.	.
RIRDC_mdh.7	0	0	.	.	.
RIRDC_mdh.8	0	0	.	.	.
RIRDC_mdh.9	0	0	.	.	.
RIRDC_pgi.1	0	0	.	.	.
RIRDC_pgi.10	0	0	.	.	.
RIRDC_pgi.11	0	0	.	.	.
RIRDC_pgi.12	0	0	.	.	.
RIRDC_pgi.13	0	0	.	.	.
RIRDC_pgi.14	0	0	.	.	.
RIRDC_pgi.15	0	0	.	.	.
RIRDC_pgi.16	0	0	.	.	.
RIRDC_pgi.17	0	0	.	.	.
RIRDC_pgi.18	0	0	.	.	.
RIRDC_pgi.19	0	0	.	.	.
RIRDC_pgi.2	0	0	.	.	.
RIRDC_pgi.20	0	0	.	.	.
RIRDC_pgi.21	0	0	.	.	.
RIRDC_pgi.22	0	0	.	.	.
RIRDC_pgi.23	0	0	.	.	.
RIRDC_pgi.24	0	0	.	.	.
RIRDC_pgi.25	0	0	.	.	.
RIRDC_pgi.26	0	0	.	.	.
RIRDC_pgi.27	0	0	.	.	.
RIRDC_pgi.28	0	0	.	.	.
RIRDC_pgi.29	0	0	.	.	.
RIRDC_pgi.3	0	0	.	.	.
RIRDC_pgi.30	0	0	.	.	.
RIRDC_pgi.31	0	0	.	.	.
RIRDC_pgi.32	0	0	.	.	.
RIRDC_pgi.33	0	0	.	.	.
RIRDC_pgi.34	0	0	.	.	.
RIRDC_pgi.35	0	0	.	.	.
RIRDC_pgi.36	0	0	.	.	.
RIRDC_pgi.37	0	0	.	.	.
RIRDC_pgi.38	0	0	.	.	.
RIRDC_pgi.39	0	0	.	.	.
RIRDC_pgi.4	0	0	.	.	.
RIRDC_pgi.40	0	0	.	.	.
RIRDC_pgi.41	0	0	.	.	.
RIRDC_pgi.42	0	0	.	.	.
RIRDC_pgi.43	0	0	.	.	.
RIRDC_pgi.44	0	0	.	.	.
RIRDC_pgi.45	0	0	.	.	.
RIRDC_pgi.46	0	0	.	.	.
RIRDC_pgi.47	0	0	.	.	.
RIRDC_pgi.48	0	0	.	.	.
RIRDC_pgi.49	0	0	.	.	.
RIRDC_pgi.5	0	0	.	.	.
RIRDC_pgi.50	0	0	.	.	.
RIRDC_pgi.51	0	0	.	.	.
RIRDC_pgi.52	0	0	.	.	.
RIRDC_pgi.53	0	0	.	.	.
RIRDC_pgi.54	0	0	.	.	.
RIRDC_pgi.55	0	0	.	.	.
RIRDC_pgi.56	0	0	.	.	.
RIRDC_pgi.57	0	0	.	.	.
RIRDC_pgi.58	0	0	.	.	.
RIRDC_pgi.59	0	0	.	.	.
RIRDC_pgi.6	0	0	.	.	.
RIRDC_pgi.60	0	0	.	.	.
RIRDC_pgi.61	0	0	.	.	.
RIRDC_pgi.62	0	0	.	.	.
RIRDC_pgi.63	0	0	.	.	.
RIRDC_pgi.64	0	0	.	.	.
RIRDC_pgi.65	0	0	.	.	.
RIRDC_pgi.66	0	0	.	.	.
RIRDC_pgi.67	0	0	.	.	.
RIRDC_pgi.68	0	0	.	.	.
RIRDC_pgi.69	0	0	.	.	.
RIRDC_pgi.7	0	0	.	.	.
RIRDC_pgi.70	0	0	.	.	.
RIRDC_pgi.71	0	0	.	.	.
RIRDC_pgi.72	0	0	.	.	.
RIRDC_pgi.73	0	0	.	.	.
RIRDC_pgi.74	0	0	.	.	.
RIRDC_pgi.75	0	0	.	.	.
RIRDC_pgi.76	0	0	.	.	.
RIRDC_pgi.77	0	0	.	.	.
RIRDC_pgi.78	0	0	.	.	.
RIRDC_pgi.79	0	0	.	.	.
RIRDC_pgi.8	0	0	.	.	.
RIRDC_pgi.80	0	0	.	.	.
RIRDC_pgi.81	0	0	.	.	.
RIRDC_pgi.82	0	0	.	.	.
RIRDC_pgi.83	0	0	.	.	.
RIRDC_pgi.84	0	0	.	.	.
RIRDC_pgi.85	0	0	.	.	.
RIRDC_pgi.86	0	0	.	.	.
RIRDC_pgi.87	0	0	.	.	.
RIRDC_pgi.88	0	0	.	.	.
RIRDC_pgi.89	0	0	.	.	.
RIRDC_pgi.9	0	0	.	.	.
RIRDC_pgi.90	0	0	.	.	.
RIRDC_pgi.91	0	0	.	.	.
RIRDC_pmi.1	0	0	.	.	.
RIRDC_pmi.10	0	0	.	.	.
RIRDC_pmi.11	0	0	.	.	.
RIRDC_pmi.12	0	0	.	.	.
RIRDC_pmi.13	0	0	.	.	.
RIRDC_pmi.14	0	0	.	.	.
RIRDC_pmi.15	0	0	.	.	.
RIRDC_pmi.16	0	0	.	.	.
RIRDC_pmi.17	0	0	.	.	.
RIRDC_pmi.18	0	0	.	.	.
RIRDC_pmi.19	0	0	.	.	.
RIRDC_pmi.2	0	0	.	.	.
RIRDC_pmi.20	0	0	.	.	.
RIRDC_pmi.21	0	0	.	.	.
RIRDC_pmi.22	0	0	.	.	.
RIRDC_pmi.23	0	0	.	.	.
RIRDC_pmi.24	0	0	.	.	.
RIRDC_pmi.25	0	0	.	.	.
RIRDC_pmi.26	0	0	.	.	.
RIRDC_pmi.27	0	0	.	.	.
RIRDC_pmi.28	0	0	.	.	.
RIRDC_pmi.29	0	0	.	.	.
RIRDC_pmi.3	0	0	.	.	.
RIRDC_pmi.30	0	0	.	.	.
RIRDC_pmi.31	0	0	.	.	.
RIRDC_pmi.32	0	0	.	.	.
RIRDC_pmi.33	0	0	.	.	.
RIRDC_pmi.34	0	0	.	.	.
RIRDC_pmi.35	0	0	.	.	.
RIRDC_pmi.36	0	0	.	.	.
RIRDC_pmi.37	0	0	.	.	.
RIRDC_pmi.38	0	0	.	.	.
RIRDC_pmi.39	0	0	.	.	.
RIRDC_pmi.4	0	0	.	.	.
RIRDC_pmi.40	0	0	.	.	.
RIRDC_pmi.41	0	0	.	.	.
RIRDC_pmi.42	0	0	.	.	.
RIRDC_pmi.43	0	0	.	.	.
RIRDC_pmi.44	0	0	.	.	.
RIRDC_pmi.45	0	0	.	.	.
RIRDC_pmi.46	0	0	.	.	.
RIRDC_pmi.47	0	0	.	.	.
RIRDC_pmi.48	0	0	.	.	.
RIRDC_pmi.49	0	0	.	.	.
RIRDC_pmi.5	0	0	.	.	.
RIRDC_pmi.50	0	0	.	.	.
RIRDC_pmi.51	0	0	.	.	.
RIRDC_pmi.52	0	0	.	.	.
RIRDC_pmi.53	0	0	.	.	.
RIRDC_pmi.54	0	0	.	.	.
RIRDC_pmi.55	0	0	.	.	.
RIRDC_pmi.56	0	0	.	.	.
RIRDC_pmi.57	0	0	.	.	.
RIRDC_pmi.58	0	0	.	.	.
RIRDC_pmi.59	0	0	.	.	.
RIRDC_pmi.6	0	0	.	.	.
RIRDC_pmi.60	0	0	.	.	.
RIRDC_pmi.61	0	0	.	.	.
RIRDC_pmi.62	0	0	.	.	.
RIRDC_pmi.63	0	0	.	.	.
RIRDC_pmi.64	0	0	.	.	.
RIRDC_pmi.65	0	0	.	.	.
RIRDC_pmi.66	0	0	.	.	.
RIRDC_pmi.67	0	0	.	.	.
RIRDC_pmi.68	0	0	.	.	.
RIRDC_pmi.69	0	0	.	.	.
RIRDC_pmi.7	0	0	.	.	.
RIRDC_pmi.70	0	0	.	.	.
RIRDC_pmi.71	0	0	.	.	.
RIRDC_pmi.72	0	0	.	.	.
RIRDC_pmi.73	0	0	.	.	.
RIRDC_pmi.74	0	0	.	.	.
RIRDC_pmi.75	0	0	.	.	.
RIRDC_pmi.76	0	0	.	.	.
RIRDC_pmi.77	0	0	.	.	.
RIRDC_pmi.78	0	0	.	.	.
RIRDC_pmi.79	0	0	.	.	.
RIRDC_pmi.8	0	0	.	.	.
RIRDC_pmi.80	0	0	.	.	.
RIRDC_pmi.81	0	0	.	.	.
RIRDC_pmi.82	0	0	.	.	.
RIRDC_pmi.9	0	0	.	.	.
RIRDC_zwf.1	0	0	.	.	.
RIRDC_zwf.10	0	0	.	.	.
RIRDC_zwf.11	0	0	.	.	.
RIRDC_zwf.12	0	0	.	.	.
RIRDC_zwf.13	0	0	.	.	.
RIRDC_zwf.14	0	0	.	.	.
RIRDC_zwf.15	0	0	.	.	.
RIRDC_zwf.16	0	0	.	.	.
RIRDC_zwf.17	0	0	.	.	.
RIRDC_zwf.18	0	0	.	.	.
RIRDC_zwf.19	0	0	.	.	.
RIRDC_zwf.2	0	0	.	.	.
RIRDC_zwf.20	0	0	.	.	.
RIRDC_zwf.21	0	0	.	.	.
RIRDC_zwf.22	0	0	.	.	.
RIRDC_zwf.23	0	0	.	.	.
RIRDC_zwf.24	0	0	.	.	.
RIRDC_zwf.25	0	0	.	.	.
RIRDC_zwf.26	0	0	.	.	.
RIRDC_zwf.27	0	0	.	.	.
RIRDC_zwf.28	0	0	.	.	.
RIRDC_zwf.29	0	0	.	.	.
RIRDC_zwf.3	0	0	.	.	.
RIRDC_zwf.30	0	0	.	.	.
RIRDC_zwf.31	0	0	.	.	.
RIRDC_zwf.32	0	0	.	.	.
RIRDC_zwf.33	0	0	.	.	.
RIRDC_zwf.34	0	0	.	.	.
RIRDC_zwf.35	0	0	.	.	.
RIRDC_zwf.36	0	0	.	.	.
RIRDC_zwf.37	0	0	.	.	.
RIRDC_zwf.38	0	0	.	.	.
RIRDC_zwf.39	0	0	.	.	.
RIRDC_zwf.4	0	0	.	.	.
RIRDC_zwf.40	0	0	.	.	.
RIRDC_zwf.41	0	0	.	.	.
RIRDC_zwf.42	0	0	.	.	.
RIRDC_zwf.43	0	0	.	.	.
RIRDC_zwf.44	0	0	.	.	.
RIRDC_zwf.45	0	0	.	.	.
RIRDC_zwf.46	0	0	.	.	.
RIRDC_zwf.47	0	0	.	.	.
RIRDC_zwf.48	0	0	.	.	.
RIRDC_zwf.49	0	0	.	.	.
RIRDC_zwf.5	0	0	.	.	.
RIRDC_zwf.50	0	0	.	.	.
RIRDC_zwf.51	0	0	.	.	.
RIRDC_zwf.52	0	0	.	.	.
RIRDC_zwf.53	0	0	.	.	.
RIRDC_zwf.54	0	0	.	.	.
RIRDC_zwf.55	0	0	.	.	.
RIRDC_zwf.56	0	0	.	.	.
RIRDC_zwf.57	0	0	.	.	.
RIRDC_zwf.58	0	0	.	.	.
RIRDC_zwf.59	0	0	.	.	.
RIRDC_zwf.6	0	0	.	.	.
RIRDC_zwf.60	0	0	.	.	.
RIRDC_zwf.61	0	0	.	.	.
RIRDC_zwf.62	0	0	.	.	.
RIRDC_zwf.63	0	0	.	.	.
RIRDC_zwf.64	0	0	.	.	.
RIRDC_zwf.65	0	0	.	.	.
RIRDC_zwf.66	0	0	.	.	.
RIRDC_zwf.67	0	0	.	.	.
RIRDC_zwf.68	0	0	.	.	.
RIRDC_zwf.69	0	0	.	.	.
RIRDC_zwf.7	0	0	.	.	.
RIRDC_zwf.70	0	0	.	.	.
RIRDC_zwf.71	0	0	.	.	.
RIRDC_zwf.72	0	0	.	.	.
RIRDC_zwf.73	0	0	.	.	.
RIRDC_zwf.74	0	0	.	.	.
RIRDC_zwf.75	0	0	.	.	.
RIRDC_zwf.76	0	0	.	.	.
RIRDC_zwf.77	0	0	.	.	.
RIRDC_zwf.78	0	0	.	.	.
RIRDC_zwf.79	0	0	.	.	.
RIRDC_zwf.8	0	0	.	.	.
RIRDC_zwf.80	0	0	.	.	.
RIRDC_zwf.81	0	0	.	.	.
RIRDC_zwf.9	0	0	.	.	.
