aroE.1	0	0	.	.	.
aroE.2	0	0	.	.	.
aroE.3	0	0	.	.	.
aroE.4	0	0	.	.	.
aroE.5	0	0	.	.	.
aroE.6	0	0	.	.	.
aroE.7	0	0	.	.	.
aroE.8	0	0	.	.	.
aroE.9	0	0	.	.	.
dat.1	0	0	.	.	.
dat.2	0	0	.	.	.
dat.3	0	0	.	.	.
dat.4	0	0	.	.	.
dat.5	0	0	.	.	.
dat.6	0	0	.	.	.
dat.7	0	0	.	.	.
dat.8	0	0	.	.	.
dat.9	0	0	.	.	.
ddl.1	0	0	.	.	.
ddl.10	0	0	.	.	.
ddl.2	0	0	.	.	.
ddl.3	0	0	.	.	.
ddl.4	0	0	.	.	.
ddl.5	0	0	.	.	.
ddl.6	0	0	.	.	.
ddl.7	0	0	.	.	.
ddl.8	0	0	.	.	.
ddl.9	0	0	.	.	.
gmk.1	0	0	.	.	.
gmk.2	0	0	.	.	.
gmk.3	0	0	.	.	.
gmk.4	0	0	.	.	.
gmk.5	0	0	.	.	.
gmk.6	0	0	.	.	.
ldh.1	0	0	.	.	.
ldh.10	0	0	.	.	.
ldh.11	0	0	.	.	.
ldh.2	0	0	.	.	.
ldh.3	0	0	.	.	.
ldh.4	0	0	.	.	.
ldh.5	0	0	.	.	.
ldh.6	0	0	.	.	.
ldh.7	0	0	.	.	.
ldh.8	0	0	.	.	.
ldh.9	0	0	.	.	.
recA.1	0	0	.	.	.
recA.2	0	0	.	.	.
recA.3	0	0	.	.	.
recA.4	0	0	.	.	.
recA.5	0	0	.	.	.
recA.6	0	0	.	.	.
yqiL.1	0	0	.	.	.
yqiL.10	0	0	.	.	.
yqiL.11	0	0	.	.	.
yqiL.12	0	0	.	.	.
yqiL.2	0	0	.	.	.
yqiL.3	0	0	.	.	.
yqiL.4	0	0	.	.	.
yqiL.5	0	0	.	.	.
yqiL.6	0	0	.	.	.
yqiL.7	0	0	.	.	.
yqiL.8	0	0	.	.	.
yqiL.9	0	0	.	.	.
