gatB.1	0	0	.	.	.
gatB.10	0	0	.	.	.
gatB.100	0	0	.	.	.
gatB.101	0	0	.	.	.
gatB.102	0	0	.	.	.
gatB.103	0	0	.	.	.
gatB.104	0	0	.	.	.
gatB.105	0	0	.	.	.
gatB.106	0	0	.	.	.
gatB.107	0	0	.	.	.
gatB.108	0	0	.	.	.
gatB.109	0	0	.	.	.
gatB.11	0	0	.	.	.
gatB.110	0	0	.	.	.
gatB.111	0	0	.	.	.
gatB.112	0	0	.	.	.
gatB.113	0	0	.	.	.
gatB.114	0	0	.	.	.
gatB.115	0	0	.	.	.
gatB.116	0	0	.	.	.
gatB.117	0	0	.	.	.
gatB.118	0	0	.	.	.
gatB.119	0	0	.	.	.
gatB.12	0	0	.	.	.
gatB.120	0	0	.	.	.
gatB.121	0	0	.	.	.
gatB.122	0	0	.	.	.
gatB.123	0	0	.	.	.
gatB.124	0	0	.	.	.
gatB.125	0	0	.	.	.
gatB.126	0	0	.	.	.
gatB.127	0	0	.	.	.
gatB.128	0	0	.	.	.
gatB.129	0	0	.	.	.
gatB.13	0	0	.	.	.
gatB.130	0	0	.	.	.
gatB.131	0	0	.	.	.
gatB.132	0	0	.	.	.
gatB.133	0	0	.	.	.
gatB.134	0	0	.	.	.
gatB.135	0	0	.	.	.
gatB.136	0	0	.	.	.
gatB.137	0	0	.	.	.
gatB.138	0	0	.	.	.
gatB.139	0	0	.	.	.
gatB.14	0	0	.	.	.
gatB.140	0	0	.	.	.
gatB.141	0	0	.	.	.
gatB.142	0	0	.	.	.
gatB.143	0	0	.	.	.
gatB.144	0	0	.	.	.
gatB.145	0	0	.	.	.
gatB.146	0	0	.	.	.
gatB.147	0	0	.	.	.
gatB.148	0	0	.	.	.
gatB.149	0	0	.	.	.
gatB.15	0	0	.	.	.
gatB.150	0	0	.	.	.
gatB.151	0	0	.	.	.
gatB.152	0	0	.	.	.
gatB.153	0	0	.	.	.
gatB.154	0	0	.	.	.
gatB.155	0	0	.	.	.
gatB.156	0	0	.	.	.
gatB.157	0	0	.	.	.
gatB.158	0	0	.	.	.
gatB.159	0	0	.	.	.
gatB.16	0	0	.	.	.
gatB.160	0	0	.	.	.
gatB.161	0	0	.	.	.
gatB.162	0	0	.	.	.
gatB.163	0	0	.	.	.
gatB.164	0	0	.	.	.
gatB.165	0	0	.	.	.
gatB.166	0	0	.	.	.
gatB.167	0	0	.	.	.
gatB.168	0	0	.	.	.
gatB.169	0	0	.	.	.
gatB.17	0	0	.	.	.
gatB.170	0	0	.	.	.
gatB.171	0	0	.	.	.
gatB.172	0	0	.	.	.
gatB.173	0	0	.	.	.
gatB.174	0	0	.	.	.
gatB.175	0	0	.	.	.
gatB.176	0	0	.	.	.
gatB.177	0	0	.	.	.
gatB.178	0	0	.	.	.
gatB.179	0	0	.	.	.
gatB.18	0	0	.	.	.
gatB.180	0	0	.	.	.
gatB.181	0	0	.	.	.
gatB.182	0	0	.	.	.
gatB.183	0	0	.	.	.
gatB.184	0	0	.	.	.
gatB.185	0	0	.	.	.
gatB.186	0	0	.	.	.
gatB.187	0	0	.	.	.
gatB.188	0	0	.	.	.
gatB.189	0	0	.	.	.
gatB.19	0	0	.	.	.
gatB.190	0	0	.	.	.
gatB.191	0	0	.	.	.
gatB.192	0	0	.	.	.
gatB.193	0	0	.	.	.
gatB.194	0	0	.	.	.
gatB.195	0	0	.	.	.
gatB.196	0	0	.	.	.
gatB.197	0	0	.	.	.
gatB.198	0	0	.	.	.
gatB.199	0	0	.	.	.
gatB.2	0	0	.	.	.
gatB.20	0	0	.	.	.
gatB.200	0	0	.	.	.
gatB.201	0	0	.	.	.
gatB.202	0	0	.	.	.
gatB.203	0	0	.	.	.
gatB.204	0	0	.	.	.
gatB.205	0	0	.	.	.
gatB.206	0	0	.	.	.
gatB.207	0	0	.	.	.
gatB.208	0	0	.	.	.
gatB.209	0	0	.	.	.
gatB.21	0	0	.	.	.
gatB.210	0	0	.	.	.
gatB.211	0	0	.	.	.
gatB.212	0	0	.	.	.
gatB.213	0	0	.	.	.
gatB.214	0	0	.	.	.
gatB.215	0	0	.	.	.
gatB.216	0	0	.	.	.
gatB.217	0	0	.	.	.
gatB.218	0	0	.	.	.
gatB.219	0	0	.	.	.
gatB.22	0	0	.	.	.
gatB.220	0	0	.	.	.
gatB.221	0	0	.	.	.
gatB.222	0	0	.	.	.
gatB.223	0	0	.	.	.
gatB.224	0	0	.	.	.
gatB.225	0	0	.	.	.
gatB.226	0	0	.	.	.
gatB.227	0	0	.	.	.
gatB.228	0	0	.	.	.
gatB.229	0	0	.	.	.
gatB.23	0	0	.	.	.
gatB.230	0	0	.	.	.
gatB.231	0	0	.	.	.
gatB.232	0	0	.	.	.
gatB.233	0	0	.	.	.
gatB.234	0	0	.	.	.
gatB.235	0	0	.	.	.
gatB.236	0	0	.	.	.
gatB.237	0	0	.	.	.
gatB.238	0	0	.	.	.
gatB.239	0	0	.	.	.
gatB.24	0	0	.	.	.
gatB.240	0	0	.	.	.
gatB.241	0	0	.	.	.
gatB.242	0	0	.	.	.
gatB.243	0	0	.	.	.
gatB.244	0	0	.	.	.
gatB.245	0	0	.	.	.
gatB.246	0	0	.	.	.
gatB.247	0	0	.	.	.
gatB.248	0	0	.	.	.
gatB.249	0	0	.	.	.
gatB.25	0	0	.	.	.
gatB.250	0	0	.	.	.
gatB.251	0	0	.	.	.
gatB.252	0	0	.	.	.
gatB.253	0	0	.	.	.
gatB.254	0	0	.	.	.
gatB.255	0	0	.	.	.
gatB.256	0	0	.	.	.
gatB.257	0	0	.	.	.
gatB.258	0	0	.	.	.
gatB.259	0	0	.	.	.
gatB.26	0	0	.	.	.
gatB.260	0	0	.	.	.
gatB.261	0	0	.	.	.
gatB.262	0	0	.	.	.
gatB.263	0	0	.	.	.
gatB.264	0	0	.	.	.
gatB.265	0	0	.	.	.
gatB.266	0	0	.	.	.
gatB.267	0	0	.	.	.
gatB.268	0	0	.	.	.
gatB.269	0	0	.	.	.
gatB.27	0	0	.	.	.
gatB.270	0	0	.	.	.
gatB.271	0	0	.	.	.
gatB.272	0	0	.	.	.
gatB.273	0	0	.	.	.
gatB.274	0	0	.	.	.
gatB.275	0	0	.	.	.
gatB.276	0	0	.	.	.
gatB.277	0	0	.	.	.
gatB.278	0	0	.	.	.
gatB.279	0	0	.	.	.
gatB.28	0	0	.	.	.
gatB.280	0	0	.	.	.
gatB.281	0	0	.	.	.
gatB.282	0	0	.	.	.
gatB.283	0	0	.	.	.
gatB.284	0	0	.	.	.
gatB.285	0	0	.	.	.
gatB.286	0	0	.	.	.
gatB.287	0	0	.	.	.
gatB.288	0	0	.	.	.
gatB.289	0	0	.	.	.
gatB.29	0	0	.	.	.
gatB.290	0	0	.	.	.
gatB.291	0	0	.	.	.
gatB.292	0	0	.	.	.
gatB.293	0	0	.	.	.
gatB.294	0	0	.	.	.
gatB.295	0	0	.	.	.
gatB.296	0	0	.	.	.
gatB.297	0	0	.	.	.
gatB.298	0	0	.	.	.
gatB.299	0	0	.	.	.
gatB.3	0	0	.	.	.
gatB.30	0	0	.	.	.
gatB.300	0	0	.	.	.
gatB.301	0	0	.	.	.
gatB.302	0	0	.	.	.
gatB.303	0	0	.	.	.
gatB.304	0	0	.	.	.
gatB.305	0	0	.	.	.
gatB.306	0	0	.	.	.
gatB.307	0	0	.	.	.
gatB.308	0	0	.	.	.
gatB.309	0	0	.	.	.
gatB.31	0	0	.	.	.
gatB.310	0	0	.	.	.
gatB.311	0	0	.	.	.
gatB.312	0	0	.	.	.
gatB.313	0	0	.	.	.
gatB.314	0	0	.	.	.
gatB.315	0	0	.	.	.
gatB.316	0	0	.	.	.
gatB.317	0	0	.	.	.
gatB.318	0	0	.	.	.
gatB.319	0	0	.	.	.
gatB.32	0	0	.	.	.
gatB.320	0	0	.	.	.
gatB.321	0	0	.	.	.
gatB.322	0	0	.	.	.
gatB.323	0	0	.	.	.
gatB.324	0	0	.	.	.
gatB.33	0	0	.	.	.
gatB.34	0	0	.	.	.
gatB.35	0	0	.	.	.
gatB.36	0	0	.	.	.
gatB.37	0	0	.	.	.
gatB.38	0	0	.	.	.
gatB.39	0	0	.	.	.
gatB.4	0	0	.	.	.
gatB.40	0	0	.	.	.
gatB.41	0	0	.	.	.
gatB.42	0	0	.	.	.
gatB.43	0	0	.	.	.
gatB.44	0	0	.	.	.
gatB.45	0	0	.	.	.
gatB.46	0	0	.	.	.
gatB.47	0	0	.	.	.
gatB.48	0	0	.	.	.
gatB.49	0	0	.	.	.
gatB.5	0	0	.	.	.
gatB.50	0	0	.	.	.
gatB.51	0	0	.	.	.
gatB.52	0	0	.	.	.
gatB.53	0	0	.	.	.
gatB.54	0	0	.	.	.
gatB.55	0	0	.	.	.
gatB.56	0	0	.	.	.
gatB.57	0	0	.	.	.
gatB.58	0	0	.	.	.
gatB.59	0	0	.	.	.
gatB.6	0	0	.	.	.
gatB.60	0	0	.	.	.
gatB.61	0	0	.	.	.
gatB.62	0	0	.	.	.
gatB.63	0	0	.	.	.
gatB.64	0	0	.	.	.
gatB.65	0	0	.	.	.
gatB.66	0	0	.	.	.
gatB.67	0	0	.	.	.
gatB.68	0	0	.	.	.
gatB.69	0	0	.	.	.
gatB.7	0	0	.	.	.
gatB.70	0	0	.	.	.
gatB.71	0	0	.	.	.
gatB.72	0	0	.	.	.
gatB.73	0	0	.	.	.
gatB.74	0	0	.	.	.
gatB.75	0	0	.	.	.
gatB.76	0	0	.	.	.
gatB.77	0	0	.	.	.
gatB.78	0	0	.	.	.
gatB.79	0	0	.	.	.
gatB.8	0	0	.	.	.
gatB.80	0	0	.	.	.
gatB.81	0	0	.	.	.
gatB.82	0	0	.	.	.
gatB.83	0	0	.	.	.
gatB.84	0	0	.	.	.
gatB.85	0	0	.	.	.
gatB.86	0	0	.	.	.
gatB.87	0	0	.	.	.
gatB.88	0	0	.	.	.
gatB.89	0	0	.	.	.
gatB.9	0	0	.	.	.
gatB.90	0	0	.	.	.
gatB.91	0	0	.	.	.
gatB.92	0	0	.	.	.
gatB.93	0	0	.	.	.
gatB.94	0	0	.	.	.
gatB.95	0	0	.	.	.
gatB.96	0	0	.	.	.
gatB.97	0	0	.	.	.
gatB.98	0	0	.	.	.
gatB.99	0	0	.	.	.
coxA.1	0	0	.	.	.
coxA.10	0	0	.	.	.
coxA.100	0	0	.	.	.
coxA.101	0	0	.	.	.
coxA.102	0	0	.	.	.
coxA.103	0	0	.	.	.
coxA.104	0	0	.	.	.
coxA.105	0	0	.	.	.
coxA.106	0	0	.	.	.
coxA.107	0	0	.	.	.
coxA.108	0	0	.	.	.
coxA.109	0	0	.	.	.
coxA.11	0	0	.	.	.
coxA.110	0	0	.	.	.
coxA.111	0	0	.	.	.
coxA.112	0	0	.	.	.
coxA.113	0	0	.	.	.
coxA.114	0	0	.	.	.
coxA.115	0	0	.	.	.
coxA.116	0	0	.	.	.
coxA.117	0	0	.	.	.
coxA.118	0	0	.	.	.
coxA.119	0	0	.	.	.
coxA.12	0	0	.	.	.
coxA.120	0	0	.	.	.
coxA.121	0	0	.	.	.
coxA.122	0	0	.	.	.
coxA.123	0	0	.	.	.
coxA.124	0	0	.	.	.
coxA.125	0	0	.	.	.
coxA.126	0	0	.	.	.
coxA.127	0	0	.	.	.
coxA.128	0	0	.	.	.
coxA.129	0	0	.	.	.
coxA.13	0	0	.	.	.
coxA.130	0	0	.	.	.
coxA.131	0	0	.	.	.
coxA.132	0	0	.	.	.
coxA.133	0	0	.	.	.
coxA.134	0	0	.	.	.
coxA.135	0	0	.	.	.
coxA.136	0	0	.	.	.
coxA.137	0	0	.	.	.
coxA.138	0	0	.	.	.
coxA.139	0	0	.	.	.
coxA.14	0	0	.	.	.
coxA.140	0	0	.	.	.
coxA.141	0	0	.	.	.
coxA.142	0	0	.	.	.
coxA.143	0	0	.	.	.
coxA.144	0	0	.	.	.
coxA.145	0	0	.	.	.
coxA.146	0	0	.	.	.
coxA.147	0	0	.	.	.
coxA.148	0	0	.	.	.
coxA.149	0	0	.	.	.
coxA.15	0	0	.	.	.
coxA.150	0	0	.	.	.
coxA.151	0	0	.	.	.
coxA.152	0	0	.	.	.
coxA.153	0	0	.	.	.
coxA.154	0	0	.	.	.
coxA.155	0	0	.	.	.
coxA.156	0	0	.	.	.
coxA.157	0	0	.	.	.
coxA.158	0	0	.	.	.
coxA.159	0	0	.	.	.
coxA.16	0	0	.	.	.
coxA.160	0	0	.	.	.
coxA.161	0	0	.	.	.
coxA.162	0	0	.	.	.
coxA.163	0	0	.	.	.
coxA.164	0	0	.	.	.
coxA.165	0	0	.	.	.
coxA.166	0	0	.	.	.
coxA.167	0	0	.	.	.
coxA.168	0	0	.	.	.
coxA.169	0	0	.	.	.
coxA.17	0	0	.	.	.
coxA.170	0	0	.	.	.
coxA.171	0	0	.	.	.
coxA.172	0	0	.	.	.
coxA.173	0	0	.	.	.
coxA.174	0	0	.	.	.
coxA.175	0	0	.	.	.
coxA.176	0	0	.	.	.
coxA.177	0	0	.	.	.
coxA.178	0	0	.	.	.
coxA.179	0	0	.	.	.
coxA.18	0	0	.	.	.
coxA.180	0	0	.	.	.
coxA.181	0	0	.	.	.
coxA.182	0	0	.	.	.
coxA.183	0	0	.	.	.
coxA.184	0	0	.	.	.
coxA.185	0	0	.	.	.
coxA.186	0	0	.	.	.
coxA.187	0	0	.	.	.
coxA.188	0	0	.	.	.
coxA.189	0	0	.	.	.
coxA.19	0	0	.	.	.
coxA.190	0	0	.	.	.
coxA.191	0	0	.	.	.
coxA.192	0	0	.	.	.
coxA.193	0	0	.	.	.
coxA.194	0	0	.	.	.
coxA.195	0	0	.	.	.
coxA.196	0	0	.	.	.
coxA.197	0	0	.	.	.
coxA.198	0	0	.	.	.
coxA.199	0	0	.	.	.
coxA.2	0	0	.	.	.
coxA.20	0	0	.	.	.
coxA.200	0	0	.	.	.
coxA.201	0	0	.	.	.
coxA.202	0	0	.	.	.
coxA.203	0	0	.	.	.
coxA.204	0	0	.	.	.
coxA.205	0	0	.	.	.
coxA.206	0	0	.	.	.
coxA.207	0	0	.	.	.
coxA.208	0	0	.	.	.
coxA.209	0	0	.	.	.
coxA.21	0	0	.	.	.
coxA.210	0	0	.	.	.
coxA.211	0	0	.	.	.
coxA.212	0	0	.	.	.
coxA.213	0	0	.	.	.
coxA.214	0	0	.	.	.
coxA.215	0	0	.	.	.
coxA.216	0	0	.	.	.
coxA.217	0	0	.	.	.
coxA.218	0	0	.	.	.
coxA.219	0	0	.	.	.
coxA.22	0	0	.	.	.
coxA.220	0	0	.	.	.
coxA.221	0	0	.	.	.
coxA.222	0	0	.	.	.
coxA.223	0	0	.	.	.
coxA.224	0	0	.	.	.
coxA.225	0	0	.	.	.
coxA.226	0	0	.	.	.
coxA.227	0	0	.	.	.
coxA.228	0	0	.	.	.
coxA.229	0	0	.	.	.
coxA.23	0	0	.	.	.
coxA.230	0	0	.	.	.
coxA.231	0	0	.	.	.
coxA.232	0	0	.	.	.
coxA.233	0	0	.	.	.
coxA.234	0	0	.	.	.
coxA.235	0	0	.	.	.
coxA.236	0	0	.	.	.
coxA.237	0	0	.	.	.
coxA.238	0	0	.	.	.
coxA.239	0	0	.	.	.
coxA.24	0	0	.	.	.
coxA.240	0	0	.	.	.
coxA.241	0	0	.	.	.
coxA.242	0	0	.	.	.
coxA.243	0	0	.	.	.
coxA.244	0	0	.	.	.
coxA.245	0	0	.	.	.
coxA.246	0	0	.	.	.
coxA.247	0	0	.	.	.
coxA.248	0	0	.	.	.
coxA.249	0	0	.	.	.
coxA.25	0	0	.	.	.
coxA.250	0	0	.	.	.
coxA.251	0	0	.	.	.
coxA.252	0	0	.	.	.
coxA.253	0	0	.	.	.
coxA.254	0	0	.	.	.
coxA.255	0	0	.	.	.
coxA.256	0	0	.	.	.
coxA.257	0	0	.	.	.
coxA.258	0	0	.	.	.
coxA.259	0	0	.	.	.
coxA.26	0	0	.	.	.
coxA.260	0	0	.	.	.
coxA.261	0	0	.	.	.
coxA.262	0	0	.	.	.
coxA.263	0	0	.	.	.
coxA.265	0	0	.	.	.
coxA.266	0	0	.	.	.
coxA.267	0	0	.	.	.
coxA.268	0	0	.	.	.
coxA.269	0	0	.	.	.
coxA.27	0	0	.	.	.
coxA.270	0	0	.	.	.
coxA.271	0	0	.	.	.
coxA.272	0	0	.	.	.
coxA.273	0	0	.	.	.
coxA.274	0	0	.	.	.
coxA.275	0	0	.	.	.
coxA.276	0	0	.	.	.
coxA.277	0	0	.	.	.
coxA.278	0	0	.	.	.
coxA.279	0	0	.	.	.
coxA.28	0	0	.	.	.
coxA.280	0	0	.	.	.
coxA.281	0	0	.	.	.
coxA.282	0	0	.	.	.
coxA.283	0	0	.	.	.
coxA.284	0	0	.	.	.
coxA.285	0	0	.	.	.
coxA.286	0	0	.	.	.
coxA.287	0	0	.	.	.
coxA.288	0	0	.	.	.
coxA.289	0	0	.	.	.
coxA.29	0	0	.	.	.
coxA.290	0	0	.	.	.
coxA.291	0	0	.	.	.
coxA.292	0	0	.	.	.
coxA.293	0	0	.	.	.
coxA.294	0	0	.	.	.
coxA.295	0	0	.	.	.
coxA.296	0	0	.	.	.
coxA.297	0	0	.	.	.
coxA.298	0	0	.	.	.
coxA.299	0	0	.	.	.
coxA.3	0	0	.	.	.
coxA.30	0	0	.	.	.
coxA.300	0	0	.	.	.
coxA.301	0	0	.	.	.
coxA.302	0	0	.	.	.
coxA.303	0	0	.	.	.
coxA.304	0	0	.	.	.
coxA.305	0	0	.	.	.
coxA.306	0	0	.	.	.
coxA.307	0	0	.	.	.
coxA.308	0	0	.	.	.
coxA.309	0	0	.	.	.
coxA.31	0	0	.	.	.
coxA.310	0	0	.	.	.
coxA.311	0	0	.	.	.
coxA.312	0	0	.	.	.
coxA.313	0	0	.	.	.
coxA.314	0	0	.	.	.
coxA.315	0	0	.	.	.
coxA.316	0	0	.	.	.
coxA.317	0	0	.	.	.
coxA.318	0	0	.	.	.
coxA.319	0	0	.	.	.
coxA.32	0	0	.	.	.
coxA.320	0	0	.	.	.
coxA.321	0	0	.	.	.
coxA.33	0	0	.	.	.
coxA.34	0	0	.	.	.
coxA.35	0	0	.	.	.
coxA.36	0	0	.	.	.
coxA.37	0	0	.	.	.
coxA.38	0	0	.	.	.
coxA.39	0	0	.	.	.
coxA.4	0	0	.	.	.
coxA.40	0	0	.	.	.
coxA.41	0	0	.	.	.
coxA.42	0	0	.	.	.
coxA.43	0	0	.	.	.
coxA.44	0	0	.	.	.
coxA.45	0	0	.	.	.
coxA.46	0	0	.	.	.
coxA.47	0	0	.	.	.
coxA.48	0	0	.	.	.
coxA.49	0	0	.	.	.
coxA.5	0	0	.	.	.
coxA.50	0	0	.	.	.
coxA.51	0	0	.	.	.
coxA.52	0	0	.	.	.
coxA.53	0	0	.	.	.
coxA.54	0	0	.	.	.
coxA.55	0	0	.	.	.
coxA.56	0	0	.	.	.
coxA.57	0	0	.	.	.
coxA.58	0	0	.	.	.
coxA.59	0	0	.	.	.
coxA.6	0	0	.	.	.
coxA.60	0	0	.	.	.
coxA.61	0	0	.	.	.
coxA.62	0	0	.	.	.
coxA.63	0	0	.	.	.
coxA.64	0	0	.	.	.
coxA.65	0	0	.	.	.
coxA.66	0	0	.	.	.
coxA.67	0	0	.	.	.
coxA.68	0	0	.	.	.
coxA.69	0	0	.	.	.
coxA.7	0	0	.	.	.
coxA.70	0	0	.	.	.
coxA.71	0	0	.	.	.
coxA.72	0	0	.	.	.
coxA.73	0	0	.	.	.
coxA.74	0	0	.	.	.
coxA.75	0	0	.	.	.
coxA.76	0	0	.	.	.
coxA.77	0	0	.	.	.
coxA.78	0	0	.	.	.
coxA.79	0	0	.	.	.
coxA.8	0	0	.	.	.
coxA.80	0	0	.	.	.
coxA.81	0	0	.	.	.
coxA.82	0	0	.	.	.
coxA.83	0	0	.	.	.
coxA.84	0	0	.	.	.
coxA.85	0	0	.	.	.
coxA.86	0	0	.	.	.
coxA.87	0	0	.	.	.
coxA.88	0	0	.	.	.
coxA.89	0	0	.	.	.
coxA.9	0	0	.	.	.
coxA.90	0	0	.	.	.
coxA.91	0	0	.	.	.
coxA.92	0	0	.	.	.
coxA.93	0	0	.	.	.
coxA.94	0	0	.	.	.
coxA.95	0	0	.	.	.
coxA.96	0	0	.	.	.
coxA.97	0	0	.	.	.
coxA.98	0	0	.	.	.
coxA.99	0	0	.	.	.
hcpA.1	0	0	.	.	.
hcpA.10	0	0	.	.	.
hcpA.100	0	0	.	.	.
hcpA.101	0	0	.	.	.
hcpA.102	0	0	.	.	.
hcpA.103	0	0	.	.	.
hcpA.104	0	0	.	.	.
hcpA.105	0	0	.	.	.
hcpA.106	0	0	.	.	.
hcpA.107	0	0	.	.	.
hcpA.108	0	0	.	.	.
hcpA.109	0	0	.	.	.
hcpA.11	0	0	.	.	.
hcpA.110	0	0	.	.	.
hcpA.111	0	0	.	.	.
hcpA.112	0	0	.	.	.
hcpA.113	0	0	.	.	.
hcpA.114	0	0	.	.	.
hcpA.115	0	0	.	.	.
hcpA.116	0	0	.	.	.
hcpA.117	0	0	.	.	.
hcpA.118	0	0	.	.	.
hcpA.119	0	0	.	.	.
hcpA.12	0	0	.	.	.
hcpA.120	0	0	.	.	.
hcpA.121	0	0	.	.	.
hcpA.122	0	0	.	.	.
hcpA.123	0	0	.	.	.
hcpA.124	0	0	.	.	.
hcpA.125	0	0	.	.	.
hcpA.126	0	0	.	.	.
hcpA.127	0	0	.	.	.
hcpA.128	0	0	.	.	.
hcpA.129	0	0	.	.	.
hcpA.13	0	0	.	.	.
hcpA.130	0	0	.	.	.
hcpA.131	0	0	.	.	.
hcpA.132	0	0	.	.	.
hcpA.133	0	0	.	.	.
hcpA.134	0	0	.	.	.
hcpA.135	0	0	.	.	.
hcpA.136	0	0	.	.	.
hcpA.137	0	0	.	.	.
hcpA.138	0	0	.	.	.
hcpA.139	0	0	.	.	.
hcpA.14	0	0	.	.	.
hcpA.140	0	0	.	.	.
hcpA.141	0	0	.	.	.
hcpA.142	0	0	.	.	.
hcpA.143	0	0	.	.	.
hcpA.144	0	0	.	.	.
hcpA.145	0	0	.	.	.
hcpA.146	0	0	.	.	.
hcpA.147	0	0	.	.	.
hcpA.148	0	0	.	.	.
hcpA.149	0	0	.	.	.
hcpA.15	0	0	.	.	.
hcpA.150	0	0	.	.	.
hcpA.151	0	0	.	.	.
hcpA.152	0	0	.	.	.
hcpA.153	0	0	.	.	.
hcpA.154	0	0	.	.	.
hcpA.155	0	0	.	.	.
hcpA.156	0	0	.	.	.
hcpA.157	0	0	.	.	.
hcpA.158	0	0	.	.	.
hcpA.159	0	0	.	.	.
hcpA.16	0	0	.	.	.
hcpA.160	0	0	.	.	.
hcpA.161	0	0	.	.	.
hcpA.162	0	0	.	.	.
hcpA.163	0	0	.	.	.
hcpA.164	0	0	.	.	.
hcpA.165	0	0	.	.	.
hcpA.166	0	0	.	.	.
hcpA.167	0	0	.	.	.
hcpA.168	0	0	.	.	.
hcpA.169	0	0	.	.	.
hcpA.17	0	0	.	.	.
hcpA.170	0	0	.	.	.
hcpA.171	0	0	.	.	.
hcpA.172	0	0	.	.	.
hcpA.173	0	0	.	.	.
hcpA.174	0	0	.	.	.
hcpA.175	0	0	.	.	.
hcpA.176	0	0	.	.	.
hcpA.177	0	0	.	.	.
hcpA.178	0	0	.	.	.
hcpA.179	0	0	.	.	.
hcpA.18	0	0	.	.	.
hcpA.180	0	0	.	.	.
hcpA.181	0	0	.	.	.
hcpA.182	0	0	.	.	.
hcpA.183	0	0	.	.	.
hcpA.184	0	0	.	.	.
hcpA.185	0	0	.	.	.
hcpA.186	0	0	.	.	.
hcpA.187	0	0	.	.	.
hcpA.188	0	0	.	.	.
hcpA.189	0	0	.	.	.
hcpA.19	0	0	.	.	.
hcpA.190	0	0	.	.	.
hcpA.191	0	0	.	.	.
hcpA.192	0	0	.	.	.
hcpA.193	0	0	.	.	.
hcpA.194	0	0	.	.	.
hcpA.195	0	0	.	.	.
hcpA.196	0	0	.	.	.
hcpA.197	0	0	.	.	.
hcpA.198	0	0	.	.	.
hcpA.199	0	0	.	.	.
hcpA.2	0	0	.	.	.
hcpA.20	0	0	.	.	.
hcpA.200	0	0	.	.	.
hcpA.201	0	0	.	.	.
hcpA.202	0	0	.	.	.
hcpA.203	0	0	.	.	.
hcpA.204	0	0	.	.	.
hcpA.205	0	0	.	.	.
hcpA.206	0	0	.	.	.
hcpA.207	0	0	.	.	.
hcpA.208	0	0	.	.	.
hcpA.209	0	0	.	.	.
hcpA.21	0	0	.	.	.
hcpA.210	0	0	.	.	.
hcpA.211	0	0	.	.	.
hcpA.212	0	0	.	.	.
hcpA.213	0	0	.	.	.
hcpA.214	0	0	.	.	.
hcpA.215	0	0	.	.	.
hcpA.216	0	0	.	.	.
hcpA.217	0	0	.	.	.
hcpA.218	0	0	.	.	.
hcpA.219	0	0	.	.	.
hcpA.22	0	0	.	.	.
hcpA.220	0	0	.	.	.
hcpA.221	0	0	.	.	.
hcpA.222	0	0	.	.	.
hcpA.223	0	0	.	.	.
hcpA.224	0	0	.	.	.
hcpA.225	0	0	.	.	.
hcpA.226	0	0	.	.	.
hcpA.227	0	0	.	.	.
hcpA.228	0	0	.	.	.
hcpA.229	0	0	.	.	.
hcpA.23	0	0	.	.	.
hcpA.230	0	0	.	.	.
hcpA.231	0	0	.	.	.
hcpA.232	0	0	.	.	.
hcpA.233	0	0	.	.	.
hcpA.234	0	0	.	.	.
hcpA.235	0	0	.	.	.
hcpA.236	0	0	.	.	.
hcpA.237	0	0	.	.	.
hcpA.238	0	0	.	.	.
hcpA.239	0	0	.	.	.
hcpA.24	0	0	.	.	.
hcpA.240	0	0	.	.	.
hcpA.241	0	0	.	.	.
hcpA.242	0	0	.	.	.
hcpA.243	0	0	.	.	.
hcpA.244	0	0	.	.	.
hcpA.245	0	0	.	.	.
hcpA.246	0	0	.	.	.
hcpA.247	0	0	.	.	.
hcpA.248	0	0	.	.	.
hcpA.249	0	0	.	.	.
hcpA.25	0	0	.	.	.
hcpA.250	0	0	.	.	.
hcpA.251	0	0	.	.	.
hcpA.252	0	0	.	.	.
hcpA.253	0	0	.	.	.
hcpA.254	0	0	.	.	.
hcpA.255	0	0	.	.	.
hcpA.256	0	0	.	.	.
hcpA.257	0	0	.	.	.
hcpA.258	0	0	.	.	.
hcpA.259	0	0	.	.	.
hcpA.26	0	0	.	.	.
hcpA.260	0	0	.	.	.
hcpA.261	0	0	.	.	.
hcpA.262	0	0	.	.	.
hcpA.263	0	0	.	.	.
hcpA.264	0	0	.	.	.
hcpA.265	0	0	.	.	.
hcpA.266	0	0	.	.	.
hcpA.267	0	0	.	.	.
hcpA.268	0	0	.	.	.
hcpA.269	0	0	.	.	.
hcpA.27	0	0	.	.	.
hcpA.270	0	0	.	.	.
hcpA.271	0	0	.	.	.
hcpA.272	0	0	.	.	.
hcpA.273	0	0	.	.	.
hcpA.274	0	0	.	.	.
hcpA.275	0	0	.	.	.
hcpA.276	0	0	.	.	.
hcpA.277	0	0	.	.	.
hcpA.278	0	0	.	.	.
hcpA.279	0	0	.	.	.
hcpA.28	0	0	.	.	.
hcpA.280	0	0	.	.	.
hcpA.281	0	0	.	.	.
hcpA.282	0	0	.	.	.
hcpA.283	0	0	.	.	.
hcpA.284	0	0	.	.	.
hcpA.285	0	0	.	.	.
hcpA.286	0	0	.	.	.
hcpA.287	0	0	.	.	.
hcpA.288	0	0	.	.	.
hcpA.289	0	0	.	.	.
hcpA.29	0	0	.	.	.
hcpA.290	0	0	.	.	.
hcpA.291	0	0	.	.	.
hcpA.292	0	0	.	.	.
hcpA.293	0	0	.	.	.
hcpA.294	0	0	.	.	.
hcpA.295	0	0	.	.	.
hcpA.296	0	0	.	.	.
hcpA.297	0	0	.	.	.
hcpA.298	0	0	.	.	.
hcpA.299	0	0	.	.	.
hcpA.3	0	0	.	.	.
hcpA.30	0	0	.	.	.
hcpA.300	0	0	.	.	.
hcpA.301	0	0	.	.	.
hcpA.302	0	0	.	.	.
hcpA.303	0	0	.	.	.
hcpA.304	0	0	.	.	.
hcpA.305	0	0	.	.	.
hcpA.306	0	0	.	.	.
hcpA.307	0	0	.	.	.
hcpA.308	0	0	.	.	.
hcpA.309	0	0	.	.	.
hcpA.31	0	0	.	.	.
hcpA.310	0	0	.	.	.
hcpA.311	0	0	.	.	.
hcpA.312	0	0	.	.	.
hcpA.313	0	0	.	.	.
hcpA.314	0	0	.	.	.
hcpA.315	0	0	.	.	.
hcpA.316	0	0	.	.	.
hcpA.317	0	0	.	.	.
hcpA.318	0	0	.	.	.
hcpA.319	0	0	.	.	.
hcpA.32	0	0	.	.	.
hcpA.320	0	0	.	.	.
hcpA.321	0	0	.	.	.
hcpA.322	0	0	.	.	.
hcpA.323	0	0	.	.	.
hcpA.324	0	0	.	.	.
hcpA.325	0	0	.	.	.
hcpA.326	0	0	.	.	.
hcpA.327	0	0	.	.	.
hcpA.328	0	0	.	.	.
hcpA.329	0	0	.	.	.
hcpA.33	0	0	.	.	.
hcpA.330	0	0	.	.	.
hcpA.331	0	0	.	.	.
hcpA.332	0	0	.	.	.
hcpA.333	0	0	.	.	.
hcpA.334	0	0	.	.	.
hcpA.335	0	0	.	.	.
hcpA.336	0	0	.	.	.
hcpA.337	0	0	.	.	.
hcpA.338	0	0	.	.	.
hcpA.339	0	0	.	.	.
hcpA.34	0	0	.	.	.
hcpA.340	0	0	.	.	.
hcpA.341	0	0	.	.	.
hcpA.342	0	0	.	.	.
hcpA.343	0	0	.	.	.
hcpA.344	0	0	.	.	.
hcpA.345	0	0	.	.	.
hcpA.346	0	0	.	.	.
hcpA.347	0	0	.	.	.
hcpA.348	0	0	.	.	.
hcpA.349	0	0	.	.	.
hcpA.35	0	0	.	.	.
hcpA.350	0	0	.	.	.
hcpA.351	0	0	.	.	.
hcpA.352	0	0	.	.	.
hcpA.353	0	0	.	.	.
hcpA.354	0	0	.	.	.
hcpA.355	0	0	.	.	.
hcpA.356	0	0	.	.	.
hcpA.357	0	0	.	.	.
hcpA.358	0	0	.	.	.
hcpA.359	0	0	.	.	.
hcpA.36	0	0	.	.	.
hcpA.37	0	0	.	.	.
hcpA.38	0	0	.	.	.
hcpA.39	0	0	.	.	.
hcpA.4	0	0	.	.	.
hcpA.40	0	0	.	.	.
hcpA.41	0	0	.	.	.
hcpA.42	0	0	.	.	.
hcpA.43	0	0	.	.	.
hcpA.44	0	0	.	.	.
hcpA.45	0	0	.	.	.
hcpA.46	0	0	.	.	.
hcpA.47	0	0	.	.	.
hcpA.48	0	0	.	.	.
hcpA.49	0	0	.	.	.
hcpA.5	0	0	.	.	.
hcpA.50	0	0	.	.	.
hcpA.51	0	0	.	.	.
hcpA.52	0	0	.	.	.
hcpA.53	0	0	.	.	.
hcpA.54	0	0	.	.	.
hcpA.55	0	0	.	.	.
hcpA.56	0	0	.	.	.
hcpA.57	0	0	.	.	.
hcpA.58	0	0	.	.	.
hcpA.59	0	0	.	.	.
hcpA.6	0	0	.	.	.
hcpA.60	0	0	.	.	.
hcpA.61	0	0	.	.	.
hcpA.62	0	0	.	.	.
hcpA.63	0	0	.	.	.
hcpA.64	0	0	.	.	.
hcpA.65	0	0	.	.	.
hcpA.66	0	0	.	.	.
hcpA.67	0	0	.	.	.
hcpA.68	0	0	.	.	.
hcpA.69	0	0	.	.	.
hcpA.7	0	0	.	.	.
hcpA.70	0	0	.	.	.
hcpA.71	0	0	.	.	.
hcpA.72	0	0	.	.	.
hcpA.73	0	0	.	.	.
hcpA.74	0	0	.	.	.
hcpA.75	0	0	.	.	.
hcpA.76	0	0	.	.	.
hcpA.77	0	0	.	.	.
hcpA.78	0	0	.	.	.
hcpA.79	0	0	.	.	.
hcpA.8	0	0	.	.	.
hcpA.80	0	0	.	.	.
hcpA.81	0	0	.	.	.
hcpA.82	0	0	.	.	.
hcpA.83	0	0	.	.	.
hcpA.84	0	0	.	.	.
hcpA.85	0	0	.	.	.
hcpA.86	0	0	.	.	.
hcpA.87	0	0	.	.	.
hcpA.88	0	0	.	.	.
hcpA.89	0	0	.	.	.
hcpA.9	0	0	.	.	.
hcpA.90	0	0	.	.	.
hcpA.91	0	0	.	.	.
hcpA.92	0	0	.	.	.
hcpA.93	0	0	.	.	.
hcpA.94	0	0	.	.	.
hcpA.95	0	0	.	.	.
hcpA.96	0	0	.	.	.
hcpA.97	0	0	.	.	.
hcpA.98	0	0	.	.	.
hcpA.99	0	0	.	.	.
ftsZ.1	0	0	.	.	.
ftsZ.10	0	0	.	.	.
ftsZ.100	0	0	.	.	.
ftsZ.101	0	0	.	.	.
ftsZ.102	0	0	.	.	.
ftsZ.103	0	0	.	.	.
ftsZ.104	0	0	.	.	.
ftsZ.105	0	0	.	.	.
ftsZ.106	0	0	.	.	.
ftsZ.107	0	0	.	.	.
ftsZ.108	0	0	.	.	.
ftsZ.109	0	0	.	.	.
ftsZ.11	0	0	.	.	.
ftsZ.110	0	0	.	.	.
ftsZ.111	0	0	.	.	.
ftsZ.112	0	0	.	.	.
ftsZ.113	0	0	.	.	.
ftsZ.114	0	0	.	.	.
ftsZ.115	0	0	.	.	.
ftsZ.116	0	0	.	.	.
ftsZ.117	0	0	.	.	.
ftsZ.118	0	0	.	.	.
ftsZ.119	0	0	.	.	.
ftsZ.12	0	0	.	.	.
ftsZ.120	0	0	.	.	.
ftsZ.121	0	0	.	.	.
ftsZ.122	0	0	.	.	.
ftsZ.123	0	0	.	.	.
ftsZ.124	0	0	.	.	.
ftsZ.125	0	0	.	.	.
ftsZ.126	0	0	.	.	.
ftsZ.127	0	0	.	.	.
ftsZ.128	0	0	.	.	.
ftsZ.129	0	0	.	.	.
ftsZ.13	0	0	.	.	.
ftsZ.130	0	0	.	.	.
ftsZ.131	0	0	.	.	.
ftsZ.132	0	0	.	.	.
ftsZ.133	0	0	.	.	.
ftsZ.134	0	0	.	.	.
ftsZ.135	0	0	.	.	.
ftsZ.136	0	0	.	.	.
ftsZ.137	0	0	.	.	.
ftsZ.138	0	0	.	.	.
ftsZ.139	0	0	.	.	.
ftsZ.14	0	0	.	.	.
ftsZ.140	0	0	.	.	.
ftsZ.141	0	0	.	.	.
ftsZ.142	0	0	.	.	.
ftsZ.143	0	0	.	.	.
ftsZ.144	0	0	.	.	.
ftsZ.145	0	0	.	.	.
ftsZ.146	0	0	.	.	.
ftsZ.147	0	0	.	.	.
ftsZ.148	0	0	.	.	.
ftsZ.149	0	0	.	.	.
ftsZ.15	0	0	.	.	.
ftsZ.150	0	0	.	.	.
ftsZ.151	0	0	.	.	.
ftsZ.152	0	0	.	.	.
ftsZ.153	0	0	.	.	.
ftsZ.154	0	0	.	.	.
ftsZ.155	0	0	.	.	.
ftsZ.156	0	0	.	.	.
ftsZ.157	0	0	.	.	.
ftsZ.158	0	0	.	.	.
ftsZ.159	0	0	.	.	.
ftsZ.16	0	0	.	.	.
ftsZ.160	0	0	.	.	.
ftsZ.161	0	0	.	.	.
ftsZ.162	0	0	.	.	.
ftsZ.163	0	0	.	.	.
ftsZ.164	0	0	.	.	.
ftsZ.165	0	0	.	.	.
ftsZ.166	0	0	.	.	.
ftsZ.167	0	0	.	.	.
ftsZ.168	0	0	.	.	.
ftsZ.169	0	0	.	.	.
ftsZ.17	0	0	.	.	.
ftsZ.170	0	0	.	.	.
ftsZ.171	0	0	.	.	.
ftsZ.172	0	0	.	.	.
ftsZ.173	0	0	.	.	.
ftsZ.174	0	0	.	.	.
ftsZ.175	0	0	.	.	.
ftsZ.176	0	0	.	.	.
ftsZ.177	0	0	.	.	.
ftsZ.178	0	0	.	.	.
ftsZ.179	0	0	.	.	.
ftsZ.18	0	0	.	.	.
ftsZ.180	0	0	.	.	.
ftsZ.181	0	0	.	.	.
ftsZ.182	0	0	.	.	.
ftsZ.183	0	0	.	.	.
ftsZ.184	0	0	.	.	.
ftsZ.185	0	0	.	.	.
ftsZ.186	0	0	.	.	.
ftsZ.187	0	0	.	.	.
ftsZ.188	0	0	.	.	.
ftsZ.189	0	0	.	.	.
ftsZ.19	0	0	.	.	.
ftsZ.190	0	0	.	.	.
ftsZ.191	0	0	.	.	.
ftsZ.192	0	0	.	.	.
ftsZ.193	0	0	.	.	.
ftsZ.194	0	0	.	.	.
ftsZ.195	0	0	.	.	.
ftsZ.196	0	0	.	.	.
ftsZ.197	0	0	.	.	.
ftsZ.198	0	0	.	.	.
ftsZ.199	0	0	.	.	.
ftsZ.2	0	0	.	.	.
ftsZ.20	0	0	.	.	.
ftsZ.200	0	0	.	.	.
ftsZ.201	0	0	.	.	.
ftsZ.202	0	0	.	.	.
ftsZ.203	0	0	.	.	.
ftsZ.204	0	0	.	.	.
ftsZ.205	0	0	.	.	.
ftsZ.206	0	0	.	.	.
ftsZ.207	0	0	.	.	.
ftsZ.208	0	0	.	.	.
ftsZ.209	0	0	.	.	.
ftsZ.21	0	0	.	.	.
ftsZ.210	0	0	.	.	.
ftsZ.211	0	0	.	.	.
ftsZ.212	0	0	.	.	.
ftsZ.213	0	0	.	.	.
ftsZ.214	0	0	.	.	.
ftsZ.215	0	0	.	.	.
ftsZ.216	0	0	.	.	.
ftsZ.217	0	0	.	.	.
ftsZ.218	0	0	.	.	.
ftsZ.219	0	0	.	.	.
ftsZ.22	0	0	.	.	.
ftsZ.220	0	0	.	.	.
ftsZ.221	0	0	.	.	.
ftsZ.222	0	0	.	.	.
ftsZ.223	0	0	.	.	.
ftsZ.224	0	0	.	.	.
ftsZ.225	0	0	.	.	.
ftsZ.226	0	0	.	.	.
ftsZ.227	0	0	.	.	.
ftsZ.228	0	0	.	.	.
ftsZ.229	0	0	.	.	.
ftsZ.23	0	0	.	.	.
ftsZ.230	0	0	.	.	.
ftsZ.231	0	0	.	.	.
ftsZ.232	0	0	.	.	.
ftsZ.233	0	0	.	.	.
ftsZ.234	0	0	.	.	.
ftsZ.235	0	0	.	.	.
ftsZ.236	0	0	.	.	.
ftsZ.237	0	0	.	.	.
ftsZ.238	0	0	.	.	.
ftsZ.239	0	0	.	.	.
ftsZ.24	0	0	.	.	.
ftsZ.240	0	0	.	.	.
ftsZ.241	0	0	.	.	.
ftsZ.242	0	0	.	.	.
ftsZ.243	0	0	.	.	.
ftsZ.244	0	0	.	.	.
ftsZ.245	0	0	.	.	.
ftsZ.246	0	0	.	.	.
ftsZ.247	0	0	.	.	.
ftsZ.248	0	0	.	.	.
ftsZ.249	0	0	.	.	.
ftsZ.25	0	0	.	.	.
ftsZ.250	0	0	.	.	.
ftsZ.251	0	0	.	.	.
ftsZ.252	0	0	.	.	.
ftsZ.253	0	0	.	.	.
ftsZ.254	0	0	.	.	.
ftsZ.255	0	0	.	.	.
ftsZ.256	0	0	.	.	.
ftsZ.257	0	0	.	.	.
ftsZ.258	0	0	.	.	.
ftsZ.259	0	0	.	.	.
ftsZ.26	0	0	.	.	.
ftsZ.260	0	0	.	.	.
ftsZ.261	0	0	.	.	.
ftsZ.262	0	0	.	.	.
ftsZ.263	0	0	.	.	.
ftsZ.264	0	0	.	.	.
ftsZ.265	0	0	.	.	.
ftsZ.266	0	0	.	.	.
ftsZ.267	0	0	.	.	.
ftsZ.268	0	0	.	.	.
ftsZ.269	0	0	.	.	.
ftsZ.27	0	0	.	.	.
ftsZ.270	0	0	.	.	.
ftsZ.271	0	0	.	.	.
ftsZ.272	0	0	.	.	.
ftsZ.273	0	0	.	.	.
ftsZ.274	0	0	.	.	.
ftsZ.275	0	0	.	.	.
ftsZ.276	0	0	.	.	.
ftsZ.277	0	0	.	.	.
ftsZ.278	0	0	.	.	.
ftsZ.28	0	0	.	.	.
ftsZ.280	0	0	.	.	.
ftsZ.29	0	0	.	.	.
ftsZ.3	0	0	.	.	.
ftsZ.30	0	0	.	.	.
ftsZ.31	0	0	.	.	.
ftsZ.32	0	0	.	.	.
ftsZ.33	0	0	.	.	.
ftsZ.34	0	0	.	.	.
ftsZ.35	0	0	.	.	.
ftsZ.36	0	0	.	.	.
ftsZ.37	0	0	.	.	.
ftsZ.38	0	0	.	.	.
ftsZ.39	0	0	.	.	.
ftsZ.4	0	0	.	.	.
ftsZ.40	0	0	.	.	.
ftsZ.41	0	0	.	.	.
ftsZ.42	0	0	.	.	.
ftsZ.43	0	0	.	.	.
ftsZ.44	0	0	.	.	.
ftsZ.45	0	0	.	.	.
ftsZ.46	0	0	.	.	.
ftsZ.47	0	0	.	.	.
ftsZ.48	0	0	.	.	.
ftsZ.49	0	0	.	.	.
ftsZ.5	0	0	.	.	.
ftsZ.50	0	0	.	.	.
ftsZ.51	0	0	.	.	.
ftsZ.52	0	0	.	.	.
ftsZ.53	0	0	.	.	.
ftsZ.54	0	0	.	.	.
ftsZ.55	0	0	.	.	.
ftsZ.56	0	0	.	.	.
ftsZ.57	0	0	.	.	.
ftsZ.58	0	0	.	.	.
ftsZ.59	0	0	.	.	.
ftsZ.6	0	0	.	.	.
ftsZ.60	0	0	.	.	.
ftsZ.61	0	0	.	.	.
ftsZ.62	0	0	.	.	.
ftsZ.63	0	0	.	.	.
ftsZ.64	0	0	.	.	.
ftsZ.65	0	0	.	.	.
ftsZ.66	0	0	.	.	.
ftsZ.67	0	0	.	.	.
ftsZ.68	0	0	.	.	.
ftsZ.69	0	0	.	.	.
ftsZ.7	0	0	.	.	.
ftsZ.70	0	0	.	.	.
ftsZ.71	0	0	.	.	.
ftsZ.72	0	0	.	.	.
ftsZ.73	0	0	.	.	.
ftsZ.74	0	0	.	.	.
ftsZ.75	0	0	.	.	.
ftsZ.76	0	0	.	.	.
ftsZ.77	0	0	.	.	.
ftsZ.78	0	0	.	.	.
ftsZ.79	0	0	.	.	.
ftsZ.8	0	0	.	.	.
ftsZ.80	0	0	.	.	.
ftsZ.81	0	0	.	.	.
ftsZ.82	0	0	.	.	.
ftsZ.83	0	0	.	.	.
ftsZ.84	0	0	.	.	.
ftsZ.85	0	0	.	.	.
ftsZ.86	0	0	.	.	.
ftsZ.87	0	0	.	.	.
ftsZ.88	0	0	.	.	.
ftsZ.89	0	0	.	.	.
ftsZ.9	0	0	.	.	.
ftsZ.90	0	0	.	.	.
ftsZ.91	0	0	.	.	.
ftsZ.92	0	0	.	.	.
ftsZ.93	0	0	.	.	.
ftsZ.94	0	0	.	.	.
ftsZ.95	0	0	.	.	.
ftsZ.96	0	0	.	.	.
ftsZ.97	0	0	.	.	.
ftsZ.98	0	0	.	.	.
ftsZ.99	0	0	.	.	.
fbpA.1	0	0	.	.	.
fbpA.10	0	0	.	.	.
fbpA.100	0	0	.	.	.
fbpA.101	0	0	.	.	.
fbpA.102	0	0	.	.	.
fbpA.103	0	0	.	.	.
fbpA.104	0	0	.	.	.
fbpA.105	0	0	.	.	.
fbpA.106	0	0	.	.	.
fbpA.107	0	0	.	.	.
fbpA.108	0	0	.	.	.
fbpA.109	0	0	.	.	.
fbpA.11	0	0	.	.	.
fbpA.110	0	0	.	.	.
fbpA.111	0	0	.	.	.
fbpA.112	0	0	.	.	.
fbpA.113	0	0	.	.	.
fbpA.114	0	0	.	.	.
fbpA.115	0	0	.	.	.
fbpA.116	0	0	.	.	.
fbpA.117	0	0	.	.	.
fbpA.118	0	0	.	.	.
fbpA.119	0	0	.	.	.
fbpA.12	0	0	.	.	.
fbpA.120	0	0	.	.	.
fbpA.121	0	0	.	.	.
fbpA.122	0	0	.	.	.
fbpA.123	0	0	.	.	.
fbpA.124	0	0	.	.	.
fbpA.125	0	0	.	.	.
fbpA.126	0	0	.	.	.
fbpA.127	0	0	.	.	.
fbpA.128	0	0	.	.	.
fbpA.129	0	0	.	.	.
fbpA.13	0	0	.	.	.
fbpA.130	0	0	.	.	.
fbpA.131	0	0	.	.	.
fbpA.132	0	0	.	.	.
fbpA.133	0	0	.	.	.
fbpA.134	0	0	.	.	.
fbpA.135	0	0	.	.	.
fbpA.136	0	0	.	.	.
fbpA.137	0	0	.	.	.
fbpA.138	0	0	.	.	.
fbpA.139	0	0	.	.	.
fbpA.14	0	0	.	.	.
fbpA.140	0	0	.	.	.
fbpA.141	0	0	.	.	.
fbpA.142	0	0	.	.	.
fbpA.143	0	0	.	.	.
fbpA.144	0	0	.	.	.
fbpA.145	0	0	.	.	.
fbpA.146	0	0	.	.	.
fbpA.147	0	0	.	.	.
fbpA.148	0	0	.	.	.
fbpA.149	0	0	.	.	.
fbpA.15	0	0	.	.	.
fbpA.150	0	0	.	.	.
fbpA.151	0	0	.	.	.
fbpA.152	0	0	.	.	.
fbpA.153	0	0	.	.	.
fbpA.154	0	0	.	.	.
fbpA.155	0	0	.	.	.
fbpA.156	0	0	.	.	.
fbpA.157	0	0	.	.	.
fbpA.158	0	0	.	.	.
fbpA.159	0	0	.	.	.
fbpA.16	0	0	.	.	.
fbpA.160	0	0	.	.	.
fbpA.161	0	0	.	.	.
fbpA.162	0	0	.	.	.
fbpA.163	0	0	.	.	.
fbpA.164	0	0	.	.	.
fbpA.165	0	0	.	.	.
fbpA.166	0	0	.	.	.
fbpA.167	0	0	.	.	.
fbpA.168	0	0	.	.	.
fbpA.169	0	0	.	.	.
fbpA.17	0	0	.	.	.
fbpA.170	0	0	.	.	.
fbpA.171	0	0	.	.	.
fbpA.172	0	0	.	.	.
fbpA.173	0	0	.	.	.
fbpA.174	0	0	.	.	.
fbpA.175	0	0	.	.	.
fbpA.176	0	0	.	.	.
fbpA.177	0	0	.	.	.
fbpA.178	0	0	.	.	.
fbpA.179	0	0	.	.	.
fbpA.18	0	0	.	.	.
fbpA.180	0	0	.	.	.
fbpA.181	0	0	.	.	.
fbpA.182	0	0	.	.	.
fbpA.183	0	0	.	.	.
fbpA.184	0	0	.	.	.
fbpA.185	0	0	.	.	.
fbpA.186	0	0	.	.	.
fbpA.187	0	0	.	.	.
fbpA.188	0	0	.	.	.
fbpA.189	0	0	.	.	.
fbpA.19	0	0	.	.	.
fbpA.190	0	0	.	.	.
fbpA.191	0	0	.	.	.
fbpA.192	0	0	.	.	.
fbpA.193	0	0	.	.	.
fbpA.194	0	0	.	.	.
fbpA.195	0	0	.	.	.
fbpA.196	0	0	.	.	.
fbpA.197	0	0	.	.	.
fbpA.198	0	0	.	.	.
fbpA.199	0	0	.	.	.
fbpA.2	0	0	.	.	.
fbpA.20	0	0	.	.	.
fbpA.200	0	0	.	.	.
fbpA.201	0	0	.	.	.
fbpA.202	0	0	.	.	.
fbpA.203	0	0	.	.	.
fbpA.204	0	0	.	.	.
fbpA.205	0	0	.	.	.
fbpA.206	0	0	.	.	.
fbpA.207	0	0	.	.	.
fbpA.208	0	0	.	.	.
fbpA.209	0	0	.	.	.
fbpA.21	0	0	.	.	.
fbpA.210	0	0	.	.	.
fbpA.211	0	0	.	.	.
fbpA.212	0	0	.	.	.
fbpA.213	0	0	.	.	.
fbpA.214	0	0	.	.	.
fbpA.215	0	0	.	.	.
fbpA.216	0	0	.	.	.
fbpA.217	0	0	.	.	.
fbpA.218	0	0	.	.	.
fbpA.219	0	0	.	.	.
fbpA.22	0	0	.	.	.
fbpA.220	0	0	.	.	.
fbpA.221	0	0	.	.	.
fbpA.222	0	0	.	.	.
fbpA.223	0	0	.	.	.
fbpA.224	0	0	.	.	.
fbpA.225	0	0	.	.	.
fbpA.226	0	0	.	.	.
fbpA.227	0	0	.	.	.
fbpA.228	0	0	.	.	.
fbpA.229	0	0	.	.	.
fbpA.23	0	0	.	.	.
fbpA.230	0	0	.	.	.
fbpA.231	0	0	.	.	.
fbpA.232	0	0	.	.	.
fbpA.233	0	0	.	.	.
fbpA.234	0	0	.	.	.
fbpA.235	0	0	.	.	.
fbpA.236	0	0	.	.	.
fbpA.237	0	0	.	.	.
fbpA.238	0	0	.	.	.
fbpA.239	0	0	.	.	.
fbpA.24	0	0	.	.	.
fbpA.240	0	0	.	.	.
fbpA.241	0	0	.	.	.
fbpA.242	0	0	.	.	.
fbpA.243	0	0	.	.	.
fbpA.244	0	0	.	.	.
fbpA.245	0	0	.	.	.
fbpA.246	0	0	.	.	.
fbpA.247	0	0	.	.	.
fbpA.248	0	0	.	.	.
fbpA.249	0	0	.	.	.
fbpA.25	0	0	.	.	.
fbpA.250	0	0	.	.	.
fbpA.251	0	0	.	.	.
fbpA.252	0	0	.	.	.
fbpA.253	0	0	.	.	.
fbpA.254	0	0	.	.	.
fbpA.255	0	0	.	.	.
fbpA.256	0	0	.	.	.
fbpA.257	0	0	.	.	.
fbpA.258	0	0	.	.	.
fbpA.259	0	0	.	.	.
fbpA.26	0	0	.	.	.
fbpA.260	0	0	.	.	.
fbpA.261	0	0	.	.	.
fbpA.262	0	0	.	.	.
fbpA.263	0	0	.	.	.
fbpA.264	0	0	.	.	.
fbpA.265	0	0	.	.	.
fbpA.266	0	0	.	.	.
fbpA.267	0	0	.	.	.
fbpA.268	0	0	.	.	.
fbpA.269	0	0	.	.	.
fbpA.27	0	0	.	.	.
fbpA.270	0	0	.	.	.
fbpA.271	0	0	.	.	.
fbpA.272	0	0	.	.	.
fbpA.273	0	0	.	.	.
fbpA.274	0	0	.	.	.
fbpA.275	0	0	.	.	.
fbpA.276	0	0	.	.	.
fbpA.277	0	0	.	.	.
fbpA.278	0	0	.	.	.
fbpA.279	0	0	.	.	.
fbpA.28	0	0	.	.	.
fbpA.280	0	0	.	.	.
fbpA.281	0	0	.	.	.
fbpA.282	0	0	.	.	.
fbpA.283	0	0	.	.	.
fbpA.284	0	0	.	.	.
fbpA.285	0	0	.	.	.
fbpA.286	0	0	.	.	.
fbpA.287	0	0	.	.	.
fbpA.288	0	0	.	.	.
fbpA.289	0	0	.	.	.
fbpA.29	0	0	.	.	.
fbpA.290	0	0	.	.	.
fbpA.291	0	0	.	.	.
fbpA.292	0	0	.	.	.
fbpA.293	0	0	.	.	.
fbpA.294	0	0	.	.	.
fbpA.295	0	0	.	.	.
fbpA.296	0	0	.	.	.
fbpA.297	0	0	.	.	.
fbpA.298	0	0	.	.	.
fbpA.299	0	0	.	.	.
fbpA.3	0	0	.	.	.
fbpA.30	0	0	.	.	.
fbpA.300	0	0	.	.	.
fbpA.301	0	0	.	.	.
fbpA.302	0	0	.	.	.
fbpA.303	0	0	.	.	.
fbpA.304	0	0	.	.	.
fbpA.305	0	0	.	.	.
fbpA.306	0	0	.	.	.
fbpA.307	0	0	.	.	.
fbpA.308	0	0	.	.	.
fbpA.309	0	0	.	.	.
fbpA.31	0	0	.	.	.
fbpA.310	0	0	.	.	.
fbpA.311	0	0	.	.	.
fbpA.312	0	0	.	.	.
fbpA.313	0	0	.	.	.
fbpA.314	0	0	.	.	.
fbpA.315	0	0	.	.	.
fbpA.316	0	0	.	.	.
fbpA.317	0	0	.	.	.
fbpA.318	0	0	.	.	.
fbpA.319	0	0	.	.	.
fbpA.32	0	0	.	.	.
fbpA.320	0	0	.	.	.
fbpA.321	0	0	.	.	.
fbpA.322	0	0	.	.	.
fbpA.323	0	0	.	.	.
fbpA.324	0	0	.	.	.
fbpA.325	0	0	.	.	.
fbpA.326	0	0	.	.	.
fbpA.327	0	0	.	.	.
fbpA.328	0	0	.	.	.
fbpA.329	0	0	.	.	.
fbpA.33	0	0	.	.	.
fbpA.330	0	0	.	.	.
fbpA.331	0	0	.	.	.
fbpA.332	0	0	.	.	.
fbpA.333	0	0	.	.	.
fbpA.334	0	0	.	.	.
fbpA.335	0	0	.	.	.
fbpA.336	0	0	.	.	.
fbpA.337	0	0	.	.	.
fbpA.338	0	0	.	.	.
fbpA.339	0	0	.	.	.
fbpA.34	0	0	.	.	.
fbpA.340	0	0	.	.	.
fbpA.341	0	0	.	.	.
fbpA.342	0	0	.	.	.
fbpA.343	0	0	.	.	.
fbpA.344	0	0	.	.	.
fbpA.345	0	0	.	.	.
fbpA.346	0	0	.	.	.
fbpA.347	0	0	.	.	.
fbpA.348	0	0	.	.	.
fbpA.349	0	0	.	.	.
fbpA.35	0	0	.	.	.
fbpA.350	0	0	.	.	.
fbpA.351	0	0	.	.	.
fbpA.352	0	0	.	.	.
fbpA.353	0	0	.	.	.
fbpA.354	0	0	.	.	.
fbpA.355	0	0	.	.	.
fbpA.356	0	0	.	.	.
fbpA.357	0	0	.	.	.
fbpA.358	0	0	.	.	.
fbpA.359	0	0	.	.	.
fbpA.36	0	0	.	.	.
fbpA.360	0	0	.	.	.
fbpA.361	0	0	.	.	.
fbpA.362	0	0	.	.	.
fbpA.363	0	0	.	.	.
fbpA.364	0	0	.	.	.
fbpA.365	0	0	.	.	.
fbpA.366	0	0	.	.	.
fbpA.367	0	0	.	.	.
fbpA.368	0	0	.	.	.
fbpA.369	0	0	.	.	.
fbpA.37	0	0	.	.	.
fbpA.370	0	0	.	.	.
fbpA.371	0	0	.	.	.
fbpA.372	0	0	.	.	.
fbpA.373	0	0	.	.	.
fbpA.374	0	0	.	.	.
fbpA.375	0	0	.	.	.
fbpA.376	0	0	.	.	.
fbpA.377	0	0	.	.	.
fbpA.378	0	0	.	.	.
fbpA.379	0	0	.	.	.
fbpA.38	0	0	.	.	.
fbpA.380	0	0	.	.	.
fbpA.381	0	0	.	.	.
fbpA.382	0	0	.	.	.
fbpA.383	0	0	.	.	.
fbpA.384	0	0	.	.	.
fbpA.385	0	0	.	.	.
fbpA.386	0	0	.	.	.
fbpA.387	0	0	.	.	.
fbpA.388	0	0	.	.	.
fbpA.389	0	0	.	.	.
fbpA.39	0	0	.	.	.
fbpA.390	0	0	.	.	.
fbpA.391	0	0	.	.	.
fbpA.392	0	0	.	.	.
fbpA.393	0	0	.	.	.
fbpA.394	0	0	.	.	.
fbpA.395	0	0	.	.	.
fbpA.396	0	0	.	.	.
fbpA.397	0	0	.	.	.
fbpA.398	0	0	.	.	.
fbpA.399	0	0	.	.	.
fbpA.4	0	0	.	.	.
fbpA.40	0	0	.	.	.
fbpA.400	0	0	.	.	.
fbpA.401	0	0	.	.	.
fbpA.402	0	0	.	.	.
fbpA.403	0	0	.	.	.
fbpA.404	0	0	.	.	.
fbpA.405	0	0	.	.	.
fbpA.406	0	0	.	.	.
fbpA.407	0	0	.	.	.
fbpA.408	0	0	.	.	.
fbpA.409	0	0	.	.	.
fbpA.41	0	0	.	.	.
fbpA.410	0	0	.	.	.
fbpA.411	0	0	.	.	.
fbpA.412	0	0	.	.	.
fbpA.413	0	0	.	.	.
fbpA.414	0	0	.	.	.
fbpA.415	0	0	.	.	.
fbpA.416	0	0	.	.	.
fbpA.417	0	0	.	.	.
fbpA.418	0	0	.	.	.
fbpA.419	0	0	.	.	.
fbpA.42	0	0	.	.	.
fbpA.420	0	0	.	.	.
fbpA.421	0	0	.	.	.
fbpA.422	0	0	.	.	.
fbpA.423	0	0	.	.	.
fbpA.424	0	0	.	.	.
fbpA.425	0	0	.	.	.
fbpA.426	0	0	.	.	.
fbpA.427	0	0	.	.	.
fbpA.428	0	0	.	.	.
fbpA.429	0	0	.	.	.
fbpA.43	0	0	.	.	.
fbpA.430	0	0	.	.	.
fbpA.431	0	0	.	.	.
fbpA.432	0	0	.	.	.
fbpA.433	0	0	.	.	.
fbpA.434	0	0	.	.	.
fbpA.435	0	0	.	.	.
fbpA.436	0	0	.	.	.
fbpA.437	0	0	.	.	.
fbpA.438	0	0	.	.	.
fbpA.439	0	0	.	.	.
fbpA.44	0	0	.	.	.
fbpA.440	0	0	.	.	.
fbpA.441	0	0	.	.	.
fbpA.442	0	0	.	.	.
fbpA.443	0	0	.	.	.
fbpA.444	0	0	.	.	.
fbpA.445	0	0	.	.	.
fbpA.446	0	0	.	.	.
fbpA.447	0	0	.	.	.
fbpA.448	0	0	.	.	.
fbpA.449	0	0	.	.	.
fbpA.45	0	0	.	.	.
fbpA.450	0	0	.	.	.
fbpA.451	0	0	.	.	.
fbpA.452	0	0	.	.	.
fbpA.453	0	0	.	.	.
fbpA.454	0	0	.	.	.
fbpA.455	0	0	.	.	.
fbpA.456	0	0	.	.	.
fbpA.457	0	0	.	.	.
fbpA.458	0	0	.	.	.
fbpA.459	0	0	.	.	.
fbpA.46	0	0	.	.	.
fbpA.460	0	0	.	.	.
fbpA.461	0	0	.	.	.
fbpA.462	0	0	.	.	.
fbpA.463	0	0	.	.	.
fbpA.464	0	0	.	.	.
fbpA.465	0	0	.	.	.
fbpA.466	0	0	.	.	.
fbpA.467	0	0	.	.	.
fbpA.468	0	0	.	.	.
fbpA.469	0	0	.	.	.
fbpA.47	0	0	.	.	.
fbpA.470	0	0	.	.	.
fbpA.471	0	0	.	.	.
fbpA.472	0	0	.	.	.
fbpA.473	0	0	.	.	.
fbpA.474	0	0	.	.	.
fbpA.475	0	0	.	.	.
fbpA.476	0	0	.	.	.
fbpA.477	0	0	.	.	.
fbpA.478	0	0	.	.	.
fbpA.479	0	0	.	.	.
fbpA.48	0	0	.	.	.
fbpA.480	0	0	.	.	.
fbpA.481	0	0	.	.	.
fbpA.482	0	0	.	.	.
fbpA.49	0	0	.	.	.
fbpA.5	0	0	.	.	.
fbpA.50	0	0	.	.	.
fbpA.51	0	0	.	.	.
fbpA.52	0	0	.	.	.
fbpA.53	0	0	.	.	.
fbpA.54	0	0	.	.	.
fbpA.55	0	0	.	.	.
fbpA.56	0	0	.	.	.
fbpA.57	0	0	.	.	.
fbpA.58	0	0	.	.	.
fbpA.59	0	0	.	.	.
fbpA.6	0	0	.	.	.
fbpA.60	0	0	.	.	.
fbpA.61	0	0	.	.	.
fbpA.62	0	0	.	.	.
fbpA.63	0	0	.	.	.
fbpA.64	0	0	.	.	.
fbpA.65	0	0	.	.	.
fbpA.66	0	0	.	.	.
fbpA.67	0	0	.	.	.
fbpA.68	0	0	.	.	.
fbpA.69	0	0	.	.	.
fbpA.7	0	0	.	.	.
fbpA.70	0	0	.	.	.
fbpA.71	0	0	.	.	.
fbpA.72	0	0	.	.	.
fbpA.73	0	0	.	.	.
fbpA.74	0	0	.	.	.
fbpA.75	0	0	.	.	.
fbpA.76	0	0	.	.	.
fbpA.77	0	0	.	.	.
fbpA.78	0	0	.	.	.
fbpA.79	0	0	.	.	.
fbpA.8	0	0	.	.	.
fbpA.80	0	0	.	.	.
fbpA.81	0	0	.	.	.
fbpA.82	0	0	.	.	.
fbpA.83	0	0	.	.	.
fbpA.84	0	0	.	.	.
fbpA.85	0	0	.	.	.
fbpA.86	0	0	.	.	.
fbpA.87	0	0	.	.	.
fbpA.88	0	0	.	.	.
fbpA.89	0	0	.	.	.
fbpA.9	0	0	.	.	.
fbpA.90	0	0	.	.	.
fbpA.91	0	0	.	.	.
fbpA.92	0	0	.	.	.
fbpA.93	0	0	.	.	.
fbpA.94	0	0	.	.	.
fbpA.95	0	0	.	.	.
fbpA.96	0	0	.	.	.
fbpA.97	0	0	.	.	.
fbpA.98	0	0	.	.	.
fbpA.99	0	0	.	.	.
