adk.1	0	0	.	.	.
adk.10	0	0	.	.	.
adk.11	0	0	.	.	.
adk.12	0	0	.	.	.
adk.13	0	0	.	.	.
adk.14	0	0	.	.	.
adk.15	0	0	.	.	.
adk.2	0	0	.	.	.
adk.3	0	0	.	.	.
adk.4	0	0	.	.	.
adk.5	0	0	.	.	.
adk.6	0	0	.	.	.
adk.7	0	0	.	.	.
adk.8	0	0	.	.	.
adk.9	0	0	.	.	.
gapdh.1	0	0	.	.	.
gapdh.10	0	0	.	.	.
gapdh.11	0	0	.	.	.
gapdh.12	0	0	.	.	.
gapdh.13	0	0	.	.	.
gapdh.14	0	0	.	.	.
gapdh.15	0	0	.	.	.
gapdh.16	0	0	.	.	.
gapdh.2	0	0	.	.	.
gapdh.3	0	0	.	.	.
gapdh.4	0	0	.	.	.
gapdh.5	0	0	.	.	.
gapdh.6	0	0	.	.	.
gapdh.7	0	0	.	.	.
gapdh.8	0	0	.	.	.
gapdh.9	0	0	.	.	.
icl.1	0	0	.	.	.
icl.10	0	0	.	.	.
icl.11	0	0	.	.	.
icl.12	0	0	.	.	.
icl.13	0	0	.	.	.
icl.14	0	0	.	.	.
icl.15	0	0	.	.	.
icl.2	0	0	.	.	.
icl.3	0	0	.	.	.
icl.4	0	0	.	.	.
icl.5	0	0	.	.	.
icl.6	0	0	.	.	.
icl.7	0	0	.	.	.
icl.8	0	0	.	.	.
icl.9	0	0	.	.	.
mdh.1	0	0	.	.	.
mdh.10	0	0	.	.	.
mdh.11	0	0	.	.	.
mdh.12	0	0	.	.	.
mdh.13	0	0	.	.	.
mdh.2	0	0	.	.	.
mdh.3	0	0	.	.	.
mdh.4	0	0	.	.	.
mdh.5	0	0	.	.	.
mdh.6	0	0	.	.	.
mdh.7	0	0	.	.	.
mdh.8	0	0	.	.	.
mdh.9	0	0	.	.	.
recA.1	0	0	.	.	.
recA.10	0	0	.	.	.
recA.11	0	0	.	.	.
recA.12	0	0	.	.	.
recA.13	0	0	.	.	.
recA.14	0	0	.	.	.
recA.15	0	0	.	.	.
recA.2	0	0	.	.	.
recA.3	0	0	.	.	.
recA.4	0	0	.	.	.
recA.5	0	0	.	.	.
recA.6	0	0	.	.	.
recA.7	0	0	.	.	.
recA.8	0	0	.	.	.
recA.9	0	0	.	.	.
rpoB.1	0	0	.	.	.
rpoB.10	0	0	.	.	.
rpoB.11	0	0	.	.	.
rpoB.12	0	0	.	.	.
rpoB.13	0	0	.	.	.
rpoB.14	0	0	.	.	.
rpoB.15	0	0	.	.	.
rpoB.16	0	0	.	.	.
rpoB.2	0	0	.	.	.
rpoB.3	0	0	.	.	.
rpoB.4	0	0	.	.	.
rpoB.5	0	0	.	.	.
rpoB.6	0	0	.	.	.
rpoB.7	0	0	.	.	.
rpoB.8	0	0	.	.	.
rpoB.9	0	0	.	.	.
tpi.1	0	0	.	.	.
tpi.10	0	0	.	.	.
tpi.11	0	0	.	.	.
tpi.12	0	0	.	.	.
tpi.13	0	0	.	.	.
tpi.14	0	0	.	.	.
tpi.15	0	0	.	.	.
tpi.2	0	0	.	.	.
tpi.3	0	0	.	.	.
tpi.4	0	0	.	.	.
tpi.5	0	0	.	.	.
tpi.6	0	0	.	.	.
tpi.7	0	0	.	.	.
tpi.8	0	0	.	.	.
tpi.9	0	0	.	.	.
