dtdS.1	0	0	.	.	.
dtdS.10	0	0	.	.	.
dtdS.100	0	0	.	.	.
dtdS.101	0	0	.	.	.
dtdS.102	0	0	.	.	.
dtdS.103	0	0	.	.	.
dtdS.104	0	0	.	.	.
dtdS.105	0	0	.	.	.
dtdS.106	0	0	.	.	.
dtdS.107	0	0	.	.	.
dtdS.108	0	0	.	.	.
dtdS.109	0	0	.	.	.
dtdS.11	0	0	.	.	.
dtdS.110	0	0	.	.	.
dtdS.111	0	0	.	.	.
dtdS.112	0	0	.	.	.
dtdS.113	0	0	.	.	.
dtdS.114	0	0	.	.	.
dtdS.115	0	0	.	.	.
dtdS.116	0	0	.	.	.
dtdS.117	0	0	.	.	.
dtdS.118	0	0	.	.	.
dtdS.119	0	0	.	.	.
dtdS.12	0	0	.	.	.
dtdS.120	0	0	.	.	.
dtdS.121	0	0	.	.	.
dtdS.122	0	0	.	.	.
dtdS.123	0	0	.	.	.
dtdS.124	0	0	.	.	.
dtdS.125	0	0	.	.	.
dtdS.126	0	0	.	.	.
dtdS.127	0	0	.	.	.
dtdS.128	0	0	.	.	.
dtdS.129	0	0	.	.	.
dtdS.13	0	0	.	.	.
dtdS.130	0	0	.	.	.
dtdS.131	0	0	.	.	.
dtdS.132	0	0	.	.	.
dtdS.133	0	0	.	.	.
dtdS.134	0	0	.	.	.
dtdS.135	0	0	.	.	.
dtdS.136	0	0	.	.	.
dtdS.137	0	0	.	.	.
dtdS.138	0	0	.	.	.
dtdS.139	0	0	.	.	.
dtdS.14	0	0	.	.	.
dtdS.140	0	0	.	.	.
dtdS.141	0	0	.	.	.
dtdS.142	0	0	.	.	.
dtdS.143	0	0	.	.	.
dtdS.144	0	0	.	.	.
dtdS.145	0	0	.	.	.
dtdS.146	0	0	.	.	.
dtdS.147	0	0	.	.	.
dtdS.148	0	0	.	.	.
dtdS.149	0	0	.	.	.
dtdS.15	0	0	.	.	.
dtdS.150	0	0	.	.	.
dtdS.151	0	0	.	.	.
dtdS.152	0	0	.	.	.
dtdS.153	0	0	.	.	.
dtdS.154	0	0	.	.	.
dtdS.155	0	0	.	.	.
dtdS.156	0	0	.	.	.
dtdS.157	0	0	.	.	.
dtdS.158	0	0	.	.	.
dtdS.159	0	0	.	.	.
dtdS.16	0	0	.	.	.
dtdS.160	0	0	.	.	.
dtdS.161	0	0	.	.	.
dtdS.162	0	0	.	.	.
dtdS.163	0	0	.	.	.
dtdS.164	0	0	.	.	.
dtdS.165	0	0	.	.	.
dtdS.166	0	0	.	.	.
dtdS.167	0	0	.	.	.
dtdS.168	0	0	.	.	.
dtdS.169	0	0	.	.	.
dtdS.17	0	0	.	.	.
dtdS.170	0	0	.	.	.
dtdS.171	0	0	.	.	.
dtdS.172	0	0	.	.	.
dtdS.173	0	0	.	.	.
dtdS.174	0	0	.	.	.
dtdS.175	0	0	.	.	.
dtdS.176	0	0	.	.	.
dtdS.177	0	0	.	.	.
dtdS.178	0	0	.	.	.
dtdS.179	0	0	.	.	.
dtdS.18	0	0	.	.	.
dtdS.180	0	0	.	.	.
dtdS.181	0	0	.	.	.
dtdS.182	0	0	.	.	.
dtdS.183	0	0	.	.	.
dtdS.184	0	0	.	.	.
dtdS.185	0	0	.	.	.
dtdS.186	0	0	.	.	.
dtdS.187	0	0	.	.	.
dtdS.188	0	0	.	.	.
dtdS.189	0	0	.	.	.
dtdS.19	0	0	.	.	.
dtdS.190	0	0	.	.	.
dtdS.191	0	0	.	.	.
dtdS.192	0	0	.	.	.
dtdS.193	0	0	.	.	.
dtdS.194	0	0	.	.	.
dtdS.195	0	0	.	.	.
dtdS.196	0	0	.	.	.
dtdS.197	0	0	.	.	.
dtdS.198	0	0	.	.	.
dtdS.199	0	0	.	.	.
dtdS.2	0	0	.	.	.
dtdS.20	0	0	.	.	.
dtdS.200	0	0	.	.	.
dtdS.201	0	0	.	.	.
dtdS.203	0	0	.	.	.
dtdS.204	0	0	.	.	.
dtdS.207	0	0	.	.	.
dtdS.208	0	0	.	.	.
dtdS.209	0	0	.	.	.
dtdS.21	0	0	.	.	.
dtdS.210	0	0	.	.	.
dtdS.211	0	0	.	.	.
dtdS.212	0	0	.	.	.
dtdS.213	0	0	.	.	.
dtdS.215	0	0	.	.	.
dtdS.22	0	0	.	.	.
dtdS.23	0	0	.	.	.
dtdS.24	0	0	.	.	.
dtdS.25	0	0	.	.	.
dtdS.26	0	0	.	.	.
dtdS.27	0	0	.	.	.
dtdS.28	0	0	.	.	.
dtdS.29	0	0	.	.	.
dtdS.3	0	0	.	.	.
dtdS.30	0	0	.	.	.
dtdS.31	0	0	.	.	.
dtdS.32	0	0	.	.	.
dtdS.33	0	0	.	.	.
dtdS.34	0	0	.	.	.
dtdS.35	0	0	.	.	.
dtdS.36	0	0	.	.	.
dtdS.37	0	0	.	.	.
dtdS.38	0	0	.	.	.
dtdS.39	0	0	.	.	.
dtdS.4	0	0	.	.	.
dtdS.40	0	0	.	.	.
dtdS.41	0	0	.	.	.
dtdS.42	0	0	.	.	.
dtdS.43	0	0	.	.	.
dtdS.44	0	0	.	.	.
dtdS.45	0	0	.	.	.
dtdS.46	0	0	.	.	.
dtdS.47	0	0	.	.	.
dtdS.48	0	0	.	.	.
dtdS.49	0	0	.	.	.
dtdS.5	0	0	.	.	.
dtdS.50	0	0	.	.	.
dtdS.51	0	0	.	.	.
dtdS.52	0	0	.	.	.
dtdS.53	0	0	.	.	.
dtdS.54	0	0	.	.	.
dtdS.55	0	0	.	.	.
dtdS.56	0	0	.	.	.
dtdS.57	0	0	.	.	.
dtdS.58	0	0	.	.	.
dtdS.59	0	0	.	.	.
dtdS.6	0	0	.	.	.
dtdS.60	0	0	.	.	.
dtdS.61	0	0	.	.	.
dtdS.62	0	0	.	.	.
dtdS.63	0	0	.	.	.
dtdS.64	0	0	.	.	.
dtdS.65	0	0	.	.	.
dtdS.66	0	0	.	.	.
dtdS.67	0	0	.	.	.
dtdS.68	0	0	.	.	.
dtdS.69	0	0	.	.	.
dtdS.7	0	0	.	.	.
dtdS.70	0	0	.	.	.
dtdS.71	0	0	.	.	.
dtdS.72	0	0	.	.	.
dtdS.73	0	0	.	.	.
dtdS.74	0	0	.	.	.
dtdS.75	0	0	.	.	.
dtdS.76	0	0	.	.	.
dtdS.77	0	0	.	.	.
dtdS.78	0	0	.	.	.
dtdS.79	0	0	.	.	.
dtdS.8	0	0	.	.	.
dtdS.80	0	0	.	.	.
dtdS.81	0	0	.	.	.
dtdS.82	0	0	.	.	.
dtdS.83	0	0	.	.	.
dtdS.84	0	0	.	.	.
dtdS.85	0	0	.	.	.
dtdS.86	0	0	.	.	.
dtdS.87	0	0	.	.	.
dtdS.88	0	0	.	.	.
dtdS.89	0	0	.	.	.
dtdS.9	0	0	.	.	.
dtdS.90	0	0	.	.	.
dtdS.91	0	0	.	.	.
dtdS.92	0	0	.	.	.
dtdS.93	0	0	.	.	.
dtdS.94	0	0	.	.	.
dtdS.95	0	0	.	.	.
dtdS.96	0	0	.	.	.
dtdS.97	0	0	.	.	.
dtdS.98	0	0	.	.	.
dtdS.99	0	0	.	.	.
glp.1	0	0	.	.	.
glp.10	0	0	.	.	.
glp.100	0	0	.	.	.
glp.101	0	0	.	.	.
glp.102	0	0	.	.	.
glp.103	0	0	.	.	.
glp.104	0	0	.	.	.
glp.105	0	0	.	.	.
glp.106	0	0	.	.	.
glp.107	0	0	.	.	.
glp.108	0	0	.	.	.
glp.109	0	0	.	.	.
glp.11	0	0	.	.	.
glp.110	0	0	.	.	.
glp.111	0	0	.	.	.
glp.112	0	0	.	.	.
glp.113	0	0	.	.	.
glp.114	0	0	.	.	.
glp.115	0	0	.	.	.
glp.116	0	0	.	.	.
glp.117	0	0	.	.	.
glp.118	0	0	.	.	.
glp.119	0	0	.	.	.
glp.12	0	0	.	.	.
glp.120	0	0	.	.	.
glp.121	0	0	.	.	.
glp.122	0	0	.	.	.
glp.123	0	0	.	.	.
glp.124	0	0	.	.	.
glp.125	0	0	.	.	.
glp.126	0	0	.	.	.
glp.127	0	0	.	.	.
glp.128	0	0	.	.	.
glp.129	0	0	.	.	.
glp.13	0	0	.	.	.
glp.130	0	0	.	.	.
glp.131	0	0	.	.	.
glp.132	0	0	.	.	.
glp.133	0	0	.	.	.
glp.134	0	0	.	.	.
glp.135	0	0	.	.	.
glp.136	0	0	.	.	.
glp.137	0	0	.	.	.
glp.138	0	0	.	.	.
glp.139	0	0	.	.	.
glp.14	0	0	.	.	.
glp.140	0	0	.	.	.
glp.141	0	0	.	.	.
glp.142	0	0	.	.	.
glp.145	0	0	.	.	.
glp.146	0	0	.	.	.
glp.147	0	0	.	.	.
glp.148	0	0	.	.	.
glp.149	0	0	.	.	.
glp.15	0	0	.	.	.
glp.150	0	0	.	.	.
glp.151	0	0	.	.	.
glp.152	0	0	.	.	.
glp.153	0	0	.	.	.
glp.154	0	0	.	.	.
glp.155	0	0	.	.	.
glp.156	0	0	.	.	.
glp.16	0	0	.	.	.
glp.17	0	0	.	.	.
glp.18	0	0	.	.	.
glp.19	0	0	.	.	.
glp.2	0	0	.	.	.
glp.20	0	0	.	.	.
glp.21	0	0	.	.	.
glp.22	0	0	.	.	.
glp.23	0	0	.	.	.
glp.24	0	0	.	.	.
glp.25	0	0	.	.	.
glp.26	0	0	.	.	.
glp.27	0	0	.	.	.
glp.28	0	0	.	.	.
glp.29	0	0	.	.	.
glp.3	0	0	.	.	.
glp.30	0	0	.	.	.
glp.31	0	0	.	.	.
glp.32	0	0	.	.	.
glp.33	0	0	.	.	.
glp.34	0	0	.	.	.
glp.35	0	0	.	.	.
glp.36	0	0	.	.	.
glp.37	0	0	.	.	.
glp.38	0	0	.	.	.
glp.39	0	0	.	.	.
glp.4	0	0	.	.	.
glp.40	0	0	.	.	.
glp.41	0	0	.	.	.
glp.42	0	0	.	.	.
glp.43	0	0	.	.	.
glp.44	0	0	.	.	.
glp.45	0	0	.	.	.
glp.46	0	0	.	.	.
glp.47	0	0	.	.	.
glp.48	0	0	.	.	.
glp.49	0	0	.	.	.
glp.5	0	0	.	.	.
glp.50	0	0	.	.	.
glp.51	0	0	.	.	.
glp.52	0	0	.	.	.
glp.53	0	0	.	.	.
glp.54	0	0	.	.	.
glp.55	0	0	.	.	.
glp.56	0	0	.	.	.
glp.57	0	0	.	.	.
glp.58	0	0	.	.	.
glp.59	0	0	.	.	.
glp.6	0	0	.	.	.
glp.60	0	0	.	.	.
glp.61	0	0	.	.	.
glp.62	0	0	.	.	.
glp.63	0	0	.	.	.
glp.64	0	0	.	.	.
glp.65	0	0	.	.	.
glp.66	0	0	.	.	.
glp.67	0	0	.	.	.
glp.68	0	0	.	.	.
glp.69	0	0	.	.	.
glp.7	0	0	.	.	.
glp.70	0	0	.	.	.
glp.71	0	0	.	.	.
glp.72	0	0	.	.	.
glp.73	0	0	.	.	.
glp.74	0	0	.	.	.
glp.75	0	0	.	.	.
glp.76	0	0	.	.	.
glp.77	0	0	.	.	.
glp.78	0	0	.	.	.
glp.79	0	0	.	.	.
glp.8	0	0	.	.	.
glp.80	0	0	.	.	.
glp.81	0	0	.	.	.
glp.82	0	0	.	.	.
glp.83	0	0	.	.	.
glp.84	0	0	.	.	.
glp.85	0	0	.	.	.
glp.86	0	0	.	.	.
glp.87	0	0	.	.	.
glp.88	0	0	.	.	.
glp.89	0	0	.	.	.
glp.9	0	0	.	.	.
glp.90	0	0	.	.	.
glp.91	0	0	.	.	.
glp.92	0	0	.	.	.
glp.93	0	0	.	.	.
glp.94	0	0	.	.	.
glp.95	0	0	.	.	.
glp.96	0	0	.	.	.
glp.97	0	0	.	.	.
glp.98	0	0	.	.	.
glp.99	0	0	.	.	.
gyrB.1	0	0	.	.	.
gyrB.10	0	0	.	.	.
gyrB.100	0	0	.	.	.
gyrB.101	0	0	.	.	.
gyrB.102	0	0	.	.	.
gyrB.103	0	0	.	.	.
gyrB.104	0	0	.	.	.
gyrB.105	0	0	.	.	.
gyrB.106	0	0	.	.	.
gyrB.107	0	0	.	.	.
gyrB.108	0	0	.	.	.
gyrB.109	0	0	.	.	.
gyrB.11	0	0	.	.	.
gyrB.110	0	0	.	.	.
gyrB.112	0	0	.	.	.
gyrB.113	0	0	.	.	.
gyrB.114	0	0	.	.	.
gyrB.115	0	0	.	.	.
gyrB.116	0	0	.	.	.
gyrB.117	0	0	.	.	.
gyrB.12	0	0	.	.	.
gyrB.124	0	0	.	.	.
gyrB.125	0	0	.	.	.
gyrB.128	0	0	.	.	.
gyrB.129	0	0	.	.	.
gyrB.13	0	0	.	.	.
gyrB.130	0	0	.	.	.
gyrB.133	0	0	.	.	.
gyrB.14	0	0	.	.	.
gyrB.15	0	0	.	.	.
gyrB.16	0	0	.	.	.
gyrB.17	0	0	.	.	.
gyrB.18	0	0	.	.	.
gyrB.19	0	0	.	.	.
gyrB.2	0	0	.	.	.
gyrB.20	0	0	.	.	.
gyrB.21	0	0	.	.	.
gyrB.22	0	0	.	.	.
gyrB.23	0	0	.	.	.
gyrB.24	0	0	.	.	.
gyrB.25	0	0	.	.	.
gyrB.26	0	0	.	.	.
gyrB.27	0	0	.	.	.
gyrB.28	0	0	.	.	.
gyrB.29	0	0	.	.	.
gyrB.3	0	0	.	.	.
gyrB.30	0	0	.	.	.
gyrB.31	0	0	.	.	.
gyrB.32	0	0	.	.	.
gyrB.33	0	0	.	.	.
gyrB.34	0	0	.	.	.
gyrB.35	0	0	.	.	.
gyrB.36	0	0	.	.	.
gyrB.37	0	0	.	.	.
gyrB.38	0	0	.	.	.
gyrB.39	0	0	.	.	.
gyrB.4	0	0	.	.	.
gyrB.40	0	0	.	.	.
gyrB.41	0	0	.	.	.
gyrB.42	0	0	.	.	.
gyrB.43	0	0	.	.	.
gyrB.44	0	0	.	.	.
gyrB.45	0	0	.	.	.
gyrB.46	0	0	.	.	.
gyrB.47	0	0	.	.	.
gyrB.48	0	0	.	.	.
gyrB.49	0	0	.	.	.
gyrB.5	0	0	.	.	.
gyrB.50	0	0	.	.	.
gyrB.51	0	0	.	.	.
gyrB.52	0	0	.	.	.
gyrB.53	0	0	.	.	.
gyrB.54	0	0	.	.	.
gyrB.55	0	0	.	.	.
gyrB.56	0	0	.	.	.
gyrB.57	0	0	.	.	.
gyrB.58	0	0	.	.	.
gyrB.59	0	0	.	.	.
gyrB.6	0	0	.	.	.
gyrB.60	0	0	.	.	.
gyrB.61	0	0	.	.	.
gyrB.62	0	0	.	.	.
gyrB.63	0	0	.	.	.
gyrB.64	0	0	.	.	.
gyrB.65	0	0	.	.	.
gyrB.66	0	0	.	.	.
gyrB.67	0	0	.	.	.
gyrB.68	0	0	.	.	.
gyrB.69	0	0	.	.	.
gyrB.7	0	0	.	.	.
gyrB.70	0	0	.	.	.
gyrB.71	0	0	.	.	.
gyrB.72	0	0	.	.	.
gyrB.73	0	0	.	.	.
gyrB.74	0	0	.	.	.
gyrB.75	0	0	.	.	.
gyrB.76	0	0	.	.	.
gyrB.77	0	0	.	.	.
gyrB.78	0	0	.	.	.
gyrB.79	0	0	.	.	.
gyrB.8	0	0	.	.	.
gyrB.80	0	0	.	.	.
gyrB.81	0	0	.	.	.
gyrB.82	0	0	.	.	.
gyrB.83	0	0	.	.	.
gyrB.84	0	0	.	.	.
gyrB.85	0	0	.	.	.
gyrB.86	0	0	.	.	.
gyrB.87	0	0	.	.	.
gyrB.88	0	0	.	.	.
gyrB.89	0	0	.	.	.
gyrB.9	0	0	.	.	.
gyrB.90	0	0	.	.	.
gyrB.91	0	0	.	.	.
gyrB.92	0	0	.	.	.
gyrB.93	0	0	.	.	.
gyrB.94	0	0	.	.	.
gyrB.95	0	0	.	.	.
gyrB.96	0	0	.	.	.
gyrB.97	0	0	.	.	.
gyrB.98	0	0	.	.	.
gyrB.99	0	0	.	.	.
lysA.1	0	0	.	.	.
lysA.10	0	0	.	.	.
lysA.100	0	0	.	.	.
lysA.101	0	0	.	.	.
lysA.102	0	0	.	.	.
lysA.103	0	0	.	.	.
lysA.104	0	0	.	.	.
lysA.105	0	0	.	.	.
lysA.106	0	0	.	.	.
lysA.107	0	0	.	.	.
lysA.108	0	0	.	.	.
lysA.109	0	0	.	.	.
lysA.11	0	0	.	.	.
lysA.110	0	0	.	.	.
lysA.111	0	0	.	.	.
lysA.112	0	0	.	.	.
lysA.113	0	0	.	.	.
lysA.114	0	0	.	.	.
lysA.115	0	0	.	.	.
lysA.116	0	0	.	.	.
lysA.117	0	0	.	.	.
lysA.118	0	0	.	.	.
lysA.119	0	0	.	.	.
lysA.12	0	0	.	.	.
lysA.120	0	0	.	.	.
lysA.121	0	0	.	.	.
lysA.122	0	0	.	.	.
lysA.123	0	0	.	.	.
lysA.124	0	0	.	.	.
lysA.125	0	0	.	.	.
lysA.126	0	0	.	.	.
lysA.127	0	0	.	.	.
lysA.128	0	0	.	.	.
lysA.129	0	0	.	.	.
lysA.13	0	0	.	.	.
lysA.130	0	0	.	.	.
lysA.131	0	0	.	.	.
lysA.132	0	0	.	.	.
lysA.133	0	0	.	.	.
lysA.134	0	0	.	.	.
lysA.135	0	0	.	.	.
lysA.136	0	0	.	.	.
lysA.137	0	0	.	.	.
lysA.138	0	0	.	.	.
lysA.139	0	0	.	.	.
lysA.14	0	0	.	.	.
lysA.140	0	0	.	.	.
lysA.141	0	0	.	.	.
lysA.142	0	0	.	.	.
lysA.143	0	0	.	.	.
lysA.144	0	0	.	.	.
lysA.145	0	0	.	.	.
lysA.146	0	0	.	.	.
lysA.147	0	0	.	.	.
lysA.148	0	0	.	.	.
lysA.149	0	0	.	.	.
lysA.15	0	0	.	.	.
lysA.150	0	0	.	.	.
lysA.151	0	0	.	.	.
lysA.152	0	0	.	.	.
lysA.153	0	0	.	.	.
lysA.154	0	0	.	.	.
lysA.155	0	0	.	.	.
lysA.156	0	0	.	.	.
lysA.157	0	0	.	.	.
lysA.158	0	0	.	.	.
lysA.159	0	0	.	.	.
lysA.16	0	0	.	.	.
lysA.160	0	0	.	.	.
lysA.161	0	0	.	.	.
lysA.162	0	0	.	.	.
lysA.163	0	0	.	.	.
lysA.164	0	0	.	.	.
lysA.165	0	0	.	.	.
lysA.166	0	0	.	.	.
lysA.167	0	0	.	.	.
lysA.168	0	0	.	.	.
lysA.169	0	0	.	.	.
lysA.17	0	0	.	.	.
lysA.170	0	0	.	.	.
lysA.171	0	0	.	.	.
lysA.172	0	0	.	.	.
lysA.173	0	0	.	.	.
lysA.174	0	0	.	.	.
lysA.175	0	0	.	.	.
lysA.176	0	0	.	.	.
lysA.177	0	0	.	.	.
lysA.178	0	0	.	.	.
lysA.179	0	0	.	.	.
lysA.18	0	0	.	.	.
lysA.180	0	0	.	.	.
lysA.181	0	0	.	.	.
lysA.182	0	0	.	.	.
lysA.183	0	0	.	.	.
lysA.184	0	0	.	.	.
lysA.185	0	0	.	.	.
lysA.186	0	0	.	.	.
lysA.187	0	0	.	.	.
lysA.188	0	0	.	.	.
lysA.189	0	0	.	.	.
lysA.19	0	0	.	.	.
lysA.190	0	0	.	.	.
lysA.191	0	0	.	.	.
lysA.192	0	0	.	.	.
lysA.193	0	0	.	.	.
lysA.194	0	0	.	.	.
lysA.197	0	0	.	.	.
lysA.198	0	0	.	.	.
lysA.199	0	0	.	.	.
lysA.2	0	0	.	.	.
lysA.20	0	0	.	.	.
lysA.205	0	0	.	.	.
lysA.21	0	0	.	.	.
lysA.22	0	0	.	.	.
lysA.23	0	0	.	.	.
lysA.24	0	0	.	.	.
lysA.25	0	0	.	.	.
lysA.26	0	0	.	.	.
lysA.27	0	0	.	.	.
lysA.28	0	0	.	.	.
lysA.29	0	0	.	.	.
lysA.3	0	0	.	.	.
lysA.30	0	0	.	.	.
lysA.31	0	0	.	.	.
lysA.32	0	0	.	.	.
lysA.33	0	0	.	.	.
lysA.34	0	0	.	.	.
lysA.35	0	0	.	.	.
lysA.36	0	0	.	.	.
lysA.37	0	0	.	.	.
lysA.38	0	0	.	.	.
lysA.39	0	0	.	.	.
lysA.4	0	0	.	.	.
lysA.40	0	0	.	.	.
lysA.41	0	0	.	.	.
lysA.42	0	0	.	.	.
lysA.43	0	0	.	.	.
lysA.44	0	0	.	.	.
lysA.45	0	0	.	.	.
lysA.46	0	0	.	.	.
lysA.47	0	0	.	.	.
lysA.48	0	0	.	.	.
lysA.49	0	0	.	.	.
lysA.5	0	0	.	.	.
lysA.50	0	0	.	.	.
lysA.51	0	0	.	.	.
lysA.52	0	0	.	.	.
lysA.53	0	0	.	.	.
lysA.54	0	0	.	.	.
lysA.55	0	0	.	.	.
lysA.56	0	0	.	.	.
lysA.57	0	0	.	.	.
lysA.58	0	0	.	.	.
lysA.59	0	0	.	.	.
lysA.6	0	0	.	.	.
lysA.60	0	0	.	.	.
lysA.61	0	0	.	.	.
lysA.62	0	0	.	.	.
lysA.63	0	0	.	.	.
lysA.64	0	0	.	.	.
lysA.65	0	0	.	.	.
lysA.66	0	0	.	.	.
lysA.67	0	0	.	.	.
lysA.68	0	0	.	.	.
lysA.69	0	0	.	.	.
lysA.7	0	0	.	.	.
lysA.70	0	0	.	.	.
lysA.71	0	0	.	.	.
lysA.72	0	0	.	.	.
lysA.73	0	0	.	.	.
lysA.74	0	0	.	.	.
lysA.75	0	0	.	.	.
lysA.76	0	0	.	.	.
lysA.77	0	0	.	.	.
lysA.78	0	0	.	.	.
lysA.79	0	0	.	.	.
lysA.8	0	0	.	.	.
lysA.80	0	0	.	.	.
lysA.81	0	0	.	.	.
lysA.82	0	0	.	.	.
lysA.83	0	0	.	.	.
lysA.84	0	0	.	.	.
lysA.85	0	0	.	.	.
lysA.86	0	0	.	.	.
lysA.87	0	0	.	.	.
lysA.88	0	0	.	.	.
lysA.89	0	0	.	.	.
lysA.9	0	0	.	.	.
lysA.90	0	0	.	.	.
lysA.91	0	0	.	.	.
lysA.92	0	0	.	.	.
lysA.93	0	0	.	.	.
lysA.94	0	0	.	.	.
lysA.95	0	0	.	.	.
lysA.96	0	0	.	.	.
lysA.97	0	0	.	.	.
lysA.98	0	0	.	.	.
lysA.99	0	0	.	.	.
mdh.1	0	0	.	.	.
mdh.10	0	0	.	.	.
mdh.100	0	0	.	.	.
mdh.101	0	0	.	.	.
mdh.102	0	0	.	.	.
mdh.103	0	0	.	.	.
mdh.104	0	0	.	.	.
mdh.105	0	0	.	.	.
mdh.106	0	0	.	.	.
mdh.107	0	0	.	.	.
mdh.108	0	0	.	.	.
mdh.109	0	0	.	.	.
mdh.11	0	0	.	.	.
mdh.110	0	0	.	.	.
mdh.111	0	0	.	.	.
mdh.112	0	0	.	.	.
mdh.113	0	0	.	.	.
mdh.114	0	0	.	.	.
mdh.115	0	0	.	.	.
mdh.116	0	0	.	.	.
mdh.117	0	0	.	.	.
mdh.118	0	0	.	.	.
mdh.119	0	0	.	.	.
mdh.12	0	0	.	.	.
mdh.120	0	0	.	.	.
mdh.121	0	0	.	.	.
mdh.122	0	0	.	.	.
mdh.123	0	0	.	.	.
mdh.124	0	0	.	.	.
mdh.126	0	0	.	.	.
mdh.129	0	0	.	.	.
mdh.13	0	0	.	.	.
mdh.130	0	0	.	.	.
mdh.131	0	0	.	.	.
mdh.132	0	0	.	.	.
mdh.134	0	0	.	.	.
mdh.135	0	0	.	.	.
mdh.136	0	0	.	.	.
mdh.137	0	0	.	.	.
mdh.14	0	0	.	.	.
mdh.141	0	0	.	.	.
mdh.15	0	0	.	.	.
mdh.16	0	0	.	.	.
mdh.17	0	0	.	.	.
mdh.18	0	0	.	.	.
mdh.19	0	0	.	.	.
mdh.2	0	0	.	.	.
mdh.20	0	0	.	.	.
mdh.21	0	0	.	.	.
mdh.22	0	0	.	.	.
mdh.23	0	0	.	.	.
mdh.24	0	0	.	.	.
mdh.25	0	0	.	.	.
mdh.26	0	0	.	.	.
mdh.27	0	0	.	.	.
mdh.28	0	0	.	.	.
mdh.29	0	0	.	.	.
mdh.3	0	0	.	.	.
mdh.30	0	0	.	.	.
mdh.31	0	0	.	.	.
mdh.32	0	0	.	.	.
mdh.33	0	0	.	.	.
mdh.34	0	0	.	.	.
mdh.35	0	0	.	.	.
mdh.36	0	0	.	.	.
mdh.37	0	0	.	.	.
mdh.38	0	0	.	.	.
mdh.39	0	0	.	.	.
mdh.4	0	0	.	.	.
mdh.40	0	0	.	.	.
mdh.41	0	0	.	.	.
mdh.42	0	0	.	.	.
mdh.43	0	0	.	.	.
mdh.44	0	0	.	.	.
mdh.45	0	0	.	.	.
mdh.46	0	0	.	.	.
mdh.47	0	0	.	.	.
mdh.48	0	0	.	.	.
mdh.49	0	0	.	.	.
mdh.5	0	0	.	.	.
mdh.50	0	0	.	.	.
mdh.51	0	0	.	.	.
mdh.52	0	0	.	.	.
mdh.53	0	0	.	.	.
mdh.54	0	0	.	.	.
mdh.55	0	0	.	.	.
mdh.56	0	0	.	.	.
mdh.57	0	0	.	.	.
mdh.58	0	0	.	.	.
mdh.59	0	0	.	.	.
mdh.6	0	0	.	.	.
mdh.60	0	0	.	.	.
mdh.61	0	0	.	.	.
mdh.62	0	0	.	.	.
mdh.63	0	0	.	.	.
mdh.64	0	0	.	.	.
mdh.65	0	0	.	.	.
mdh.66	0	0	.	.	.
mdh.67	0	0	.	.	.
mdh.68	0	0	.	.	.
mdh.69	0	0	.	.	.
mdh.7	0	0	.	.	.
mdh.70	0	0	.	.	.
mdh.71	0	0	.	.	.
mdh.72	0	0	.	.	.
mdh.73	0	0	.	.	.
mdh.74	0	0	.	.	.
mdh.75	0	0	.	.	.
mdh.76	0	0	.	.	.
mdh.77	0	0	.	.	.
mdh.78	0	0	.	.	.
mdh.79	0	0	.	.	.
mdh.8	0	0	.	.	.
mdh.80	0	0	.	.	.
mdh.81	0	0	.	.	.
mdh.82	0	0	.	.	.
mdh.83	0	0	.	.	.
mdh.84	0	0	.	.	.
mdh.85	0	0	.	.	.
mdh.86	0	0	.	.	.
mdh.87	0	0	.	.	.
mdh.88	0	0	.	.	.
mdh.89	0	0	.	.	.
mdh.9	0	0	.	.	.
mdh.90	0	0	.	.	.
mdh.91	0	0	.	.	.
mdh.92	0	0	.	.	.
mdh.93	0	0	.	.	.
mdh.94	0	0	.	.	.
mdh.95	0	0	.	.	.
mdh.96	0	0	.	.	.
mdh.97	0	0	.	.	.
mdh.98	0	0	.	.	.
mdh.99	0	0	.	.	.
metG.1	0	0	.	.	.
metG.10	0	0	.	.	.
metG.100	0	0	.	.	.
metG.101	0	0	.	.	.
metG.102	0	0	.	.	.
metG.103	0	0	.	.	.
metG.104	0	0	.	.	.
metG.105	0	0	.	.	.
metG.106	0	0	.	.	.
metG.107	0	0	.	.	.
metG.108	0	0	.	.	.
metG.109	0	0	.	.	.
metG.11	0	0	.	.	.
metG.110	0	0	.	.	.
metG.112	0	0	.	.	.
metG.116	0	0	.	.	.
metG.12	0	0	.	.	.
metG.121	0	0	.	.	.
metG.123	0	0	.	.	.
metG.125	0	0	.	.	.
metG.13	0	0	.	.	.
metG.14	0	0	.	.	.
metG.15	0	0	.	.	.
metG.16	0	0	.	.	.
metG.17	0	0	.	.	.
metG.18	0	0	.	.	.
metG.19	0	0	.	.	.
metG.2	0	0	.	.	.
metG.20	0	0	.	.	.
metG.21	0	0	.	.	.
metG.22	0	0	.	.	.
metG.23	0	0	.	.	.
metG.24	0	0	.	.	.
metG.25	0	0	.	.	.
metG.26	0	0	.	.	.
metG.27	0	0	.	.	.
metG.28	0	0	.	.	.
metG.29	0	0	.	.	.
metG.3	0	0	.	.	.
metG.30	0	0	.	.	.
metG.31	0	0	.	.	.
metG.32	0	0	.	.	.
metG.33	0	0	.	.	.
metG.34	0	0	.	.	.
metG.35	0	0	.	.	.
metG.36	0	0	.	.	.
metG.37	0	0	.	.	.
metG.38	0	0	.	.	.
metG.39	0	0	.	.	.
metG.4	0	0	.	.	.
metG.40	0	0	.	.	.
metG.41	0	0	.	.	.
metG.42	0	0	.	.	.
metG.43	0	0	.	.	.
metG.44	0	0	.	.	.
metG.45	0	0	.	.	.
metG.46	0	0	.	.	.
metG.47	0	0	.	.	.
metG.48	0	0	.	.	.
metG.49	0	0	.	.	.
metG.5	0	0	.	.	.
metG.50	0	0	.	.	.
metG.51	0	0	.	.	.
metG.52	0	0	.	.	.
metG.53	0	0	.	.	.
metG.54	0	0	.	.	.
metG.55	0	0	.	.	.
metG.56	0	0	.	.	.
metG.57	0	0	.	.	.
metG.58	0	0	.	.	.
metG.59	0	0	.	.	.
metG.6	0	0	.	.	.
metG.60	0	0	.	.	.
metG.61	0	0	.	.	.
metG.62	0	0	.	.	.
metG.63	0	0	.	.	.
metG.64	0	0	.	.	.
metG.65	0	0	.	.	.
metG.66	0	0	.	.	.
metG.67	0	0	.	.	.
metG.68	0	0	.	.	.
metG.69	0	0	.	.	.
metG.7	0	0	.	.	.
metG.70	0	0	.	.	.
metG.71	0	0	.	.	.
metG.72	0	0	.	.	.
metG.73	0	0	.	.	.
metG.74	0	0	.	.	.
metG.75	0	0	.	.	.
metG.76	0	0	.	.	.
metG.77	0	0	.	.	.
metG.78	0	0	.	.	.
metG.79	0	0	.	.	.
metG.8	0	0	.	.	.
metG.80	0	0	.	.	.
metG.81	0	0	.	.	.
metG.82	0	0	.	.	.
metG.83	0	0	.	.	.
metG.84	0	0	.	.	.
metG.85	0	0	.	.	.
metG.86	0	0	.	.	.
metG.87	0	0	.	.	.
metG.88	0	0	.	.	.
metG.89	0	0	.	.	.
metG.9	0	0	.	.	.
metG.90	0	0	.	.	.
metG.91	0	0	.	.	.
metG.92	0	0	.	.	.
metG.93	0	0	.	.	.
metG.94	0	0	.	.	.
metG.95	0	0	.	.	.
metG.96	0	0	.	.	.
metG.97	0	0	.	.	.
metG.98	0	0	.	.	.
metG.99	0	0	.	.	.
pntA.1	0	0	.	.	.
pntA.10	0	0	.	.	.
pntA.100	0	0	.	.	.
pntA.101	0	0	.	.	.
pntA.102	0	0	.	.	.
pntA.103	0	0	.	.	.
pntA.104	0	0	.	.	.
pntA.105	0	0	.	.	.
pntA.106	0	0	.	.	.
pntA.107	0	0	.	.	.
pntA.108	0	0	.	.	.
pntA.109	0	0	.	.	.
pntA.11	0	0	.	.	.
pntA.110	0	0	.	.	.
pntA.111	0	0	.	.	.
pntA.112	0	0	.	.	.
pntA.113	0	0	.	.	.
pntA.114	0	0	.	.	.
pntA.115	0	0	.	.	.
pntA.116	0	0	.	.	.
pntA.12	0	0	.	.	.
pntA.13	0	0	.	.	.
pntA.14	0	0	.	.	.
pntA.15	0	0	.	.	.
pntA.16	0	0	.	.	.
pntA.17	0	0	.	.	.
pntA.18	0	0	.	.	.
pntA.19	0	0	.	.	.
pntA.2	0	0	.	.	.
pntA.20	0	0	.	.	.
pntA.21	0	0	.	.	.
pntA.22	0	0	.	.	.
pntA.23	0	0	.	.	.
pntA.24	0	0	.	.	.
pntA.25	0	0	.	.	.
pntA.26	0	0	.	.	.
pntA.27	0	0	.	.	.
pntA.28	0	0	.	.	.
pntA.29	0	0	.	.	.
pntA.3	0	0	.	.	.
pntA.30	0	0	.	.	.
pntA.31	0	0	.	.	.
pntA.32	0	0	.	.	.
pntA.33	0	0	.	.	.
pntA.34	0	0	.	.	.
pntA.35	0	0	.	.	.
pntA.36	0	0	.	.	.
pntA.37	0	0	.	.	.
pntA.38	0	0	.	.	.
pntA.39	0	0	.	.	.
pntA.4	0	0	.	.	.
pntA.40	0	0	.	.	.
pntA.41	0	0	.	.	.
pntA.42	0	0	.	.	.
pntA.43	0	0	.	.	.
pntA.44	0	0	.	.	.
pntA.45	0	0	.	.	.
pntA.46	0	0	.	.	.
pntA.47	0	0	.	.	.
pntA.48	0	0	.	.	.
pntA.49	0	0	.	.	.
pntA.5	0	0	.	.	.
pntA.50	0	0	.	.	.
pntA.51	0	0	.	.	.
pntA.52	0	0	.	.	.
pntA.53	0	0	.	.	.
pntA.54	0	0	.	.	.
pntA.55	0	0	.	.	.
pntA.56	0	0	.	.	.
pntA.57	0	0	.	.	.
pntA.58	0	0	.	.	.
pntA.59	0	0	.	.	.
pntA.6	0	0	.	.	.
pntA.60	0	0	.	.	.
pntA.61	0	0	.	.	.
pntA.62	0	0	.	.	.
pntA.63	0	0	.	.	.
pntA.64	0	0	.	.	.
pntA.65	0	0	.	.	.
pntA.66	0	0	.	.	.
pntA.67	0	0	.	.	.
pntA.68	0	0	.	.	.
pntA.69	0	0	.	.	.
pntA.7	0	0	.	.	.
pntA.70	0	0	.	.	.
pntA.71	0	0	.	.	.
pntA.72	0	0	.	.	.
pntA.73	0	0	.	.	.
pntA.74	0	0	.	.	.
pntA.75	0	0	.	.	.
pntA.76	0	0	.	.	.
pntA.77	0	0	.	.	.
pntA.78	0	0	.	.	.
pntA.79	0	0	.	.	.
pntA.8	0	0	.	.	.
pntA.80	0	0	.	.	.
pntA.81	0	0	.	.	.
pntA.82	0	0	.	.	.
pntA.83	0	0	.	.	.
pntA.84	0	0	.	.	.
pntA.85	0	0	.	.	.
pntA.86	0	0	.	.	.
pntA.87	0	0	.	.	.
pntA.88	0	0	.	.	.
pntA.89	0	0	.	.	.
pntA.9	0	0	.	.	.
pntA.90	0	0	.	.	.
pntA.91	0	0	.	.	.
pntA.92	0	0	.	.	.
pntA.93	0	0	.	.	.
pntA.94	0	0	.	.	.
pntA.95	0	0	.	.	.
pntA.96	0	0	.	.	.
pntA.97	0	0	.	.	.
pntA.98	0	0	.	.	.
pntA.99	0	0	.	.	.
purM.1	0	0	.	.	.
purM.10	0	0	.	.	.
purM.11	0	0	.	.	.
purM.12	0	0	.	.	.
purM.13	0	0	.	.	.
purM.14	0	0	.	.	.
purM.15	0	0	.	.	.
purM.16	0	0	.	.	.
purM.17	0	0	.	.	.
purM.18	0	0	.	.	.
purM.19	0	0	.	.	.
purM.2	0	0	.	.	.
purM.20	0	0	.	.	.
purM.21	0	0	.	.	.
purM.22	0	0	.	.	.
purM.23	0	0	.	.	.
purM.24	0	0	.	.	.
purM.25	0	0	.	.	.
purM.26	0	0	.	.	.
purM.27	0	0	.	.	.
purM.28	0	0	.	.	.
purM.29	0	0	.	.	.
purM.3	0	0	.	.	.
purM.30	0	0	.	.	.
purM.31	0	0	.	.	.
purM.32	0	0	.	.	.
purM.33	0	0	.	.	.
purM.34	0	0	.	.	.
purM.35	0	0	.	.	.
purM.36	0	0	.	.	.
purM.37	0	0	.	.	.
purM.38	0	0	.	.	.
purM.39	0	0	.	.	.
purM.4	0	0	.	.	.
purM.40	0	0	.	.	.
purM.41	0	0	.	.	.
purM.42	0	0	.	.	.
purM.43	0	0	.	.	.
purM.44	0	0	.	.	.
purM.45	0	0	.	.	.
purM.46	0	0	.	.	.
purM.47	0	0	.	.	.
purM.48	0	0	.	.	.
purM.49	0	0	.	.	.
purM.5	0	0	.	.	.
purM.50	0	0	.	.	.
purM.51	0	0	.	.	.
purM.52	0	0	.	.	.
purM.53	0	0	.	.	.
purM.54	0	0	.	.	.
purM.55	0	0	.	.	.
purM.56	0	0	.	.	.
purM.57	0	0	.	.	.
purM.58	0	0	.	.	.
purM.59	0	0	.	.	.
purM.6	0	0	.	.	.
purM.60	0	0	.	.	.
purM.61	0	0	.	.	.
purM.62	0	0	.	.	.
purM.63	0	0	.	.	.
purM.64	0	0	.	.	.
purM.65	0	0	.	.	.
purM.66	0	0	.	.	.
purM.67	0	0	.	.	.
purM.68	0	0	.	.	.
purM.69	0	0	.	.	.
purM.7	0	0	.	.	.
purM.70	0	0	.	.	.
purM.71	0	0	.	.	.
purM.72	0	0	.	.	.
purM.73	0	0	.	.	.
purM.74	0	0	.	.	.
purM.75	0	0	.	.	.
purM.76	0	0	.	.	.
purM.77	0	0	.	.	.
purM.78	0	0	.	.	.
purM.79	0	0	.	.	.
purM.8	0	0	.	.	.
purM.80	0	0	.	.	.
purM.81	0	0	.	.	.
purM.82	0	0	.	.	.
purM.83	0	0	.	.	.
purM.84	0	0	.	.	.
purM.85	0	0	.	.	.
purM.86	0	0	.	.	.
purM.87	0	0	.	.	.
purM.88	0	0	.	.	.
purM.89	0	0	.	.	.
purM.9	0	0	.	.	.
purM.90	0	0	.	.	.
purM.91	0	0	.	.	.
purM.92	0	0	.	.	.
pyrC.1	0	0	.	.	.
pyrC.10	0	0	.	.	.
pyrC.100	0	0	.	.	.
pyrC.101	0	0	.	.	.
pyrC.102	0	0	.	.	.
pyrC.103	0	0	.	.	.
pyrC.104	0	0	.	.	.
pyrC.105	0	0	.	.	.
pyrC.106	0	0	.	.	.
pyrC.107	0	0	.	.	.
pyrC.108	0	0	.	.	.
pyrC.109	0	0	.	.	.
pyrC.11	0	0	.	.	.
pyrC.110	0	0	.	.	.
pyrC.111	0	0	.	.	.
pyrC.112	0	0	.	.	.
pyrC.113	0	0	.	.	.
pyrC.114	0	0	.	.	.
pyrC.115	0	0	.	.	.
pyrC.116	0	0	.	.	.
pyrC.117	0	0	.	.	.
pyrC.118	0	0	.	.	.
pyrC.119	0	0	.	.	.
pyrC.12	0	0	.	.	.
pyrC.120	0	0	.	.	.
pyrC.121	0	0	.	.	.
pyrC.122	0	0	.	.	.
pyrC.123	0	0	.	.	.
pyrC.124	0	0	.	.	.
pyrC.125	0	0	.	.	.
pyrC.126	0	0	.	.	.
pyrC.127	0	0	.	.	.
pyrC.128	0	0	.	.	.
pyrC.129	0	0	.	.	.
pyrC.13	0	0	.	.	.
pyrC.130	0	0	.	.	.
pyrC.131	0	0	.	.	.
pyrC.132	0	0	.	.	.
pyrC.133	0	0	.	.	.
pyrC.134	0	0	.	.	.
pyrC.135	0	0	.	.	.
pyrC.136	0	0	.	.	.
pyrC.137	0	0	.	.	.
pyrC.138	0	0	.	.	.
pyrC.139	0	0	.	.	.
pyrC.14	0	0	.	.	.
pyrC.140	0	0	.	.	.
pyrC.141	0	0	.	.	.
pyrC.142	0	0	.	.	.
pyrC.143	0	0	.	.	.
pyrC.144	0	0	.	.	.
pyrC.145	0	0	.	.	.
pyrC.146	0	0	.	.	.
pyrC.147	0	0	.	.	.
pyrC.149	0	0	.	.	.
pyrC.15	0	0	.	.	.
pyrC.150	0	0	.	.	.
pyrC.154	0	0	.	.	.
pyrC.155	0	0	.	.	.
pyrC.156	0	0	.	.	.
pyrC.158	0	0	.	.	.
pyrC.16	0	0	.	.	.
pyrC.17	0	0	.	.	.
pyrC.18	0	0	.	.	.
pyrC.19	0	0	.	.	.
pyrC.2	0	0	.	.	.
pyrC.20	0	0	.	.	.
pyrC.21	0	0	.	.	.
pyrC.22	0	0	.	.	.
pyrC.23	0	0	.	.	.
pyrC.24	0	0	.	.	.
pyrC.25	0	0	.	.	.
pyrC.26	0	0	.	.	.
pyrC.27	0	0	.	.	.
pyrC.28	0	0	.	.	.
pyrC.29	0	0	.	.	.
pyrC.3	0	0	.	.	.
pyrC.30	0	0	.	.	.
pyrC.31	0	0	.	.	.
pyrC.32	0	0	.	.	.
pyrC.33	0	0	.	.	.
pyrC.34	0	0	.	.	.
pyrC.35	0	0	.	.	.
pyrC.36	0	0	.	.	.
pyrC.37	0	0	.	.	.
pyrC.38	0	0	.	.	.
pyrC.39	0	0	.	.	.
pyrC.4	0	0	.	.	.
pyrC.40	0	0	.	.	.
pyrC.41	0	0	.	.	.
pyrC.42	0	0	.	.	.
pyrC.43	0	0	.	.	.
pyrC.44	0	0	.	.	.
pyrC.45	0	0	.	.	.
pyrC.46	0	0	.	.	.
pyrC.47	0	0	.	.	.
pyrC.48	0	0	.	.	.
pyrC.49	0	0	.	.	.
pyrC.5	0	0	.	.	.
pyrC.50	0	0	.	.	.
pyrC.51	0	0	.	.	.
pyrC.52	0	0	.	.	.
pyrC.53	0	0	.	.	.
pyrC.54	0	0	.	.	.
pyrC.55	0	0	.	.	.
pyrC.56	0	0	.	.	.
pyrC.57	0	0	.	.	.
pyrC.58	0	0	.	.	.
pyrC.59	0	0	.	.	.
pyrC.6	0	0	.	.	.
pyrC.60	0	0	.	.	.
pyrC.61	0	0	.	.	.
pyrC.62	0	0	.	.	.
pyrC.63	0	0	.	.	.
pyrC.64	0	0	.	.	.
pyrC.65	0	0	.	.	.
pyrC.66	0	0	.	.	.
pyrC.67	0	0	.	.	.
pyrC.68	0	0	.	.	.
pyrC.69	0	0	.	.	.
pyrC.7	0	0	.	.	.
pyrC.70	0	0	.	.	.
pyrC.71	0	0	.	.	.
pyrC.72	0	0	.	.	.
pyrC.73	0	0	.	.	.
pyrC.74	0	0	.	.	.
pyrC.75	0	0	.	.	.
pyrC.76	0	0	.	.	.
pyrC.77	0	0	.	.	.
pyrC.78	0	0	.	.	.
pyrC.79	0	0	.	.	.
pyrC.8	0	0	.	.	.
pyrC.80	0	0	.	.	.
pyrC.81	0	0	.	.	.
pyrC.82	0	0	.	.	.
pyrC.83	0	0	.	.	.
pyrC.84	0	0	.	.	.
pyrC.85	0	0	.	.	.
pyrC.86	0	0	.	.	.
pyrC.87	0	0	.	.	.
pyrC.88	0	0	.	.	.
pyrC.89	0	0	.	.	.
pyrC.9	0	0	.	.	.
pyrC.90	0	0	.	.	.
pyrC.91	0	0	.	.	.
pyrC.92	0	0	.	.	.
pyrC.93	0	0	.	.	.
pyrC.94	0	0	.	.	.
pyrC.95	0	0	.	.	.
pyrC.96	0	0	.	.	.
pyrC.97	0	0	.	.	.
pyrC.98	0	0	.	.	.
pyrC.99	0	0	.	.	.
tnaA.1	0	0	.	.	.
tnaA.10	0	0	.	.	.
tnaA.100	0	0	.	.	.
tnaA.101	0	0	.	.	.
tnaA.102	0	0	.	.	.
tnaA.103	0	0	.	.	.
tnaA.104	0	0	.	.	.
tnaA.105	0	0	.	.	.
tnaA.106	0	0	.	.	.
tnaA.107	0	0	.	.	.
tnaA.108	0	0	.	.	.
tnaA.109	0	0	.	.	.
tnaA.11	0	0	.	.	.
tnaA.110	0	0	.	.	.
tnaA.111	0	0	.	.	.
tnaA.112	0	0	.	.	.
tnaA.113	0	0	.	.	.
tnaA.114	0	0	.	.	.
tnaA.115	0	0	.	.	.
tnaA.116	0	0	.	.	.
tnaA.117	0	0	.	.	.
tnaA.118	0	0	.	.	.
tnaA.119	0	0	.	.	.
tnaA.12	0	0	.	.	.
tnaA.120	0	0	.	.	.
tnaA.121	0	0	.	.	.
tnaA.122	0	0	.	.	.
tnaA.123	0	0	.	.	.
tnaA.124	0	0	.	.	.
tnaA.125	0	0	.	.	.
tnaA.126	0	0	.	.	.
tnaA.127	0	0	.	.	.
tnaA.128	0	0	.	.	.
tnaA.129	0	0	.	.	.
tnaA.13	0	0	.	.	.
tnaA.130	0	0	.	.	.
tnaA.131	0	0	.	.	.
tnaA.132	0	0	.	.	.
tnaA.133	0	0	.	.	.
tnaA.134	0	0	.	.	.
tnaA.135	0	0	.	.	.
tnaA.136	0	0	.	.	.
tnaA.137	0	0	.	.	.
tnaA.138	0	0	.	.	.
tnaA.139	0	0	.	.	.
tnaA.14	0	0	.	.	.
tnaA.140	0	0	.	.	.
tnaA.141	0	0	.	.	.
tnaA.142	0	0	.	.	.
tnaA.144	0	0	.	.	.
tnaA.145	0	0	.	.	.
tnaA.146	0	0	.	.	.
tnaA.147	0	0	.	.	.
tnaA.148	0	0	.	.	.
tnaA.149	0	0	.	.	.
tnaA.15	0	0	.	.	.
tnaA.150	0	0	.	.	.
tnaA.151	0	0	.	.	.
tnaA.152	0	0	.	.	.
tnaA.153	0	0	.	.	.
tnaA.154	0	0	.	.	.
tnaA.16	0	0	.	.	.
tnaA.17	0	0	.	.	.
tnaA.18	0	0	.	.	.
tnaA.19	0	0	.	.	.
tnaA.2	0	0	.	.	.
tnaA.20	0	0	.	.	.
tnaA.21	0	0	.	.	.
tnaA.22	0	0	.	.	.
tnaA.23	0	0	.	.	.
tnaA.24	0	0	.	.	.
tnaA.25	0	0	.	.	.
tnaA.26	0	0	.	.	.
tnaA.27	0	0	.	.	.
tnaA.28	0	0	.	.	.
tnaA.29	0	0	.	.	.
tnaA.3	0	0	.	.	.
tnaA.30	0	0	.	.	.
tnaA.31	0	0	.	.	.
tnaA.32	0	0	.	.	.
tnaA.33	0	0	.	.	.
tnaA.34	0	0	.	.	.
tnaA.35	0	0	.	.	.
tnaA.36	0	0	.	.	.
tnaA.37	0	0	.	.	.
tnaA.38	0	0	.	.	.
tnaA.39	0	0	.	.	.
tnaA.4	0	0	.	.	.
tnaA.40	0	0	.	.	.
tnaA.41	0	0	.	.	.
tnaA.42	0	0	.	.	.
tnaA.43	0	0	.	.	.
tnaA.44	0	0	.	.	.
tnaA.45	0	0	.	.	.
tnaA.46	0	0	.	.	.
tnaA.47	0	0	.	.	.
tnaA.48	0	0	.	.	.
tnaA.49	0	0	.	.	.
tnaA.5	0	0	.	.	.
tnaA.50	0	0	.	.	.
tnaA.51	0	0	.	.	.
tnaA.52	0	0	.	.	.
tnaA.53	0	0	.	.	.
tnaA.54	0	0	.	.	.
tnaA.55	0	0	.	.	.
tnaA.56	0	0	.	.	.
tnaA.57	0	0	.	.	.
tnaA.58	0	0	.	.	.
tnaA.59	0	0	.	.	.
tnaA.6	0	0	.	.	.
tnaA.60	0	0	.	.	.
tnaA.61	0	0	.	.	.
tnaA.62	0	0	.	.	.
tnaA.63	0	0	.	.	.
tnaA.64	0	0	.	.	.
tnaA.65	0	0	.	.	.
tnaA.66	0	0	.	.	.
tnaA.67	0	0	.	.	.
tnaA.68	0	0	.	.	.
tnaA.69	0	0	.	.	.
tnaA.7	0	0	.	.	.
tnaA.70	0	0	.	.	.
tnaA.71	0	0	.	.	.
tnaA.72	0	0	.	.	.
tnaA.73	0	0	.	.	.
tnaA.74	0	0	.	.	.
tnaA.75	0	0	.	.	.
tnaA.76	0	0	.	.	.
tnaA.77	0	0	.	.	.
tnaA.78	0	0	.	.	.
tnaA.79	0	0	.	.	.
tnaA.8	0	0	.	.	.
tnaA.80	0	0	.	.	.
tnaA.81	0	0	.	.	.
tnaA.82	0	0	.	.	.
tnaA.83	0	0	.	.	.
tnaA.84	0	0	.	.	.
tnaA.85	0	0	.	.	.
tnaA.86	0	0	.	.	.
tnaA.87	0	0	.	.	.
tnaA.88	0	0	.	.	.
tnaA.89	0	0	.	.	.
tnaA.9	0	0	.	.	.
tnaA.90	0	0	.	.	.
tnaA.91	0	0	.	.	.
tnaA.92	0	0	.	.	.
tnaA.93	0	0	.	.	.
tnaA.94	0	0	.	.	.
tnaA.95	0	0	.	.	.
tnaA.96	0	0	.	.	.
tnaA.97	0	0	.	.	.
tnaA.98	0	0	.	.	.
tnaA.99	0	0	.	.	.
