Bha_adh	Bha_adh.1	Bha_adh.10	Bha_adh.11	Bha_adh.2	Bha_adh.3	Bha_adh.4	Bha_adh.5	Bha_adh.6	Bha_adh.7	Bha_adh.8	Bha_adh.9
Bha_est	Bha_est.1	Bha_est.10	Bha_est.11	Bha_est.2	Bha_est.3	Bha_est.4	Bha_est.5	Bha_est.6	Bha_est.7	Bha_est.8	Bha_est.9
Bha_gdh	Bha_gdh.1	Bha_gdh.10	Bha_gdh.11	Bha_gdh.2	Bha_gdh.3	Bha_gdh.4	Bha_gdh.5	Bha_gdh.6	Bha_gdh.7	Bha_gdh.8	Bha_gdh.9
Bha_glpK	Bha_glpK.1	Bha_glpK.10	Bha_glpK.11	Bha_glpK.12	Bha_glpK.13	Bha_glpK.14	Bha_glpK.2	Bha_glpK.3	Bha_glpK.4	Bha_glpK.5	Bha_glpK.6	Bha_glpK.7	Bha_glpK.8	Bha_glpK.9
Bha_pgm	Bha_pgm.1	Bha_pgm.10	Bha_pgm.11	Bha_pgm.12	Bha_pgm.13	Bha_pgm.14	Bha_pgm.2	Bha_pgm.3	Bha_pgm.4	Bha_pgm.5	Bha_pgm.6	Bha_pgm.7	Bha_pgm.8	Bha_pgm.9
Bha_thi	Bha_thi.1	Bha_thi.10	Bha_thi.11	Bha_thi.12	Bha_thi.13	Bha_thi.2	Bha_thi.3	Bha_thi.4	Bha_thi.5	Bha_thi.6	Bha_thi.7	Bha_thi.8	Bha_thi.9
