adk	adk.1	adk.10	adk.11	adk.12	adk.13	adk.14	adk.15	adk.16	adk.17	adk.18	adk.19	adk.2	adk.20	adk.21	adk.22	adk.23	adk.24	adk.25	adk.3	adk.4	adk.5	adk.6	adk.7	adk.8	adk.9
aroE	aroE.1	aroE.10	aroE.11	aroE.12	aroE.13	aroE.14	aroE.15	aroE.16	aroE.17	aroE.18	aroE.19	aroE.2	aroE.20	aroE.21	aroE.22	aroE.23	aroE.24	aroE.25	aroE.26	aroE.27	aroE.3	aroE.4	aroE.5	aroE.6	aroE.7	aroE.8	aroE.9
fumC	fumC.1	fumC.10	fumC.11	fumC.12	fumC.13	fumC.14	fumC.15	fumC.16	fumC.17	fumC.18	fumC.19	fumC.2	fumC.20	fumC.21	fumC.22	fumC.23	fumC.24	fumC.25	fumC.26	fumC.3	fumC.4	fumC.5	fumC.6	fumC.7	fumC.8	fumC.9
gdhA	gdhA.1	gdhA.10	gdhA.11	gdhA.12	gdhA.13	gdhA.14	gdhA.15	gdhA.16	gdhA.17	gdhA.18	gdhA.19	gdhA.2	gdhA.20	gdhA.21	gdhA.22	gdhA.23	gdhA.24	gdhA.3	gdhA.4	gdhA.5	gdhA.6	gdhA.7	gdhA.8	gdhA.9
mdh	mdh.1	mdh.10	mdh.11	mdh.12	mdh.13	mdh.14	mdh.15	mdh.16	mdh.17	mdh.18	mdh.19	mdh.2	mdh.20	mdh.21	mdh.22	mdh.23	mdh.3	mdh.4	mdh.5	mdh.6	mdh.7	mdh.8	mdh.9
pgi	pgi.1	pgi.10	pgi.11	pgi.12	pgi.13	pgi.14	pgi.15	pgi.16	pgi.17	pgi.18	pgi.19	pgi.2	pgi.20	pgi.21	pgi.22	pgi.23	pgi.24	pgi.25	pgi.26	pgi.3	pgi.4	pgi.5	pgi.6	pgi.7	pgi.8	pgi.9
pmi	pmi.1	pmi.10	pmi.11	pmi.12	pmi.13	pmi.14	pmi.15	pmi.16	pmi.17	pmi.18	pmi.19	pmi.2	pmi.20	pmi.21	pmi.22	pmi.23	pmi.24	pmi.25	pmi.3	pmi.4	pmi.5	pmi.6	pmi.7	pmi.8	pmi.9
