adk.1	0	0	.	.	.
adk.10	0	0	.	.	.
adk.11	0	0	.	.	.
adk.12	0	0	.	.	.
adk.13	0	0	.	.	.
adk.14	0	0	.	.	.
adk.15	0	0	.	.	.
adk.16	0	0	.	.	.
adk.17	0	0	.	.	.
adk.18	0	0	.	.	.
adk.19	0	0	.	.	.
adk.2	0	0	.	.	.
adk.20	0	0	.	.	.
adk.21	0	0	.	.	.
adk.22	0	0	.	.	.
adk.23	0	0	.	.	.
adk.24	0	0	.	.	.
adk.25	0	0	.	.	.
adk.3	0	0	.	.	.
adk.4	0	0	.	.	.
adk.5	0	0	.	.	.
adk.6	0	0	.	.	.
adk.7	0	0	.	.	.
adk.8	0	0	.	.	.
adk.9	0	0	.	.	.
aroE.1	0	0	.	.	.
aroE.10	0	0	.	.	.
aroE.11	0	0	.	.	.
aroE.12	0	0	.	.	.
aroE.13	0	0	.	.	.
aroE.14	0	0	.	.	.
aroE.15	0	0	.	.	.
aroE.16	0	0	.	.	.
aroE.17	0	0	.	.	.
aroE.18	0	0	.	.	.
aroE.19	0	0	.	.	.
aroE.2	0	0	.	.	.
aroE.20	0	0	.	.	.
aroE.21	0	0	.	.	.
aroE.22	0	0	.	.	.
aroE.23	0	0	.	.	.
aroE.24	0	0	.	.	.
aroE.25	0	0	.	.	.
aroE.26	0	0	.	.	.
aroE.27	0	0	.	.	.
aroE.3	0	0	.	.	.
aroE.4	0	0	.	.	.
aroE.5	0	0	.	.	.
aroE.6	0	0	.	.	.
aroE.7	0	0	.	.	.
aroE.8	0	0	.	.	.
aroE.9	0	0	.	.	.
fumC.1	0	0	.	.	.
fumC.10	0	0	.	.	.
fumC.11	0	0	.	.	.
fumC.12	0	0	.	.	.
fumC.13	0	0	.	.	.
fumC.14	0	0	.	.	.
fumC.15	0	0	.	.	.
fumC.16	0	0	.	.	.
fumC.17	0	0	.	.	.
fumC.18	0	0	.	.	.
fumC.19	0	0	.	.	.
fumC.2	0	0	.	.	.
fumC.20	0	0	.	.	.
fumC.21	0	0	.	.	.
fumC.22	0	0	.	.	.
fumC.23	0	0	.	.	.
fumC.24	0	0	.	.	.
fumC.25	0	0	.	.	.
fumC.26	0	0	.	.	.
fumC.3	0	0	.	.	.
fumC.4	0	0	.	.	.
fumC.5	0	0	.	.	.
fumC.6	0	0	.	.	.
fumC.7	0	0	.	.	.
fumC.8	0	0	.	.	.
fumC.9	0	0	.	.	.
gdhA.1	0	0	.	.	.
gdhA.10	0	0	.	.	.
gdhA.11	0	0	.	.	.
gdhA.12	0	0	.	.	.
gdhA.13	0	0	.	.	.
gdhA.14	0	0	.	.	.
gdhA.15	0	0	.	.	.
gdhA.16	0	0	.	.	.
gdhA.17	0	0	.	.	.
gdhA.18	0	0	.	.	.
gdhA.19	0	0	.	.	.
gdhA.2	0	0	.	.	.
gdhA.20	0	0	.	.	.
gdhA.21	0	0	.	.	.
gdhA.22	0	0	.	.	.
gdhA.23	0	0	.	.	.
gdhA.24	0	0	.	.	.
gdhA.3	0	0	.	.	.
gdhA.4	0	0	.	.	.
gdhA.5	0	0	.	.	.
gdhA.6	0	0	.	.	.
gdhA.7	0	0	.	.	.
gdhA.8	0	0	.	.	.
gdhA.9	0	0	.	.	.
mdh.1	0	0	.	.	.
mdh.10	0	0	.	.	.
mdh.11	0	0	.	.	.
mdh.12	0	0	.	.	.
mdh.13	0	0	.	.	.
mdh.14	0	0	.	.	.
mdh.15	0	0	.	.	.
mdh.16	0	0	.	.	.
mdh.17	0	0	.	.	.
mdh.18	0	0	.	.	.
mdh.19	0	0	.	.	.
mdh.2	0	0	.	.	.
mdh.20	0	0	.	.	.
mdh.21	0	0	.	.	.
mdh.22	0	0	.	.	.
mdh.23	0	0	.	.	.
mdh.3	0	0	.	.	.
mdh.4	0	0	.	.	.
mdh.5	0	0	.	.	.
mdh.6	0	0	.	.	.
mdh.7	0	0	.	.	.
mdh.8	0	0	.	.	.
mdh.9	0	0	.	.	.
pgi.1	0	0	.	.	.
pgi.10	0	0	.	.	.
pgi.11	0	0	.	.	.
pgi.12	0	0	.	.	.
pgi.13	0	0	.	.	.
pgi.14	0	0	.	.	.
pgi.15	0	0	.	.	.
pgi.16	0	0	.	.	.
pgi.17	0	0	.	.	.
pgi.18	0	0	.	.	.
pgi.19	0	0	.	.	.
pgi.2	0	0	.	.	.
pgi.20	0	0	.	.	.
pgi.21	0	0	.	.	.
pgi.22	0	0	.	.	.
pgi.23	0	0	.	.	.
pgi.24	0	0	.	.	.
pgi.25	0	0	.	.	.
pgi.26	0	0	.	.	.
pgi.3	0	0	.	.	.
pgi.4	0	0	.	.	.
pgi.5	0	0	.	.	.
pgi.6	0	0	.	.	.
pgi.7	0	0	.	.	.
pgi.8	0	0	.	.	.
pgi.9	0	0	.	.	.
pmi.1	0	0	.	.	.
pmi.10	0	0	.	.	.
pmi.11	0	0	.	.	.
pmi.12	0	0	.	.	.
pmi.13	0	0	.	.	.
pmi.14	0	0	.	.	.
pmi.15	0	0	.	.	.
pmi.16	0	0	.	.	.
pmi.17	0	0	.	.	.
pmi.18	0	0	.	.	.
pmi.19	0	0	.	.	.
pmi.2	0	0	.	.	.
pmi.20	0	0	.	.	.
pmi.21	0	0	.	.	.
pmi.22	0	0	.	.	.
pmi.23	0	0	.	.	.
pmi.24	0	0	.	.	.
pmi.25	0	0	.	.	.
pmi.3	0	0	.	.	.
pmi.4	0	0	.	.	.
pmi.5	0	0	.	.	.
pmi.6	0	0	.	.	.
pmi.7	0	0	.	.	.
pmi.8	0	0	.	.	.
pmi.9	0	0	.	.	.
