aroE.1	0	0	.	.	.
aroE.10	0	0	.	.	.
aroE.11	0	0	.	.	.
aroE.12	0	0	.	.	.
aroE.13	0	0	.	.	.
aroE.14	0	0	.	.	.
aroE.15	0	0	.	.	.
aroE.16	0	0	.	.	.
aroE.17	0	0	.	.	.
aroE.18	0	0	.	.	.
aroE.19	0	0	.	.	.
aroE.2	0	0	.	.	.
aroE.20	0	0	.	.	.
aroE.21	0	0	.	.	.
aroE.22	0	0	.	.	.
aroE.23	0	0	.	.	.
aroE.24	0	0	.	.	.
aroE.25	0	0	.	.	.
aroE.3	0	0	.	.	.
aroE.4	0	0	.	.	.
aroE.5	0	0	.	.	.
aroE.6	0	0	.	.	.
aroE.7	0	0	.	.	.
aroE.8	0	0	.	.	.
aroE.9	0	0	.	.	.
atpD.1	0	0	.	.	.
atpD.10	0	0	.	.	.
atpD.11	0	0	.	.	.
atpD.12	0	0	.	.	.
atpD.13	0	0	.	.	.
atpD.14	0	0	.	.	.
atpD.15	0	0	.	.	.
atpD.16	0	0	.	.	.
atpD.17	0	0	.	.	.
atpD.18	0	0	.	.	.
atpD.2	0	0	.	.	.
atpD.3	0	0	.	.	.
atpD.4	0	0	.	.	.
atpD.5	0	0	.	.	.
atpD.6	0	0	.	.	.
atpD.7	0	0	.	.	.
atpD.8	0	0	.	.	.
atpD.9	0	0	.	.	.
gmk.1	0	0	.	.	.
gmk.10	0	0	.	.	.
gmk.11	0	0	.	.	.
gmk.12	0	0	.	.	.
gmk.13	0	0	.	.	.
gmk.14	0	0	.	.	.
gmk.15	0	0	.	.	.
gmk.16	0	0	.	.	.
gmk.17	0	0	.	.	.
gmk.2	0	0	.	.	.
gmk.3	0	0	.	.	.
gmk.4	0	0	.	.	.
gmk.5	0	0	.	.	.
gmk.6	0	0	.	.	.
gmk.7	0	0	.	.	.
gmk.8	0	0	.	.	.
gmk.9	0	0	.	.	.
guaA.1	0	0	.	.	.
guaA.10	0	0	.	.	.
guaA.11	0	0	.	.	.
guaA.12	0	0	.	.	.
guaA.13	0	0	.	.	.
guaA.14	0	0	.	.	.
guaA.15	0	0	.	.	.
guaA.16	0	0	.	.	.
guaA.17	0	0	.	.	.
guaA.18	0	0	.	.	.
guaA.19	0	0	.	.	.
guaA.2	0	0	.	.	.
guaA.20	0	0	.	.	.
guaA.21	0	0	.	.	.
guaA.3	0	0	.	.	.
guaA.4	0	0	.	.	.
guaA.5	0	0	.	.	.
guaA.6	0	0	.	.	.
guaA.7	0	0	.	.	.
guaA.8	0	0	.	.	.
guaA.9	0	0	.	.	.
lepA.1	0	0	.	.	.
lepA.10	0	0	.	.	.
lepA.11	0	0	.	.	.
lepA.12	0	0	.	.	.
lepA.13	0	0	.	.	.
lepA.14	0	0	.	.	.
lepA.15	0	0	.	.	.
lepA.2	0	0	.	.	.
lepA.3	0	0	.	.	.
lepA.4	0	0	.	.	.
lepA.5	0	0	.	.	.
lepA.6	0	0	.	.	.
lepA.7	0	0	.	.	.
lepA.8	0	0	.	.	.
lepA.9	0	0	.	.	.
sodA.1	0	0	.	.	.
sodA.10	0	0	.	.	.
sodA.11	0	0	.	.	.
sodA.12	0	0	.	.	.
sodA.13	0	0	.	.	.
sodA.14	0	0	.	.	.
sodA.15	0	0	.	.	.
sodA.16	0	0	.	.	.
sodA.17	0	0	.	.	.
sodA.18	0	0	.	.	.
sodA.19	0	0	.	.	.
sodA.2	0	0	.	.	.
sodA.20	0	0	.	.	.
sodA.21	0	0	.	.	.
sodA.3	0	0	.	.	.
sodA.4	0	0	.	.	.
sodA.5	0	0	.	.	.
sodA.6	0	0	.	.	.
sodA.7	0	0	.	.	.
sodA.8	0	0	.	.	.
sodA.9	0	0	.	.	.
tly.1	0	0	.	.	.
tly.10	0	0	.	.	.
tly.11	0	0	.	.	.
tly.12	0	0	.	.	.
tly.13	0	0	.	.	.
tly.14	0	0	.	.	.
tly.15	0	0	.	.	.
tly.16	0	0	.	.	.
tly.17	0	0	.	.	.
tly.18	0	0	.	.	.
tly.19	0	0	.	.	.
tly.2	0	0	.	.	.
tly.20	0	0	.	.	.
tly.21	0	0	.	.	.
tly.22	0	0	.	.	.
tly.23	0	0	.	.	.
tly.24	0	0	.	.	.
tly.25	0	0	.	.	.
tly.26	0	0	.	.	.
tly.27	0	0	.	.	.
tly.28	0	0	.	.	.
tly.29	0	0	.	.	.
tly.3	0	0	.	.	.
tly.30	0	0	.	.	.
tly.31	0	0	.	.	.
tly.32	0	0	.	.	.
tly.33	0	0	.	.	.
tly.34	0	0	.	.	.
tly.35	0	0	.	.	.
tly.36	0	0	.	.	.
tly.37	0	0	.	.	.
tly.38	0	0	.	.	.
tly.4	0	0	.	.	.
tly.5	0	0	.	.	.
tly.6	0	0	.	.	.
tly.7	0	0	.	.	.
tly.8	0	0	.	.	.
tly.9	0	0	.	.	.
CAMP2.1	0	0	.	.	.
CAMP2.10	0	0	.	.	.
CAMP2.11	0	0	.	.	.
CAMP2.12	0	0	.	.	.
CAMP2.13	0	0	.	.	.
CAMP2.14	0	0	.	.	.
CAMP2.15	0	0	.	.	.
CAMP2.16	0	0	.	.	.
CAMP2.17	0	0	.	.	.
CAMP2.18	0	0	.	.	.
CAMP2.19	0	0	.	.	.
CAMP2.2	0	0	.	.	.
CAMP2.20	0	0	.	.	.
CAMP2.21	0	0	.	.	.
CAMP2.22	0	0	.	.	.
CAMP2.23	0	0	.	.	.
CAMP2.24	0	0	.	.	.
CAMP2.25	0	0	.	.	.
CAMP2.26	0	0	.	.	.
CAMP2.27	0	0	.	.	.
CAMP2.28	0	0	.	.	.
CAMP2.29	0	0	.	.	.
CAMP2.3	0	0	.	.	.
CAMP2.30	0	0	.	.	.
CAMP2.31	0	0	.	.	.
CAMP2.32	0	0	.	.	.
CAMP2.33	0	0	.	.	.
CAMP2.34	0	0	.	.	.
CAMP2.35	0	0	.	.	.
CAMP2.36	0	0	.	.	.
CAMP2.37	0	0	.	.	.
CAMP2.38	0	0	.	.	.
CAMP2.39	0	0	.	.	.
CAMP2.4	0	0	.	.	.
CAMP2.40	0	0	.	.	.
CAMP2.41	0	0	.	.	.
CAMP2.42	0	0	.	.	.
CAMP2.43	0	0	.	.	.
CAMP2.44	0	0	.	.	.
CAMP2.45	0	0	.	.	.
CAMP2.46	0	0	.	.	.
CAMP2.47	0	0	.	.	.
CAMP2.5	0	0	.	.	.
CAMP2.6	0	0	.	.	.
CAMP2.7	0	0	.	.	.
CAMP2.8	0	0	.	.	.
CAMP2.9	0	0	.	.	.
