dnaA.1	dnaA.10	dnaA.11	dnaA.12	dnaA.13	dnaA.14	dnaA.15	dnaA.16	dnaA.17	dnaA.18	dnaA.19	dnaA.2	dnaA.20	dnaA.21	dnaA.22	dnaA.23	dnaA.24	dnaA.25	dnaA.26	dnaA.3	dnaA.4	dnaA.5	dnaA.6	dnaA.7	dnaA.8	dnaA.9
gltX.1	gltX.10	gltX.11	gltX.12	gltX.13	gltX.14	gltX.15	gltX.16	gltX.17	gltX.18	gltX.19	gltX.2	gltX.20	gltX.3	gltX.4	gltX.5	gltX.6	gltX.7	gltX.8	gltX.9
gpsA.1	gpsA.10	gpsA.11	gpsA.12	gpsA.13	gpsA.14	gpsA.15	gpsA.16	gpsA.17	gpsA.18	gpsA.19	gpsA.2	gpsA.20	gpsA.21	gpsA.3	gpsA.4	gpsA.5	gpsA.6	gpsA.7	gpsA.8	gpsA.9
gyrB.1	gyrB.10	gyrB.11	gyrB.12	gyrB.13	gyrB.14	gyrB.15	gyrB.16	gyrB.17	gyrB.18	gyrB.19	gyrB.2	gyrB.20	gyrB.21	gyrB.22	gyrB.23	gyrB.24	gyrB.25	gyrB.26	gyrB.27	gyrB.28	gyrB.29	gyrB.3	gyrB.30	gyrB.31	gyrB.32	gyrB.33	gyrB.34	gyrB.4	gyrB.5	gyrB.6	gyrB.7	gyrB.8	gyrB.9
pta2.1	pta2.10	pta2.11	pta2.12	pta2.13	pta2.14	pta2.15	pta2.16	pta2.17	pta2.18	pta2.19	pta2.2	pta2.20	pta2.21	pta2.22	pta2.23	pta2.24	pta2.25	pta2.26	pta2.27	pta2.28	pta2.29	pta2.3	pta2.30	pta2.31	pta2.4	pta2.5	pta2.6	pta2.7	pta2.8	pta2.9
tdk.1	tdk.10	tdk.11	tdk.12	tdk.13	tdk.14	tdk.15	tdk.16	tdk.17	tdk.18	tdk.19	tdk.2	tdk.20	tdk.21	tdk.22	tdk.23	tdk.24	tdk.3	tdk.4	tdk.5	tdk.6	tdk.7	tdk.8	tdk.9
tkt.1	tkt.10	tkt.11	tkt.12	tkt.13	tkt.14	tkt.15	tkt.16	tkt.17	tkt.18	tkt.19	tkt.2	tkt.20	tkt.21	tkt.22	tkt.23	tkt.24	tkt.25	tkt.26	tkt.27	tkt.28	tkt.29	tkt.3	tkt.30	tkt.31	tkt.32	tkt.33	tkt.34	tkt.35	tkt.36	tkt.37	tkt.4	tkt.5	tkt.6	tkt.7	tkt.8	tkt.9
