dnaE.1	0	0	.	.	.
dnaE.10	0	0	.	.	.
dnaE.100	0	0	.	.	.
dnaE.101	0	0	.	.	.
dnaE.102	0	0	.	.	.
dnaE.103	0	0	.	.	.
dnaE.104	0	0	.	.	.
dnaE.105	0	0	.	.	.
dnaE.106	0	0	.	.	.
dnaE.107	0	0	.	.	.
dnaE.108	0	0	.	.	.
dnaE.109	0	0	.	.	.
dnaE.11	0	0	.	.	.
dnaE.110	0	0	.	.	.
dnaE.111	0	0	.	.	.
dnaE.112	0	0	.	.	.
dnaE.113	0	0	.	.	.
dnaE.114	0	0	.	.	.
dnaE.115	0	0	.	.	.
dnaE.116	0	0	.	.	.
dnaE.117	0	0	.	.	.
dnaE.118	0	0	.	.	.
dnaE.119	0	0	.	.	.
dnaE.12	0	0	.	.	.
dnaE.120	0	0	.	.	.
dnaE.121	0	0	.	.	.
dnaE.122	0	0	.	.	.
dnaE.123	0	0	.	.	.
dnaE.124	0	0	.	.	.
dnaE.125	0	0	.	.	.
dnaE.126	0	0	.	.	.
dnaE.127	0	0	.	.	.
dnaE.128	0	0	.	.	.
dnaE.129	0	0	.	.	.
dnaE.13	0	0	.	.	.
dnaE.130	0	0	.	.	.
dnaE.131	0	0	.	.	.
dnaE.132	0	0	.	.	.
dnaE.133	0	0	.	.	.
dnaE.134	0	0	.	.	.
dnaE.135	0	0	.	.	.
dnaE.136	0	0	.	.	.
dnaE.137	0	0	.	.	.
dnaE.138	0	0	.	.	.
dnaE.139	0	0	.	.	.
dnaE.14	0	0	.	.	.
dnaE.140	0	0	.	.	.
dnaE.141	0	0	.	.	.
dnaE.142	0	0	.	.	.
dnaE.143	0	0	.	.	.
dnaE.144	0	0	.	.	.
dnaE.145	0	0	.	.	.
dnaE.146	0	0	.	.	.
dnaE.147	0	0	.	.	.
dnaE.148	0	0	.	.	.
dnaE.149	0	0	.	.	.
dnaE.15	0	0	.	.	.
dnaE.150	0	0	.	.	.
dnaE.151	0	0	.	.	.
dnaE.152	0	0	.	.	.
dnaE.153	0	0	.	.	.
dnaE.154	0	0	.	.	.
dnaE.155	0	0	.	.	.
dnaE.156	0	0	.	.	.
dnaE.157	0	0	.	.	.
dnaE.158	0	0	.	.	.
dnaE.159	0	0	.	.	.
dnaE.16	0	0	.	.	.
dnaE.160	0	0	.	.	.
dnaE.161	0	0	.	.	.
dnaE.162	0	0	.	.	.
dnaE.163	0	0	.	.	.
dnaE.164	0	0	.	.	.
dnaE.165	0	0	.	.	.
dnaE.166	0	0	.	.	.
dnaE.167	0	0	.	.	.
dnaE.168	0	0	.	.	.
dnaE.169	0	0	.	.	.
dnaE.17	0	0	.	.	.
dnaE.170	0	0	.	.	.
dnaE.171	0	0	.	.	.
dnaE.172	0	0	.	.	.
dnaE.173	0	0	.	.	.
dnaE.174	0	0	.	.	.
dnaE.175	0	0	.	.	.
dnaE.176	0	0	.	.	.
dnaE.177	0	0	.	.	.
dnaE.178	0	0	.	.	.
dnaE.179	0	0	.	.	.
dnaE.18	0	0	.	.	.
dnaE.180	0	0	.	.	.
dnaE.181	0	0	.	.	.
dnaE.182	0	0	.	.	.
dnaE.183	0	0	.	.	.
dnaE.184	0	0	.	.	.
dnaE.185	0	0	.	.	.
dnaE.186	0	0	.	.	.
dnaE.187	0	0	.	.	.
dnaE.188	0	0	.	.	.
dnaE.189	0	0	.	.	.
dnaE.19	0	0	.	.	.
dnaE.190	0	0	.	.	.
dnaE.191	0	0	.	.	.
dnaE.192	0	0	.	.	.
dnaE.193	0	0	.	.	.
dnaE.194	0	0	.	.	.
dnaE.195	0	0	.	.	.
dnaE.196	0	0	.	.	.
dnaE.197	0	0	.	.	.
dnaE.198	0	0	.	.	.
dnaE.199	0	0	.	.	.
dnaE.2	0	0	.	.	.
dnaE.20	0	0	.	.	.
dnaE.200	0	0	.	.	.
dnaE.201	0	0	.	.	.
dnaE.202	0	0	.	.	.
dnaE.203	0	0	.	.	.
dnaE.204	0	0	.	.	.
dnaE.205	0	0	.	.	.
dnaE.206	0	0	.	.	.
dnaE.207	0	0	.	.	.
dnaE.208	0	0	.	.	.
dnaE.209	0	0	.	.	.
dnaE.21	0	0	.	.	.
dnaE.210	0	0	.	.	.
dnaE.211	0	0	.	.	.
dnaE.212	0	0	.	.	.
dnaE.213	0	0	.	.	.
dnaE.214	0	0	.	.	.
dnaE.215	0	0	.	.	.
dnaE.216	0	0	.	.	.
dnaE.217	0	0	.	.	.
dnaE.218	0	0	.	.	.
dnaE.219	0	0	.	.	.
dnaE.22	0	0	.	.	.
dnaE.220	0	0	.	.	.
dnaE.221	0	0	.	.	.
dnaE.222	0	0	.	.	.
dnaE.223	0	0	.	.	.
dnaE.224	0	0	.	.	.
dnaE.225	0	0	.	.	.
dnaE.226	0	0	.	.	.
dnaE.227	0	0	.	.	.
dnaE.228	0	0	.	.	.
dnaE.229	0	0	.	.	.
dnaE.23	0	0	.	.	.
dnaE.230	0	0	.	.	.
dnaE.231	0	0	.	.	.
dnaE.232	0	0	.	.	.
dnaE.233	0	0	.	.	.
dnaE.234	0	0	.	.	.
dnaE.235	0	0	.	.	.
dnaE.236	0	0	.	.	.
dnaE.237	0	0	.	.	.
dnaE.238	0	0	.	.	.
dnaE.239	0	0	.	.	.
dnaE.24	0	0	.	.	.
dnaE.240	0	0	.	.	.
dnaE.241	0	0	.	.	.
dnaE.242	0	0	.	.	.
dnaE.243	0	0	.	.	.
dnaE.244	0	0	.	.	.
dnaE.245	0	0	.	.	.
dnaE.246	0	0	.	.	.
dnaE.247	0	0	.	.	.
dnaE.248	0	0	.	.	.
dnaE.249	0	0	.	.	.
dnaE.25	0	0	.	.	.
dnaE.250	0	0	.	.	.
dnaE.251	0	0	.	.	.
dnaE.252	0	0	.	.	.
dnaE.253	0	0	.	.	.
dnaE.254	0	0	.	.	.
dnaE.255	0	0	.	.	.
dnaE.256	0	0	.	.	.
dnaE.257	0	0	.	.	.
dnaE.258	0	0	.	.	.
dnaE.259	0	0	.	.	.
dnaE.26	0	0	.	.	.
dnaE.260	0	0	.	.	.
dnaE.261	0	0	.	.	.
dnaE.262	0	0	.	.	.
dnaE.263	0	0	.	.	.
dnaE.264	0	0	.	.	.
dnaE.265	0	0	.	.	.
dnaE.266	0	0	.	.	.
dnaE.267	0	0	.	.	.
dnaE.268	0	0	.	.	.
dnaE.269	0	0	.	.	.
dnaE.27	0	0	.	.	.
dnaE.270	0	0	.	.	.
dnaE.271	0	0	.	.	.
dnaE.272	0	0	.	.	.
dnaE.273	0	0	.	.	.
dnaE.274	0	0	.	.	.
dnaE.275	0	0	.	.	.
dnaE.276	0	0	.	.	.
dnaE.277	0	0	.	.	.
dnaE.278	0	0	.	.	.
dnaE.279	0	0	.	.	.
dnaE.28	0	0	.	.	.
dnaE.280	0	0	.	.	.
dnaE.281	0	0	.	.	.
dnaE.282	0	0	.	.	.
dnaE.283	0	0	.	.	.
dnaE.284	0	0	.	.	.
dnaE.285	0	0	.	.	.
dnaE.286	0	0	.	.	.
dnaE.287	0	0	.	.	.
dnaE.288	0	0	.	.	.
dnaE.289	0	0	.	.	.
dnaE.29	0	0	.	.	.
dnaE.290	0	0	.	.	.
dnaE.291	0	0	.	.	.
dnaE.292	0	0	.	.	.
dnaE.293	0	0	.	.	.
dnaE.294	0	0	.	.	.
dnaE.295	0	0	.	.	.
dnaE.296	0	0	.	.	.
dnaE.297	0	0	.	.	.
dnaE.298	0	0	.	.	.
dnaE.299	0	0	.	.	.
dnaE.3	0	0	.	.	.
dnaE.30	0	0	.	.	.
dnaE.300	0	0	.	.	.
dnaE.301	0	0	.	.	.
dnaE.302	0	0	.	.	.
dnaE.303	0	0	.	.	.
dnaE.304	0	0	.	.	.
dnaE.305	0	0	.	.	.
dnaE.306	0	0	.	.	.
dnaE.307	0	0	.	.	.
dnaE.308	0	0	.	.	.
dnaE.309	0	0	.	.	.
dnaE.31	0	0	.	.	.
dnaE.310	0	0	.	.	.
dnaE.311	0	0	.	.	.
dnaE.312	0	0	.	.	.
dnaE.313	0	0	.	.	.
dnaE.314	0	0	.	.	.
dnaE.315	0	0	.	.	.
dnaE.316	0	0	.	.	.
dnaE.317	0	0	.	.	.
dnaE.318	0	0	.	.	.
dnaE.319	0	0	.	.	.
dnaE.32	0	0	.	.	.
dnaE.320	0	0	.	.	.
dnaE.321	0	0	.	.	.
dnaE.322	0	0	.	.	.
dnaE.323	0	0	.	.	.
dnaE.324	0	0	.	.	.
dnaE.325	0	0	.	.	.
dnaE.326	0	0	.	.	.
dnaE.327	0	0	.	.	.
dnaE.328	0	0	.	.	.
dnaE.329	0	0	.	.	.
dnaE.33	0	0	.	.	.
dnaE.330	0	0	.	.	.
dnaE.331	0	0	.	.	.
dnaE.332	0	0	.	.	.
dnaE.333	0	0	.	.	.
dnaE.334	0	0	.	.	.
dnaE.335	0	0	.	.	.
dnaE.336	0	0	.	.	.
dnaE.337	0	0	.	.	.
dnaE.338	0	0	.	.	.
dnaE.339	0	0	.	.	.
dnaE.34	0	0	.	.	.
dnaE.340	0	0	.	.	.
dnaE.341	0	0	.	.	.
dnaE.342	0	0	.	.	.
dnaE.343	0	0	.	.	.
dnaE.344	0	0	.	.	.
dnaE.345	0	0	.	.	.
dnaE.346	0	0	.	.	.
dnaE.347	0	0	.	.	.
dnaE.348	0	0	.	.	.
dnaE.349	0	0	.	.	.
dnaE.35	0	0	.	.	.
dnaE.350	0	0	.	.	.
dnaE.351	0	0	.	.	.
dnaE.352	0	0	.	.	.
dnaE.353	0	0	.	.	.
dnaE.354	0	0	.	.	.
dnaE.355	0	0	.	.	.
dnaE.356	0	0	.	.	.
dnaE.357	0	0	.	.	.
dnaE.358	0	0	.	.	.
dnaE.359	0	0	.	.	.
dnaE.36	0	0	.	.	.
dnaE.360	0	0	.	.	.
dnaE.361	0	0	.	.	.
dnaE.362	0	0	.	.	.
dnaE.363	0	0	.	.	.
dnaE.364	0	0	.	.	.
dnaE.365	0	0	.	.	.
dnaE.366	0	0	.	.	.
dnaE.367	0	0	.	.	.
dnaE.368	0	0	.	.	.
dnaE.369	0	0	.	.	.
dnaE.37	0	0	.	.	.
dnaE.370	0	0	.	.	.
dnaE.371	0	0	.	.	.
dnaE.372	0	0	.	.	.
dnaE.373	0	0	.	.	.
dnaE.374	0	0	.	.	.
dnaE.375	0	0	.	.	.
dnaE.376	0	0	.	.	.
dnaE.377	0	0	.	.	.
dnaE.378	0	0	.	.	.
dnaE.379	0	0	.	.	.
dnaE.38	0	0	.	.	.
dnaE.380	0	0	.	.	.
dnaE.381	0	0	.	.	.
dnaE.382	0	0	.	.	.
dnaE.383	0	0	.	.	.
dnaE.384	0	0	.	.	.
dnaE.385	0	0	.	.	.
dnaE.386	0	0	.	.	.
dnaE.387	0	0	.	.	.
dnaE.388	0	0	.	.	.
dnaE.389	0	0	.	.	.
dnaE.39	0	0	.	.	.
dnaE.390	0	0	.	.	.
dnaE.391	0	0	.	.	.
dnaE.392	0	0	.	.	.
dnaE.393	0	0	.	.	.
dnaE.394	0	0	.	.	.
dnaE.395	0	0	.	.	.
dnaE.396	0	0	.	.	.
dnaE.397	0	0	.	.	.
dnaE.398	0	0	.	.	.
dnaE.399	0	0	.	.	.
dnaE.4	0	0	.	.	.
dnaE.40	0	0	.	.	.
dnaE.400	0	0	.	.	.
dnaE.401	0	0	.	.	.
dnaE.402	0	0	.	.	.
dnaE.403	0	0	.	.	.
dnaE.404	0	0	.	.	.
dnaE.405	0	0	.	.	.
dnaE.406	0	0	.	.	.
dnaE.407	0	0	.	.	.
dnaE.408	0	0	.	.	.
dnaE.409	0	0	.	.	.
dnaE.41	0	0	.	.	.
dnaE.410	0	0	.	.	.
dnaE.411	0	0	.	.	.
dnaE.412	0	0	.	.	.
dnaE.413	0	0	.	.	.
dnaE.414	0	0	.	.	.
dnaE.415	0	0	.	.	.
dnaE.416	0	0	.	.	.
dnaE.417	0	0	.	.	.
dnaE.418	0	0	.	.	.
dnaE.419	0	0	.	.	.
dnaE.42	0	0	.	.	.
dnaE.420	0	0	.	.	.
dnaE.421	0	0	.	.	.
dnaE.422	0	0	.	.	.
dnaE.423	0	0	.	.	.
dnaE.424	0	0	.	.	.
dnaE.425	0	0	.	.	.
dnaE.426	0	0	.	.	.
dnaE.427	0	0	.	.	.
dnaE.428	0	0	.	.	.
dnaE.429	0	0	.	.	.
dnaE.43	0	0	.	.	.
dnaE.430	0	0	.	.	.
dnaE.431	0	0	.	.	.
dnaE.432	0	0	.	.	.
dnaE.433	0	0	.	.	.
dnaE.434	0	0	.	.	.
dnaE.435	0	0	.	.	.
dnaE.436	0	0	.	.	.
dnaE.437	0	0	.	.	.
dnaE.438	0	0	.	.	.
dnaE.439	0	0	.	.	.
dnaE.44	0	0	.	.	.
dnaE.440	0	0	.	.	.
dnaE.441	0	0	.	.	.
dnaE.442	0	0	.	.	.
dnaE.45	0	0	.	.	.
dnaE.46	0	0	.	.	.
dnaE.47	0	0	.	.	.
dnaE.48	0	0	.	.	.
dnaE.49	0	0	.	.	.
dnaE.5	0	0	.	.	.
dnaE.50	0	0	.	.	.
dnaE.51	0	0	.	.	.
dnaE.52	0	0	.	.	.
dnaE.53	0	0	.	.	.
dnaE.54	0	0	.	.	.
dnaE.55	0	0	.	.	.
dnaE.56	0	0	.	.	.
dnaE.57	0	0	.	.	.
dnaE.58	0	0	.	.	.
dnaE.59	0	0	.	.	.
dnaE.6	0	0	.	.	.
dnaE.60	0	0	.	.	.
dnaE.61	0	0	.	.	.
dnaE.62	0	0	.	.	.
dnaE.63	0	0	.	.	.
dnaE.64	0	0	.	.	.
dnaE.65	0	0	.	.	.
dnaE.66	0	0	.	.	.
dnaE.67	0	0	.	.	.
dnaE.68	0	0	.	.	.
dnaE.69	0	0	.	.	.
dnaE.7	0	0	.	.	.
dnaE.70	0	0	.	.	.
dnaE.71	0	0	.	.	.
dnaE.72	0	0	.	.	.
dnaE.73	0	0	.	.	.
dnaE.74	0	0	.	.	.
dnaE.75	0	0	.	.	.
dnaE.76	0	0	.	.	.
dnaE.77	0	0	.	.	.
dnaE.78	0	0	.	.	.
dnaE.79	0	0	.	.	.
dnaE.8	0	0	.	.	.
dnaE.80	0	0	.	.	.
dnaE.81	0	0	.	.	.
dnaE.82	0	0	.	.	.
dnaE.83	0	0	.	.	.
dnaE.84	0	0	.	.	.
dnaE.85	0	0	.	.	.
dnaE.86	0	0	.	.	.
dnaE.87	0	0	.	.	.
dnaE.88	0	0	.	.	.
dnaE.89	0	0	.	.	.
dnaE.9	0	0	.	.	.
dnaE.90	0	0	.	.	.
dnaE.91	0	0	.	.	.
dnaE.92	0	0	.	.	.
dnaE.93	0	0	.	.	.
dnaE.94	0	0	.	.	.
dnaE.95	0	0	.	.	.
dnaE.96	0	0	.	.	.
dnaE.97	0	0	.	.	.
dnaE.98	0	0	.	.	.
dnaE.99	0	0	.	.	.
dtdS.1	0	0	.	.	.
dtdS.10	0	0	.	.	.
dtdS.100	0	0	.	.	.
dtdS.101	0	0	.	.	.
dtdS.102	0	0	.	.	.
dtdS.103	0	0	.	.	.
dtdS.104	0	0	.	.	.
dtdS.105	0	0	.	.	.
dtdS.106	0	0	.	.	.
dtdS.107	0	0	.	.	.
dtdS.108	0	0	.	.	.
dtdS.109	0	0	.	.	.
dtdS.11	0	0	.	.	.
dtdS.110	0	0	.	.	.
dtdS.111	0	0	.	.	.
dtdS.112	0	0	.	.	.
dtdS.113	0	0	.	.	.
dtdS.114	0	0	.	.	.
dtdS.115	0	0	.	.	.
dtdS.116	0	0	.	.	.
dtdS.117	0	0	.	.	.
dtdS.118	0	0	.	.	.
dtdS.119	0	0	.	.	.
dtdS.12	0	0	.	.	.
dtdS.120	0	0	.	.	.
dtdS.121	0	0	.	.	.
dtdS.122	0	0	.	.	.
dtdS.123	0	0	.	.	.
dtdS.124	0	0	.	.	.
dtdS.125	0	0	.	.	.
dtdS.126	0	0	.	.	.
dtdS.127	0	0	.	.	.
dtdS.128	0	0	.	.	.
dtdS.129	0	0	.	.	.
dtdS.13	0	0	.	.	.
dtdS.130	0	0	.	.	.
dtdS.131	0	0	.	.	.
dtdS.132	0	0	.	.	.
dtdS.133	0	0	.	.	.
dtdS.134	0	0	.	.	.
dtdS.135	0	0	.	.	.
dtdS.136	0	0	.	.	.
dtdS.137	0	0	.	.	.
dtdS.138	0	0	.	.	.
dtdS.139	0	0	.	.	.
dtdS.14	0	0	.	.	.
dtdS.140	0	0	.	.	.
dtdS.141	0	0	.	.	.
dtdS.142	0	0	.	.	.
dtdS.143	0	0	.	.	.
dtdS.144	0	0	.	.	.
dtdS.145	0	0	.	.	.
dtdS.146	0	0	.	.	.
dtdS.147	0	0	.	.	.
dtdS.148	0	0	.	.	.
dtdS.149	0	0	.	.	.
dtdS.15	0	0	.	.	.
dtdS.150	0	0	.	.	.
dtdS.151	0	0	.	.	.
dtdS.152	0	0	.	.	.
dtdS.153	0	0	.	.	.
dtdS.154	0	0	.	.	.
dtdS.155	0	0	.	.	.
dtdS.156	0	0	.	.	.
dtdS.157	0	0	.	.	.
dtdS.158	0	0	.	.	.
dtdS.159	0	0	.	.	.
dtdS.16	0	0	.	.	.
dtdS.160	0	0	.	.	.
dtdS.161	0	0	.	.	.
dtdS.162	0	0	.	.	.
dtdS.163	0	0	.	.	.
dtdS.164	0	0	.	.	.
dtdS.165	0	0	.	.	.
dtdS.166	0	0	.	.	.
dtdS.167	0	0	.	.	.
dtdS.168	0	0	.	.	.
dtdS.169	0	0	.	.	.
dtdS.17	0	0	.	.	.
dtdS.170	0	0	.	.	.
dtdS.171	0	0	.	.	.
dtdS.172	0	0	.	.	.
dtdS.173	0	0	.	.	.
dtdS.174	0	0	.	.	.
dtdS.175	0	0	.	.	.
dtdS.176	0	0	.	.	.
dtdS.177	0	0	.	.	.
dtdS.178	0	0	.	.	.
dtdS.179	0	0	.	.	.
dtdS.18	0	0	.	.	.
dtdS.180	0	0	.	.	.
dtdS.181	0	0	.	.	.
dtdS.182	0	0	.	.	.
dtdS.183	0	0	.	.	.
dtdS.184	0	0	.	.	.
dtdS.185	0	0	.	.	.
dtdS.186	0	0	.	.	.
dtdS.187	0	0	.	.	.
dtdS.188	0	0	.	.	.
dtdS.189	0	0	.	.	.
dtdS.19	0	0	.	.	.
dtdS.190	0	0	.	.	.
dtdS.191	0	0	.	.	.
dtdS.192	0	0	.	.	.
dtdS.193	0	0	.	.	.
dtdS.194	0	0	.	.	.
dtdS.195	0	0	.	.	.
dtdS.196	0	0	.	.	.
dtdS.197	0	0	.	.	.
dtdS.198	0	0	.	.	.
dtdS.199	0	0	.	.	.
dtdS.2	0	0	.	.	.
dtdS.20	0	0	.	.	.
dtdS.200	0	0	.	.	.
dtdS.201	0	0	.	.	.
dtdS.202	0	0	.	.	.
dtdS.203	0	0	.	.	.
dtdS.204	0	0	.	.	.
dtdS.205	0	0	.	.	.
dtdS.206	0	0	.	.	.
dtdS.207	0	0	.	.	.
dtdS.208	0	0	.	.	.
dtdS.209	0	0	.	.	.
dtdS.21	0	0	.	.	.
dtdS.210	0	0	.	.	.
dtdS.211	0	0	.	.	.
dtdS.212	0	0	.	.	.
dtdS.213	0	0	.	.	.
dtdS.214	0	0	.	.	.
dtdS.215	0	0	.	.	.
dtdS.216	0	0	.	.	.
dtdS.217	0	0	.	.	.
dtdS.218	0	0	.	.	.
dtdS.219	0	0	.	.	.
dtdS.22	0	0	.	.	.
dtdS.220	0	0	.	.	.
dtdS.221	0	0	.	.	.
dtdS.222	0	0	.	.	.
dtdS.223	0	0	.	.	.
dtdS.224	0	0	.	.	.
dtdS.225	0	0	.	.	.
dtdS.226	0	0	.	.	.
dtdS.227	0	0	.	.	.
dtdS.228	0	0	.	.	.
dtdS.229	0	0	.	.	.
dtdS.23	0	0	.	.	.
dtdS.230	0	0	.	.	.
dtdS.231	0	0	.	.	.
dtdS.232	0	0	.	.	.
dtdS.233	0	0	.	.	.
dtdS.234	0	0	.	.	.
dtdS.235	0	0	.	.	.
dtdS.236	0	0	.	.	.
dtdS.237	0	0	.	.	.
dtdS.238	0	0	.	.	.
dtdS.239	0	0	.	.	.
dtdS.24	0	0	.	.	.
dtdS.240	0	0	.	.	.
dtdS.241	0	0	.	.	.
dtdS.242	0	0	.	.	.
dtdS.243	0	0	.	.	.
dtdS.244	0	0	.	.	.
dtdS.245	0	0	.	.	.
dtdS.246	0	0	.	.	.
dtdS.247	0	0	.	.	.
dtdS.248	0	0	.	.	.
dtdS.249	0	0	.	.	.
dtdS.25	0	0	.	.	.
dtdS.250	0	0	.	.	.
dtdS.251	0	0	.	.	.
dtdS.252	0	0	.	.	.
dtdS.253	0	0	.	.	.
dtdS.254	0	0	.	.	.
dtdS.255	0	0	.	.	.
dtdS.256	0	0	.	.	.
dtdS.257	0	0	.	.	.
dtdS.258	0	0	.	.	.
dtdS.259	0	0	.	.	.
dtdS.26	0	0	.	.	.
dtdS.260	0	0	.	.	.
dtdS.261	0	0	.	.	.
dtdS.262	0	0	.	.	.
dtdS.263	0	0	.	.	.
dtdS.264	0	0	.	.	.
dtdS.265	0	0	.	.	.
dtdS.266	0	0	.	.	.
dtdS.267	0	0	.	.	.
dtdS.268	0	0	.	.	.
dtdS.269	0	0	.	.	.
dtdS.27	0	0	.	.	.
dtdS.270	0	0	.	.	.
dtdS.271	0	0	.	.	.
dtdS.272	0	0	.	.	.
dtdS.273	0	0	.	.	.
dtdS.274	0	0	.	.	.
dtdS.275	0	0	.	.	.
dtdS.276	0	0	.	.	.
dtdS.277	0	0	.	.	.
dtdS.278	0	0	.	.	.
dtdS.279	0	0	.	.	.
dtdS.28	0	0	.	.	.
dtdS.280	0	0	.	.	.
dtdS.281	0	0	.	.	.
dtdS.282	0	0	.	.	.
dtdS.283	0	0	.	.	.
dtdS.284	0	0	.	.	.
dtdS.285	0	0	.	.	.
dtdS.286	0	0	.	.	.
dtdS.287	0	0	.	.	.
dtdS.288	0	0	.	.	.
dtdS.289	0	0	.	.	.
dtdS.29	0	0	.	.	.
dtdS.290	0	0	.	.	.
dtdS.291	0	0	.	.	.
dtdS.292	0	0	.	.	.
dtdS.293	0	0	.	.	.
dtdS.294	0	0	.	.	.
dtdS.295	0	0	.	.	.
dtdS.296	0	0	.	.	.
dtdS.297	0	0	.	.	.
dtdS.298	0	0	.	.	.
dtdS.299	0	0	.	.	.
dtdS.3	0	0	.	.	.
dtdS.30	0	0	.	.	.
dtdS.300	0	0	.	.	.
dtdS.301	0	0	.	.	.
dtdS.302	0	0	.	.	.
dtdS.303	0	0	.	.	.
dtdS.304	0	0	.	.	.
dtdS.305	0	0	.	.	.
dtdS.306	0	0	.	.	.
dtdS.307	0	0	.	.	.
dtdS.308	0	0	.	.	.
dtdS.309	0	0	.	.	.
dtdS.31	0	0	.	.	.
dtdS.310	0	0	.	.	.
dtdS.311	0	0	.	.	.
dtdS.312	0	0	.	.	.
dtdS.313	0	0	.	.	.
dtdS.314	0	0	.	.	.
dtdS.315	0	0	.	.	.
dtdS.316	0	0	.	.	.
dtdS.317	0	0	.	.	.
dtdS.318	0	0	.	.	.
dtdS.319	0	0	.	.	.
dtdS.32	0	0	.	.	.
dtdS.320	0	0	.	.	.
dtdS.321	0	0	.	.	.
dtdS.322	0	0	.	.	.
dtdS.323	0	0	.	.	.
dtdS.324	0	0	.	.	.
dtdS.325	0	0	.	.	.
dtdS.326	0	0	.	.	.
dtdS.327	0	0	.	.	.
dtdS.328	0	0	.	.	.
dtdS.329	0	0	.	.	.
dtdS.33	0	0	.	.	.
dtdS.330	0	0	.	.	.
dtdS.331	0	0	.	.	.
dtdS.332	0	0	.	.	.
dtdS.333	0	0	.	.	.
dtdS.334	0	0	.	.	.
dtdS.335	0	0	.	.	.
dtdS.336	0	0	.	.	.
dtdS.337	0	0	.	.	.
dtdS.338	0	0	.	.	.
dtdS.339	0	0	.	.	.
dtdS.34	0	0	.	.	.
dtdS.340	0	0	.	.	.
dtdS.341	0	0	.	.	.
dtdS.342	0	0	.	.	.
dtdS.343	0	0	.	.	.
dtdS.344	0	0	.	.	.
dtdS.345	0	0	.	.	.
dtdS.346	0	0	.	.	.
dtdS.347	0	0	.	.	.
dtdS.348	0	0	.	.	.
dtdS.349	0	0	.	.	.
dtdS.35	0	0	.	.	.
dtdS.350	0	0	.	.	.
dtdS.351	0	0	.	.	.
dtdS.352	0	0	.	.	.
dtdS.353	0	0	.	.	.
dtdS.354	0	0	.	.	.
dtdS.355	0	0	.	.	.
dtdS.356	0	0	.	.	.
dtdS.357	0	0	.	.	.
dtdS.358	0	0	.	.	.
dtdS.359	0	0	.	.	.
dtdS.36	0	0	.	.	.
dtdS.360	0	0	.	.	.
dtdS.361	0	0	.	.	.
dtdS.362	0	0	.	.	.
dtdS.363	0	0	.	.	.
dtdS.364	0	0	.	.	.
dtdS.365	0	0	.	.	.
dtdS.366	0	0	.	.	.
dtdS.367	0	0	.	.	.
dtdS.368	0	0	.	.	.
dtdS.369	0	0	.	.	.
dtdS.37	0	0	.	.	.
dtdS.370	0	0	.	.	.
dtdS.371	0	0	.	.	.
dtdS.372	0	0	.	.	.
dtdS.373	0	0	.	.	.
dtdS.374	0	0	.	.	.
dtdS.375	0	0	.	.	.
dtdS.376	0	0	.	.	.
dtdS.377	0	0	.	.	.
dtdS.378	0	0	.	.	.
dtdS.379	0	0	.	.	.
dtdS.38	0	0	.	.	.
dtdS.380	0	0	.	.	.
dtdS.381	0	0	.	.	.
dtdS.382	0	0	.	.	.
dtdS.383	0	0	.	.	.
dtdS.384	0	0	.	.	.
dtdS.385	0	0	.	.	.
dtdS.386	0	0	.	.	.
dtdS.387	0	0	.	.	.
dtdS.388	0	0	.	.	.
dtdS.389	0	0	.	.	.
dtdS.39	0	0	.	.	.
dtdS.390	0	0	.	.	.
dtdS.391	0	0	.	.	.
dtdS.392	0	0	.	.	.
dtdS.393	0	0	.	.	.
dtdS.394	0	0	.	.	.
dtdS.395	0	0	.	.	.
dtdS.396	0	0	.	.	.
dtdS.397	0	0	.	.	.
dtdS.398	0	0	.	.	.
dtdS.399	0	0	.	.	.
dtdS.4	0	0	.	.	.
dtdS.40	0	0	.	.	.
dtdS.400	0	0	.	.	.
dtdS.401	0	0	.	.	.
dtdS.402	0	0	.	.	.
dtdS.403	0	0	.	.	.
dtdS.404	0	0	.	.	.
dtdS.405	0	0	.	.	.
dtdS.406	0	0	.	.	.
dtdS.407	0	0	.	.	.
dtdS.408	0	0	.	.	.
dtdS.409	0	0	.	.	.
dtdS.41	0	0	.	.	.
dtdS.410	0	0	.	.	.
dtdS.411	0	0	.	.	.
dtdS.412	0	0	.	.	.
dtdS.413	0	0	.	.	.
dtdS.414	0	0	.	.	.
dtdS.415	0	0	.	.	.
dtdS.416	0	0	.	.	.
dtdS.417	0	0	.	.	.
dtdS.418	0	0	.	.	.
dtdS.419	0	0	.	.	.
dtdS.42	0	0	.	.	.
dtdS.420	0	0	.	.	.
dtdS.421	0	0	.	.	.
dtdS.422	0	0	.	.	.
dtdS.423	0	0	.	.	.
dtdS.424	0	0	.	.	.
dtdS.425	0	0	.	.	.
dtdS.426	0	0	.	.	.
dtdS.427	0	0	.	.	.
dtdS.428	0	0	.	.	.
dtdS.429	0	0	.	.	.
dtdS.43	0	0	.	.	.
dtdS.430	0	0	.	.	.
dtdS.431	0	0	.	.	.
dtdS.432	0	0	.	.	.
dtdS.433	0	0	.	.	.
dtdS.434	0	0	.	.	.
dtdS.435	0	0	.	.	.
dtdS.436	0	0	.	.	.
dtdS.437	0	0	.	.	.
dtdS.438	0	0	.	.	.
dtdS.439	0	0	.	.	.
dtdS.44	0	0	.	.	.
dtdS.440	0	0	.	.	.
dtdS.441	0	0	.	.	.
dtdS.442	0	0	.	.	.
dtdS.443	0	0	.	.	.
dtdS.444	0	0	.	.	.
dtdS.445	0	0	.	.	.
dtdS.446	0	0	.	.	.
dtdS.447	0	0	.	.	.
dtdS.448	0	0	.	.	.
dtdS.449	0	0	.	.	.
dtdS.45	0	0	.	.	.
dtdS.450	0	0	.	.	.
dtdS.451	0	0	.	.	.
dtdS.452	0	0	.	.	.
dtdS.453	0	0	.	.	.
dtdS.454	0	0	.	.	.
dtdS.455	0	0	.	.	.
dtdS.456	0	0	.	.	.
dtdS.457	0	0	.	.	.
dtdS.458	0	0	.	.	.
dtdS.459	0	0	.	.	.
dtdS.46	0	0	.	.	.
dtdS.460	0	0	.	.	.
dtdS.461	0	0	.	.	.
dtdS.462	0	0	.	.	.
dtdS.463	0	0	.	.	.
dtdS.464	0	0	.	.	.
dtdS.465	0	0	.	.	.
dtdS.466	0	0	.	.	.
dtdS.467	0	0	.	.	.
dtdS.468	0	0	.	.	.
dtdS.469	0	0	.	.	.
dtdS.47	0	0	.	.	.
dtdS.470	0	0	.	.	.
dtdS.471	0	0	.	.	.
dtdS.472	0	0	.	.	.
dtdS.473	0	0	.	.	.
dtdS.474	0	0	.	.	.
dtdS.475	0	0	.	.	.
dtdS.476	0	0	.	.	.
dtdS.477	0	0	.	.	.
dtdS.478	0	0	.	.	.
dtdS.479	0	0	.	.	.
dtdS.48	0	0	.	.	.
dtdS.480	0	0	.	.	.
dtdS.481	0	0	.	.	.
dtdS.482	0	0	.	.	.
dtdS.483	0	0	.	.	.
dtdS.484	0	0	.	.	.
dtdS.485	0	0	.	.	.
dtdS.486	0	0	.	.	.
dtdS.487	0	0	.	.	.
dtdS.488	0	0	.	.	.
dtdS.489	0	0	.	.	.
dtdS.49	0	0	.	.	.
dtdS.490	0	0	.	.	.
dtdS.491	0	0	.	.	.
dtdS.492	0	0	.	.	.
dtdS.493	0	0	.	.	.
dtdS.494	0	0	.	.	.
dtdS.495	0	0	.	.	.
dtdS.496	0	0	.	.	.
dtdS.497	0	0	.	.	.
dtdS.498	0	0	.	.	.
dtdS.499	0	0	.	.	.
dtdS.5	0	0	.	.	.
dtdS.50	0	0	.	.	.
dtdS.500	0	0	.	.	.
dtdS.501	0	0	.	.	.
dtdS.502	0	0	.	.	.
dtdS.503	0	0	.	.	.
dtdS.504	0	0	.	.	.
dtdS.505	0	0	.	.	.
dtdS.506	0	0	.	.	.
dtdS.507	0	0	.	.	.
dtdS.508	0	0	.	.	.
dtdS.509	0	0	.	.	.
dtdS.51	0	0	.	.	.
dtdS.510	0	0	.	.	.
dtdS.511	0	0	.	.	.
dtdS.512	0	0	.	.	.
dtdS.513	0	0	.	.	.
dtdS.514	0	0	.	.	.
dtdS.515	0	0	.	.	.
dtdS.516	0	0	.	.	.
dtdS.517	0	0	.	.	.
dtdS.518	0	0	.	.	.
dtdS.519	0	0	.	.	.
dtdS.52	0	0	.	.	.
dtdS.520	0	0	.	.	.
dtdS.521	0	0	.	.	.
dtdS.522	0	0	.	.	.
dtdS.523	0	0	.	.	.
dtdS.524	0	0	.	.	.
dtdS.525	0	0	.	.	.
dtdS.526	0	0	.	.	.
dtdS.527	0	0	.	.	.
dtdS.528	0	0	.	.	.
dtdS.529	0	0	.	.	.
dtdS.53	0	0	.	.	.
dtdS.530	0	0	.	.	.
dtdS.531	0	0	.	.	.
dtdS.532	0	0	.	.	.
dtdS.533	0	0	.	.	.
dtdS.534	0	0	.	.	.
dtdS.535	0	0	.	.	.
dtdS.536	0	0	.	.	.
dtdS.537	0	0	.	.	.
dtdS.538	0	0	.	.	.
dtdS.539	0	0	.	.	.
dtdS.54	0	0	.	.	.
dtdS.540	0	0	.	.	.
dtdS.541	0	0	.	.	.
dtdS.542	0	0	.	.	.
dtdS.543	0	0	.	.	.
dtdS.544	0	0	.	.	.
dtdS.55	0	0	.	.	.
dtdS.56	0	0	.	.	.
dtdS.57	0	0	.	.	.
dtdS.58	0	0	.	.	.
dtdS.59	0	0	.	.	.
dtdS.6	0	0	.	.	.
dtdS.60	0	0	.	.	.
dtdS.61	0	0	.	.	.
dtdS.62	0	0	.	.	.
dtdS.63	0	0	.	.	.
dtdS.64	0	0	.	.	.
dtdS.65	0	0	.	.	.
dtdS.66	0	0	.	.	.
dtdS.67	0	0	.	.	.
dtdS.68	0	0	.	.	.
dtdS.69	0	0	.	.	.
dtdS.7	0	0	.	.	.
dtdS.70	0	0	.	.	.
dtdS.71	0	0	.	.	.
dtdS.72	0	0	.	.	.
dtdS.73	0	0	.	.	.
dtdS.74	0	0	.	.	.
dtdS.75	0	0	.	.	.
dtdS.76	0	0	.	.	.
dtdS.77	0	0	.	.	.
dtdS.78	0	0	.	.	.
dtdS.79	0	0	.	.	.
dtdS.8	0	0	.	.	.
dtdS.80	0	0	.	.	.
dtdS.81	0	0	.	.	.
dtdS.82	0	0	.	.	.
dtdS.83	0	0	.	.	.
dtdS.84	0	0	.	.	.
dtdS.85	0	0	.	.	.
dtdS.86	0	0	.	.	.
dtdS.87	0	0	.	.	.
dtdS.88	0	0	.	.	.
dtdS.89	0	0	.	.	.
dtdS.9	0	0	.	.	.
dtdS.90	0	0	.	.	.
dtdS.91	0	0	.	.	.
dtdS.92	0	0	.	.	.
dtdS.93	0	0	.	.	.
dtdS.94	0	0	.	.	.
dtdS.95	0	0	.	.	.
dtdS.96	0	0	.	.	.
dtdS.97	0	0	.	.	.
dtdS.98	0	0	.	.	.
dtdS.99	0	0	.	.	.
gyrB.1	0	0	.	.	.
gyrB.10	0	0	.	.	.
gyrB.100	0	0	.	.	.
gyrB.101	0	0	.	.	.
gyrB.102	0	0	.	.	.
gyrB.103	0	0	.	.	.
gyrB.104	0	0	.	.	.
gyrB.105	0	0	.	.	.
gyrB.106	0	0	.	.	.
gyrB.107	0	0	.	.	.
gyrB.108	0	0	.	.	.
gyrB.109	0	0	.	.	.
gyrB.11	0	0	.	.	.
gyrB.110	0	0	.	.	.
gyrB.111	0	0	.	.	.
gyrB.112	0	0	.	.	.
gyrB.113	0	0	.	.	.
gyrB.114	0	0	.	.	.
gyrB.115	0	0	.	.	.
gyrB.116	0	0	.	.	.
gyrB.117	0	0	.	.	.
gyrB.118	0	0	.	.	.
gyrB.119	0	0	.	.	.
gyrB.12	0	0	.	.	.
gyrB.120	0	0	.	.	.
gyrB.121	0	0	.	.	.
gyrB.122	0	0	.	.	.
gyrB.123	0	0	.	.	.
gyrB.124	0	0	.	.	.
gyrB.125	0	0	.	.	.
gyrB.126	0	0	.	.	.
gyrB.127	0	0	.	.	.
gyrB.128	0	0	.	.	.
gyrB.129	0	0	.	.	.
gyrB.13	0	0	.	.	.
gyrB.130	0	0	.	.	.
gyrB.131	0	0	.	.	.
gyrB.132	0	0	.	.	.
gyrB.133	0	0	.	.	.
gyrB.134	0	0	.	.	.
gyrB.135	0	0	.	.	.
gyrB.136	0	0	.	.	.
gyrB.137	0	0	.	.	.
gyrB.138	0	0	.	.	.
gyrB.139	0	0	.	.	.
gyrB.14	0	0	.	.	.
gyrB.140	0	0	.	.	.
gyrB.141	0	0	.	.	.
gyrB.142	0	0	.	.	.
gyrB.143	0	0	.	.	.
gyrB.144	0	0	.	.	.
gyrB.145	0	0	.	.	.
gyrB.146	0	0	.	.	.
gyrB.147	0	0	.	.	.
gyrB.148	0	0	.	.	.
gyrB.149	0	0	.	.	.
gyrB.15	0	0	.	.	.
gyrB.150	0	0	.	.	.
gyrB.151	0	0	.	.	.
gyrB.152	0	0	.	.	.
gyrB.153	0	0	.	.	.
gyrB.154	0	0	.	.	.
gyrB.155	0	0	.	.	.
gyrB.156	0	0	.	.	.
gyrB.157	0	0	.	.	.
gyrB.158	0	0	.	.	.
gyrB.159	0	0	.	.	.
gyrB.16	0	0	.	.	.
gyrB.160	0	0	.	.	.
gyrB.161	0	0	.	.	.
gyrB.162	0	0	.	.	.
gyrB.163	0	0	.	.	.
gyrB.164	0	0	.	.	.
gyrB.165	0	0	.	.	.
gyrB.166	0	0	.	.	.
gyrB.167	0	0	.	.	.
gyrB.168	0	0	.	.	.
gyrB.169	0	0	.	.	.
gyrB.17	0	0	.	.	.
gyrB.170	0	0	.	.	.
gyrB.171	0	0	.	.	.
gyrB.172	0	0	.	.	.
gyrB.173	0	0	.	.	.
gyrB.174	0	0	.	.	.
gyrB.175	0	0	.	.	.
gyrB.176	0	0	.	.	.
gyrB.177	0	0	.	.	.
gyrB.178	0	0	.	.	.
gyrB.179	0	0	.	.	.
gyrB.18	0	0	.	.	.
gyrB.180	0	0	.	.	.
gyrB.181	0	0	.	.	.
gyrB.182	0	0	.	.	.
gyrB.183	0	0	.	.	.
gyrB.184	0	0	.	.	.
gyrB.185	0	0	.	.	.
gyrB.186	0	0	.	.	.
gyrB.187	0	0	.	.	.
gyrB.188	0	0	.	.	.
gyrB.189	0	0	.	.	.
gyrB.19	0	0	.	.	.
gyrB.190	0	0	.	.	.
gyrB.191	0	0	.	.	.
gyrB.192	0	0	.	.	.
gyrB.193	0	0	.	.	.
gyrB.194	0	0	.	.	.
gyrB.195	0	0	.	.	.
gyrB.196	0	0	.	.	.
gyrB.197	0	0	.	.	.
gyrB.198	0	0	.	.	.
gyrB.199	0	0	.	.	.
gyrB.2	0	0	.	.	.
gyrB.20	0	0	.	.	.
gyrB.200	0	0	.	.	.
gyrB.201	0	0	.	.	.
gyrB.202	0	0	.	.	.
gyrB.203	0	0	.	.	.
gyrB.204	0	0	.	.	.
gyrB.205	0	0	.	.	.
gyrB.206	0	0	.	.	.
gyrB.207	0	0	.	.	.
gyrB.208	0	0	.	.	.
gyrB.209	0	0	.	.	.
gyrB.21	0	0	.	.	.
gyrB.210	0	0	.	.	.
gyrB.211	0	0	.	.	.
gyrB.212	0	0	.	.	.
gyrB.213	0	0	.	.	.
gyrB.214	0	0	.	.	.
gyrB.215	0	0	.	.	.
gyrB.216	0	0	.	.	.
gyrB.217	0	0	.	.	.
gyrB.218	0	0	.	.	.
gyrB.219	0	0	.	.	.
gyrB.22	0	0	.	.	.
gyrB.220	0	0	.	.	.
gyrB.221	0	0	.	.	.
gyrB.222	0	0	.	.	.
gyrB.223	0	0	.	.	.
gyrB.224	0	0	.	.	.
gyrB.225	0	0	.	.	.
gyrB.226	0	0	.	.	.
gyrB.227	0	0	.	.	.
gyrB.228	0	0	.	.	.
gyrB.229	0	0	.	.	.
gyrB.23	0	0	.	.	.
gyrB.230	0	0	.	.	.
gyrB.231	0	0	.	.	.
gyrB.232	0	0	.	.	.
gyrB.233	0	0	.	.	.
gyrB.234	0	0	.	.	.
gyrB.235	0	0	.	.	.
gyrB.236	0	0	.	.	.
gyrB.237	0	0	.	.	.
gyrB.238	0	0	.	.	.
gyrB.239	0	0	.	.	.
gyrB.24	0	0	.	.	.
gyrB.240	0	0	.	.	.
gyrB.241	0	0	.	.	.
gyrB.242	0	0	.	.	.
gyrB.243	0	0	.	.	.
gyrB.244	0	0	.	.	.
gyrB.245	0	0	.	.	.
gyrB.246	0	0	.	.	.
gyrB.247	0	0	.	.	.
gyrB.248	0	0	.	.	.
gyrB.249	0	0	.	.	.
gyrB.25	0	0	.	.	.
gyrB.250	0	0	.	.	.
gyrB.251	0	0	.	.	.
gyrB.252	0	0	.	.	.
gyrB.253	0	0	.	.	.
gyrB.254	0	0	.	.	.
gyrB.255	0	0	.	.	.
gyrB.256	0	0	.	.	.
gyrB.257	0	0	.	.	.
gyrB.258	0	0	.	.	.
gyrB.259	0	0	.	.	.
gyrB.26	0	0	.	.	.
gyrB.260	0	0	.	.	.
gyrB.261	0	0	.	.	.
gyrB.262	0	0	.	.	.
gyrB.263	0	0	.	.	.
gyrB.264	0	0	.	.	.
gyrB.265	0	0	.	.	.
gyrB.266	0	0	.	.	.
gyrB.267	0	0	.	.	.
gyrB.268	0	0	.	.	.
gyrB.269	0	0	.	.	.
gyrB.27	0	0	.	.	.
gyrB.270	0	0	.	.	.
gyrB.271	0	0	.	.	.
gyrB.272	0	0	.	.	.
gyrB.273	0	0	.	.	.
gyrB.274	0	0	.	.	.
gyrB.275	0	0	.	.	.
gyrB.276	0	0	.	.	.
gyrB.277	0	0	.	.	.
gyrB.278	0	0	.	.	.
gyrB.279	0	0	.	.	.
gyrB.28	0	0	.	.	.
gyrB.280	0	0	.	.	.
gyrB.281	0	0	.	.	.
gyrB.282	0	0	.	.	.
gyrB.283	0	0	.	.	.
gyrB.284	0	0	.	.	.
gyrB.285	0	0	.	.	.
gyrB.286	0	0	.	.	.
gyrB.287	0	0	.	.	.
gyrB.288	0	0	.	.	.
gyrB.289	0	0	.	.	.
gyrB.29	0	0	.	.	.
gyrB.290	0	0	.	.	.
gyrB.291	0	0	.	.	.
gyrB.292	0	0	.	.	.
gyrB.293	0	0	.	.	.
gyrB.294	0	0	.	.	.
gyrB.295	0	0	.	.	.
gyrB.296	0	0	.	.	.
gyrB.297	0	0	.	.	.
gyrB.298	0	0	.	.	.
gyrB.299	0	0	.	.	.
gyrB.3	0	0	.	.	.
gyrB.30	0	0	.	.	.
gyrB.300	0	0	.	.	.
gyrB.301	0	0	.	.	.
gyrB.302	0	0	.	.	.
gyrB.303	0	0	.	.	.
gyrB.304	0	0	.	.	.
gyrB.305	0	0	.	.	.
gyrB.306	0	0	.	.	.
gyrB.307	0	0	.	.	.
gyrB.308	0	0	.	.	.
gyrB.309	0	0	.	.	.
gyrB.31	0	0	.	.	.
gyrB.310	0	0	.	.	.
gyrB.311	0	0	.	.	.
gyrB.312	0	0	.	.	.
gyrB.313	0	0	.	.	.
gyrB.314	0	0	.	.	.
gyrB.315	0	0	.	.	.
gyrB.316	0	0	.	.	.
gyrB.317	0	0	.	.	.
gyrB.318	0	0	.	.	.
gyrB.319	0	0	.	.	.
gyrB.32	0	0	.	.	.
gyrB.320	0	0	.	.	.
gyrB.321	0	0	.	.	.
gyrB.322	0	0	.	.	.
gyrB.323	0	0	.	.	.
gyrB.324	0	0	.	.	.
gyrB.325	0	0	.	.	.
gyrB.326	0	0	.	.	.
gyrB.327	0	0	.	.	.
gyrB.328	0	0	.	.	.
gyrB.329	0	0	.	.	.
gyrB.33	0	0	.	.	.
gyrB.330	0	0	.	.	.
gyrB.331	0	0	.	.	.
gyrB.332	0	0	.	.	.
gyrB.333	0	0	.	.	.
gyrB.334	0	0	.	.	.
gyrB.335	0	0	.	.	.
gyrB.336	0	0	.	.	.
gyrB.337	0	0	.	.	.
gyrB.338	0	0	.	.	.
gyrB.339	0	0	.	.	.
gyrB.34	0	0	.	.	.
gyrB.340	0	0	.	.	.
gyrB.341	0	0	.	.	.
gyrB.342	0	0	.	.	.
gyrB.343	0	0	.	.	.
gyrB.344	0	0	.	.	.
gyrB.345	0	0	.	.	.
gyrB.346	0	0	.	.	.
gyrB.347	0	0	.	.	.
gyrB.348	0	0	.	.	.
gyrB.349	0	0	.	.	.
gyrB.35	0	0	.	.	.
gyrB.350	0	0	.	.	.
gyrB.351	0	0	.	.	.
gyrB.352	0	0	.	.	.
gyrB.353	0	0	.	.	.
gyrB.354	0	0	.	.	.
gyrB.355	0	0	.	.	.
gyrB.356	0	0	.	.	.
gyrB.357	0	0	.	.	.
gyrB.358	0	0	.	.	.
gyrB.359	0	0	.	.	.
gyrB.36	0	0	.	.	.
gyrB.360	0	0	.	.	.
gyrB.361	0	0	.	.	.
gyrB.362	0	0	.	.	.
gyrB.363	0	0	.	.	.
gyrB.364	0	0	.	.	.
gyrB.365	0	0	.	.	.
gyrB.366	0	0	.	.	.
gyrB.367	0	0	.	.	.
gyrB.368	0	0	.	.	.
gyrB.369	0	0	.	.	.
gyrB.37	0	0	.	.	.
gyrB.370	0	0	.	.	.
gyrB.371	0	0	.	.	.
gyrB.372	0	0	.	.	.
gyrB.373	0	0	.	.	.
gyrB.374	0	0	.	.	.
gyrB.375	0	0	.	.	.
gyrB.376	0	0	.	.	.
gyrB.377	0	0	.	.	.
gyrB.378	0	0	.	.	.
gyrB.379	0	0	.	.	.
gyrB.38	0	0	.	.	.
gyrB.380	0	0	.	.	.
gyrB.381	0	0	.	.	.
gyrB.382	0	0	.	.	.
gyrB.383	0	0	.	.	.
gyrB.384	0	0	.	.	.
gyrB.385	0	0	.	.	.
gyrB.386	0	0	.	.	.
gyrB.387	0	0	.	.	.
gyrB.388	0	0	.	.	.
gyrB.389	0	0	.	.	.
gyrB.39	0	0	.	.	.
gyrB.390	0	0	.	.	.
gyrB.391	0	0	.	.	.
gyrB.392	0	0	.	.	.
gyrB.393	0	0	.	.	.
gyrB.394	0	0	.	.	.
gyrB.395	0	0	.	.	.
gyrB.396	0	0	.	.	.
gyrB.397	0	0	.	.	.
gyrB.398	0	0	.	.	.
gyrB.399	0	0	.	.	.
gyrB.4	0	0	.	.	.
gyrB.40	0	0	.	.	.
gyrB.400	0	0	.	.	.
gyrB.401	0	0	.	.	.
gyrB.402	0	0	.	.	.
gyrB.403	0	0	.	.	.
gyrB.404	0	0	.	.	.
gyrB.405	0	0	.	.	.
gyrB.406	0	0	.	.	.
gyrB.407	0	0	.	.	.
gyrB.408	0	0	.	.	.
gyrB.409	0	0	.	.	.
gyrB.41	0	0	.	.	.
gyrB.410	0	0	.	.	.
gyrB.411	0	0	.	.	.
gyrB.412	0	0	.	.	.
gyrB.413	0	0	.	.	.
gyrB.414	0	0	.	.	.
gyrB.415	0	0	.	.	.
gyrB.416	0	0	.	.	.
gyrB.417	0	0	.	.	.
gyrB.418	0	0	.	.	.
gyrB.419	0	0	.	.	.
gyrB.42	0	0	.	.	.
gyrB.420	0	0	.	.	.
gyrB.421	0	0	.	.	.
gyrB.422	0	0	.	.	.
gyrB.423	0	0	.	.	.
gyrB.424	0	0	.	.	.
gyrB.425	0	0	.	.	.
gyrB.426	0	0	.	.	.
gyrB.427	0	0	.	.	.
gyrB.428	0	0	.	.	.
gyrB.429	0	0	.	.	.
gyrB.43	0	0	.	.	.
gyrB.430	0	0	.	.	.
gyrB.431	0	0	.	.	.
gyrB.432	0	0	.	.	.
gyrB.433	0	0	.	.	.
gyrB.434	0	0	.	.	.
gyrB.435	0	0	.	.	.
gyrB.436	0	0	.	.	.
gyrB.437	0	0	.	.	.
gyrB.438	0	0	.	.	.
gyrB.439	0	0	.	.	.
gyrB.44	0	0	.	.	.
gyrB.440	0	0	.	.	.
gyrB.441	0	0	.	.	.
gyrB.442	0	0	.	.	.
gyrB.443	0	0	.	.	.
gyrB.444	0	0	.	.	.
gyrB.445	0	0	.	.	.
gyrB.446	0	0	.	.	.
gyrB.447	0	0	.	.	.
gyrB.448	0	0	.	.	.
gyrB.449	0	0	.	.	.
gyrB.45	0	0	.	.	.
gyrB.450	0	0	.	.	.
gyrB.451	0	0	.	.	.
gyrB.452	0	0	.	.	.
gyrB.453	0	0	.	.	.
gyrB.454	0	0	.	.	.
gyrB.455	0	0	.	.	.
gyrB.456	0	0	.	.	.
gyrB.457	0	0	.	.	.
gyrB.458	0	0	.	.	.
gyrB.459	0	0	.	.	.
gyrB.46	0	0	.	.	.
gyrB.460	0	0	.	.	.
gyrB.461	0	0	.	.	.
gyrB.462	0	0	.	.	.
gyrB.463	0	0	.	.	.
gyrB.464	0	0	.	.	.
gyrB.465	0	0	.	.	.
gyrB.466	0	0	.	.	.
gyrB.467	0	0	.	.	.
gyrB.468	0	0	.	.	.
gyrB.469	0	0	.	.	.
gyrB.47	0	0	.	.	.
gyrB.470	0	0	.	.	.
gyrB.471	0	0	.	.	.
gyrB.472	0	0	.	.	.
gyrB.473	0	0	.	.	.
gyrB.474	0	0	.	.	.
gyrB.475	0	0	.	.	.
gyrB.476	0	0	.	.	.
gyrB.477	0	0	.	.	.
gyrB.478	0	0	.	.	.
gyrB.479	0	0	.	.	.
gyrB.48	0	0	.	.	.
gyrB.480	0	0	.	.	.
gyrB.481	0	0	.	.	.
gyrB.482	0	0	.	.	.
gyrB.483	0	0	.	.	.
gyrB.484	0	0	.	.	.
gyrB.485	0	0	.	.	.
gyrB.486	0	0	.	.	.
gyrB.487	0	0	.	.	.
gyrB.488	0	0	.	.	.
gyrB.489	0	0	.	.	.
gyrB.49	0	0	.	.	.
gyrB.490	0	0	.	.	.
gyrB.491	0	0	.	.	.
gyrB.492	0	0	.	.	.
gyrB.493	0	0	.	.	.
gyrB.494	0	0	.	.	.
gyrB.495	0	0	.	.	.
gyrB.496	0	0	.	.	.
gyrB.497	0	0	.	.	.
gyrB.498	0	0	.	.	.
gyrB.499	0	0	.	.	.
gyrB.5	0	0	.	.	.
gyrB.50	0	0	.	.	.
gyrB.500	0	0	.	.	.
gyrB.501	0	0	.	.	.
gyrB.502	0	0	.	.	.
gyrB.503	0	0	.	.	.
gyrB.504	0	0	.	.	.
gyrB.505	0	0	.	.	.
gyrB.506	0	0	.	.	.
gyrB.507	0	0	.	.	.
gyrB.508	0	0	.	.	.
gyrB.509	0	0	.	.	.
gyrB.51	0	0	.	.	.
gyrB.510	0	0	.	.	.
gyrB.511	0	0	.	.	.
gyrB.512	0	0	.	.	.
gyrB.513	0	0	.	.	.
gyrB.514	0	0	.	.	.
gyrB.515	0	0	.	.	.
gyrB.516	0	0	.	.	.
gyrB.517	0	0	.	.	.
gyrB.518	0	0	.	.	.
gyrB.519	0	0	.	.	.
gyrB.52	0	0	.	.	.
gyrB.520	0	0	.	.	.
gyrB.521	0	0	.	.	.
gyrB.522	0	0	.	.	.
gyrB.523	0	0	.	.	.
gyrB.524	0	0	.	.	.
gyrB.525	0	0	.	.	.
gyrB.526	0	0	.	.	.
gyrB.527	0	0	.	.	.
gyrB.528	0	0	.	.	.
gyrB.529	0	0	.	.	.
gyrB.53	0	0	.	.	.
gyrB.530	0	0	.	.	.
gyrB.531	0	0	.	.	.
gyrB.532	0	0	.	.	.
gyrB.533	0	0	.	.	.
gyrB.534	0	0	.	.	.
gyrB.535	0	0	.	.	.
gyrB.536	0	0	.	.	.
gyrB.537	0	0	.	.	.
gyrB.538	0	0	.	.	.
gyrB.539	0	0	.	.	.
gyrB.54	0	0	.	.	.
gyrB.540	0	0	.	.	.
gyrB.541	0	0	.	.	.
gyrB.542	0	0	.	.	.
gyrB.543	0	0	.	.	.
gyrB.544	0	0	.	.	.
gyrB.545	0	0	.	.	.
gyrB.546	0	0	.	.	.
gyrB.547	0	0	.	.	.
gyrB.548	0	0	.	.	.
gyrB.549	0	0	.	.	.
gyrB.55	0	0	.	.	.
gyrB.550	0	0	.	.	.
gyrB.551	0	0	.	.	.
gyrB.552	0	0	.	.	.
gyrB.553	0	0	.	.	.
gyrB.554	0	0	.	.	.
gyrB.555	0	0	.	.	.
gyrB.556	0	0	.	.	.
gyrB.557	0	0	.	.	.
gyrB.558	0	0	.	.	.
gyrB.559	0	0	.	.	.
gyrB.56	0	0	.	.	.
gyrB.560	0	0	.	.	.
gyrB.561	0	0	.	.	.
gyrB.562	0	0	.	.	.
gyrB.563	0	0	.	.	.
gyrB.564	0	0	.	.	.
gyrB.565	0	0	.	.	.
gyrB.566	0	0	.	.	.
gyrB.567	0	0	.	.	.
gyrB.568	0	0	.	.	.
gyrB.569	0	0	.	.	.
gyrB.57	0	0	.	.	.
gyrB.570	0	0	.	.	.
gyrB.571	0	0	.	.	.
gyrB.572	0	0	.	.	.
gyrB.573	0	0	.	.	.
gyrB.574	0	0	.	.	.
gyrB.575	0	0	.	.	.
gyrB.576	0	0	.	.	.
gyrB.577	0	0	.	.	.
gyrB.578	0	0	.	.	.
gyrB.579	0	0	.	.	.
gyrB.58	0	0	.	.	.
gyrB.580	0	0	.	.	.
gyrB.581	0	0	.	.	.
gyrB.582	0	0	.	.	.
gyrB.583	0	0	.	.	.
gyrB.584	0	0	.	.	.
gyrB.585	0	0	.	.	.
gyrB.586	0	0	.	.	.
gyrB.587	0	0	.	.	.
gyrB.588	0	0	.	.	.
gyrB.589	0	0	.	.	.
gyrB.59	0	0	.	.	.
gyrB.590	0	0	.	.	.
gyrB.591	0	0	.	.	.
gyrB.592	0	0	.	.	.
gyrB.593	0	0	.	.	.
gyrB.594	0	0	.	.	.
gyrB.595	0	0	.	.	.
gyrB.596	0	0	.	.	.
gyrB.597	0	0	.	.	.
gyrB.598	0	0	.	.	.
gyrB.599	0	0	.	.	.
gyrB.6	0	0	.	.	.
gyrB.60	0	0	.	.	.
gyrB.600	0	0	.	.	.
gyrB.601	0	0	.	.	.
gyrB.602	0	0	.	.	.
gyrB.603	0	0	.	.	.
gyrB.61	0	0	.	.	.
gyrB.62	0	0	.	.	.
gyrB.63	0	0	.	.	.
gyrB.64	0	0	.	.	.
gyrB.65	0	0	.	.	.
gyrB.66	0	0	.	.	.
gyrB.67	0	0	.	.	.
gyrB.68	0	0	.	.	.
gyrB.69	0	0	.	.	.
gyrB.7	0	0	.	.	.
gyrB.70	0	0	.	.	.
gyrB.71	0	0	.	.	.
gyrB.72	0	0	.	.	.
gyrB.73	0	0	.	.	.
gyrB.74	0	0	.	.	.
gyrB.75	0	0	.	.	.
gyrB.76	0	0	.	.	.
gyrB.77	0	0	.	.	.
gyrB.78	0	0	.	.	.
gyrB.79	0	0	.	.	.
gyrB.8	0	0	.	.	.
gyrB.80	0	0	.	.	.
gyrB.81	0	0	.	.	.
gyrB.82	0	0	.	.	.
gyrB.83	0	0	.	.	.
gyrB.84	0	0	.	.	.
gyrB.85	0	0	.	.	.
gyrB.86	0	0	.	.	.
gyrB.87	0	0	.	.	.
gyrB.88	0	0	.	.	.
gyrB.89	0	0	.	.	.
gyrB.9	0	0	.	.	.
gyrB.90	0	0	.	.	.
gyrB.91	0	0	.	.	.
gyrB.92	0	0	.	.	.
gyrB.93	0	0	.	.	.
gyrB.94	0	0	.	.	.
gyrB.95	0	0	.	.	.
gyrB.96	0	0	.	.	.
gyrB.97	0	0	.	.	.
gyrB.98	0	0	.	.	.
gyrB.99	0	0	.	.	.
pntA.1	0	0	.	.	.
pntA.10	0	0	.	.	.
pntA.100	0	0	.	.	.
pntA.101	0	0	.	.	.
pntA.102	0	0	.	.	.
pntA.103	0	0	.	.	.
pntA.104	0	0	.	.	.
pntA.105	0	0	.	.	.
pntA.106	0	0	.	.	.
pntA.107	0	0	.	.	.
pntA.108	0	0	.	.	.
pntA.109	0	0	.	.	.
pntA.11	0	0	.	.	.
pntA.110	0	0	.	.	.
pntA.111	0	0	.	.	.
pntA.112	0	0	.	.	.
pntA.113	0	0	.	.	.
pntA.114	0	0	.	.	.
pntA.115	0	0	.	.	.
pntA.116	0	0	.	.	.
pntA.117	0	0	.	.	.
pntA.118	0	0	.	.	.
pntA.119	0	0	.	.	.
pntA.12	0	0	.	.	.
pntA.120	0	0	.	.	.
pntA.121	0	0	.	.	.
pntA.122	0	0	.	.	.
pntA.123	0	0	.	.	.
pntA.124	0	0	.	.	.
pntA.125	0	0	.	.	.
pntA.126	0	0	.	.	.
pntA.127	0	0	.	.	.
pntA.128	0	0	.	.	.
pntA.129	0	0	.	.	.
pntA.13	0	0	.	.	.
pntA.130	0	0	.	.	.
pntA.131	0	0	.	.	.
pntA.132	0	0	.	.	.
pntA.133	0	0	.	.	.
pntA.134	0	0	.	.	.
pntA.135	0	0	.	.	.
pntA.136	0	0	.	.	.
pntA.137	0	0	.	.	.
pntA.138	0	0	.	.	.
pntA.139	0	0	.	.	.
pntA.14	0	0	.	.	.
pntA.140	0	0	.	.	.
pntA.141	0	0	.	.	.
pntA.142	0	0	.	.	.
pntA.143	0	0	.	.	.
pntA.144	0	0	.	.	.
pntA.145	0	0	.	.	.
pntA.146	0	0	.	.	.
pntA.147	0	0	.	.	.
pntA.148	0	0	.	.	.
pntA.149	0	0	.	.	.
pntA.15	0	0	.	.	.
pntA.150	0	0	.	.	.
pntA.151	0	0	.	.	.
pntA.152	0	0	.	.	.
pntA.153	0	0	.	.	.
pntA.154	0	0	.	.	.
pntA.155	0	0	.	.	.
pntA.156	0	0	.	.	.
pntA.157	0	0	.	.	.
pntA.158	0	0	.	.	.
pntA.159	0	0	.	.	.
pntA.16	0	0	.	.	.
pntA.160	0	0	.	.	.
pntA.161	0	0	.	.	.
pntA.162	0	0	.	.	.
pntA.163	0	0	.	.	.
pntA.164	0	0	.	.	.
pntA.165	0	0	.	.	.
pntA.166	0	0	.	.	.
pntA.167	0	0	.	.	.
pntA.168	0	0	.	.	.
pntA.169	0	0	.	.	.
pntA.17	0	0	.	.	.
pntA.170	0	0	.	.	.
pntA.171	0	0	.	.	.
pntA.172	0	0	.	.	.
pntA.173	0	0	.	.	.
pntA.174	0	0	.	.	.
pntA.175	0	0	.	.	.
pntA.176	0	0	.	.	.
pntA.177	0	0	.	.	.
pntA.178	0	0	.	.	.
pntA.179	0	0	.	.	.
pntA.18	0	0	.	.	.
pntA.180	0	0	.	.	.
pntA.181	0	0	.	.	.
pntA.182	0	0	.	.	.
pntA.183	0	0	.	.	.
pntA.184	0	0	.	.	.
pntA.185	0	0	.	.	.
pntA.186	0	0	.	.	.
pntA.187	0	0	.	.	.
pntA.188	0	0	.	.	.
pntA.189	0	0	.	.	.
pntA.19	0	0	.	.	.
pntA.190	0	0	.	.	.
pntA.191	0	0	.	.	.
pntA.192	0	0	.	.	.
pntA.193	0	0	.	.	.
pntA.194	0	0	.	.	.
pntA.195	0	0	.	.	.
pntA.196	0	0	.	.	.
pntA.197	0	0	.	.	.
pntA.198	0	0	.	.	.
pntA.199	0	0	.	.	.
pntA.2	0	0	.	.	.
pntA.20	0	0	.	.	.
pntA.200	0	0	.	.	.
pntA.201	0	0	.	.	.
pntA.202	0	0	.	.	.
pntA.203	0	0	.	.	.
pntA.204	0	0	.	.	.
pntA.205	0	0	.	.	.
pntA.206	0	0	.	.	.
pntA.207	0	0	.	.	.
pntA.208	0	0	.	.	.
pntA.209	0	0	.	.	.
pntA.21	0	0	.	.	.
pntA.210	0	0	.	.	.
pntA.211	0	0	.	.	.
pntA.212	0	0	.	.	.
pntA.213	0	0	.	.	.
pntA.214	0	0	.	.	.
pntA.215	0	0	.	.	.
pntA.216	0	0	.	.	.
pntA.217	0	0	.	.	.
pntA.218	0	0	.	.	.
pntA.219	0	0	.	.	.
pntA.22	0	0	.	.	.
pntA.220	0	0	.	.	.
pntA.221	0	0	.	.	.
pntA.222	0	0	.	.	.
pntA.223	0	0	.	.	.
pntA.224	0	0	.	.	.
pntA.225	0	0	.	.	.
pntA.226	0	0	.	.	.
pntA.227	0	0	.	.	.
pntA.228	0	0	.	.	.
pntA.229	0	0	.	.	.
pntA.23	0	0	.	.	.
pntA.230	0	0	.	.	.
pntA.231	0	0	.	.	.
pntA.232	0	0	.	.	.
pntA.233	0	0	.	.	.
pntA.234	0	0	.	.	.
pntA.235	0	0	.	.	.
pntA.236	0	0	.	.	.
pntA.237	0	0	.	.	.
pntA.238	0	0	.	.	.
pntA.239	0	0	.	.	.
pntA.24	0	0	.	.	.
pntA.240	0	0	.	.	.
pntA.241	0	0	.	.	.
pntA.242	0	0	.	.	.
pntA.243	0	0	.	.	.
pntA.244	0	0	.	.	.
pntA.245	0	0	.	.	.
pntA.246	0	0	.	.	.
pntA.247	0	0	.	.	.
pntA.248	0	0	.	.	.
pntA.249	0	0	.	.	.
pntA.25	0	0	.	.	.
pntA.250	0	0	.	.	.
pntA.251	0	0	.	.	.
pntA.252	0	0	.	.	.
pntA.253	0	0	.	.	.
pntA.254	0	0	.	.	.
pntA.255	0	0	.	.	.
pntA.256	0	0	.	.	.
pntA.257	0	0	.	.	.
pntA.258	0	0	.	.	.
pntA.259	0	0	.	.	.
pntA.26	0	0	.	.	.
pntA.260	0	0	.	.	.
pntA.261	0	0	.	.	.
pntA.262	0	0	.	.	.
pntA.263	0	0	.	.	.
pntA.264	0	0	.	.	.
pntA.265	0	0	.	.	.
pntA.266	0	0	.	.	.
pntA.267	0	0	.	.	.
pntA.268	0	0	.	.	.
pntA.269	0	0	.	.	.
pntA.27	0	0	.	.	.
pntA.270	0	0	.	.	.
pntA.271	0	0	.	.	.
pntA.272	0	0	.	.	.
pntA.273	0	0	.	.	.
pntA.274	0	0	.	.	.
pntA.275	0	0	.	.	.
pntA.276	0	0	.	.	.
pntA.277	0	0	.	.	.
pntA.278	0	0	.	.	.
pntA.279	0	0	.	.	.
pntA.28	0	0	.	.	.
pntA.280	0	0	.	.	.
pntA.281	0	0	.	.	.
pntA.282	0	0	.	.	.
pntA.283	0	0	.	.	.
pntA.284	0	0	.	.	.
pntA.285	0	0	.	.	.
pntA.286	0	0	.	.	.
pntA.287	0	0	.	.	.
pntA.288	0	0	.	.	.
pntA.289	0	0	.	.	.
pntA.29	0	0	.	.	.
pntA.290	0	0	.	.	.
pntA.291	0	0	.	.	.
pntA.292	0	0	.	.	.
pntA.293	0	0	.	.	.
pntA.294	0	0	.	.	.
pntA.295	0	0	.	.	.
pntA.296	0	0	.	.	.
pntA.297	0	0	.	.	.
pntA.298	0	0	.	.	.
pntA.299	0	0	.	.	.
pntA.3	0	0	.	.	.
pntA.30	0	0	.	.	.
pntA.300	0	0	.	.	.
pntA.301	0	0	.	.	.
pntA.302	0	0	.	.	.
pntA.303	0	0	.	.	.
pntA.304	0	0	.	.	.
pntA.305	0	0	.	.	.
pntA.306	0	0	.	.	.
pntA.307	0	0	.	.	.
pntA.31	0	0	.	.	.
pntA.32	0	0	.	.	.
pntA.33	0	0	.	.	.
pntA.34	0	0	.	.	.
pntA.35	0	0	.	.	.
pntA.36	0	0	.	.	.
pntA.37	0	0	.	.	.
pntA.38	0	0	.	.	.
pntA.39	0	0	.	.	.
pntA.4	0	0	.	.	.
pntA.40	0	0	.	.	.
pntA.41	0	0	.	.	.
pntA.42	0	0	.	.	.
pntA.43	0	0	.	.	.
pntA.44	0	0	.	.	.
pntA.45	0	0	.	.	.
pntA.46	0	0	.	.	.
pntA.47	0	0	.	.	.
pntA.48	0	0	.	.	.
pntA.49	0	0	.	.	.
pntA.5	0	0	.	.	.
pntA.50	0	0	.	.	.
pntA.51	0	0	.	.	.
pntA.52	0	0	.	.	.
pntA.53	0	0	.	.	.
pntA.54	0	0	.	.	.
pntA.55	0	0	.	.	.
pntA.56	0	0	.	.	.
pntA.57	0	0	.	.	.
pntA.58	0	0	.	.	.
pntA.59	0	0	.	.	.
pntA.6	0	0	.	.	.
pntA.60	0	0	.	.	.
pntA.61	0	0	.	.	.
pntA.62	0	0	.	.	.
pntA.63	0	0	.	.	.
pntA.64	0	0	.	.	.
pntA.65	0	0	.	.	.
pntA.66	0	0	.	.	.
pntA.67	0	0	.	.	.
pntA.68	0	0	.	.	.
pntA.69	0	0	.	.	.
pntA.7	0	0	.	.	.
pntA.70	0	0	.	.	.
pntA.71	0	0	.	.	.
pntA.72	0	0	.	.	.
pntA.73	0	0	.	.	.
pntA.74	0	0	.	.	.
pntA.75	0	0	.	.	.
pntA.76	0	0	.	.	.
pntA.77	0	0	.	.	.
pntA.78	0	0	.	.	.
pntA.79	0	0	.	.	.
pntA.8	0	0	.	.	.
pntA.80	0	0	.	.	.
pntA.81	0	0	.	.	.
pntA.82	0	0	.	.	.
pntA.83	0	0	.	.	.
pntA.84	0	0	.	.	.
pntA.85	0	0	.	.	.
pntA.86	0	0	.	.	.
pntA.87	0	0	.	.	.
pntA.88	0	0	.	.	.
pntA.89	0	0	.	.	.
pntA.9	0	0	.	.	.
pntA.90	0	0	.	.	.
pntA.91	0	0	.	.	.
pntA.92	0	0	.	.	.
pntA.93	0	0	.	.	.
pntA.94	0	0	.	.	.
pntA.95	0	0	.	.	.
pntA.96	0	0	.	.	.
pntA.97	0	0	.	.	.
pntA.98	0	0	.	.	.
pntA.99	0	0	.	.	.
pyrC.1	0	0	.	.	.
pyrC.10	0	0	.	.	.
pyrC.100	0	0	.	.	.
pyrC.101	0	0	.	.	.
pyrC.102	0	0	.	.	.
pyrC.103	0	0	.	.	.
pyrC.104	0	0	.	.	.
pyrC.105	0	0	.	.	.
pyrC.106	0	0	.	.	.
pyrC.107	0	0	.	.	.
pyrC.108	0	0	.	.	.
pyrC.109	0	0	.	.	.
pyrC.11	0	0	.	.	.
pyrC.110	0	0	.	.	.
pyrC.111	0	0	.	.	.
pyrC.112	0	0	.	.	.
pyrC.113	0	0	.	.	.
pyrC.114	0	0	.	.	.
pyrC.115	0	0	.	.	.
pyrC.116	0	0	.	.	.
pyrC.117	0	0	.	.	.
pyrC.118	0	0	.	.	.
pyrC.119	0	0	.	.	.
pyrC.12	0	0	.	.	.
pyrC.120	0	0	.	.	.
pyrC.121	0	0	.	.	.
pyrC.122	0	0	.	.	.
pyrC.123	0	0	.	.	.
pyrC.124	0	0	.	.	.
pyrC.125	0	0	.	.	.
pyrC.126	0	0	.	.	.
pyrC.127	0	0	.	.	.
pyrC.128	0	0	.	.	.
pyrC.129	0	0	.	.	.
pyrC.13	0	0	.	.	.
pyrC.130	0	0	.	.	.
pyrC.131	0	0	.	.	.
pyrC.132	0	0	.	.	.
pyrC.133	0	0	.	.	.
pyrC.134	0	0	.	.	.
pyrC.135	0	0	.	.	.
pyrC.136	0	0	.	.	.
pyrC.137	0	0	.	.	.
pyrC.138	0	0	.	.	.
pyrC.139	0	0	.	.	.
pyrC.14	0	0	.	.	.
pyrC.140	0	0	.	.	.
pyrC.141	0	0	.	.	.
pyrC.142	0	0	.	.	.
pyrC.143	0	0	.	.	.
pyrC.144	0	0	.	.	.
pyrC.145	0	0	.	.	.
pyrC.146	0	0	.	.	.
pyrC.147	0	0	.	.	.
pyrC.148	0	0	.	.	.
pyrC.149	0	0	.	.	.
pyrC.15	0	0	.	.	.
pyrC.150	0	0	.	.	.
pyrC.151	0	0	.	.	.
pyrC.152	0	0	.	.	.
pyrC.153	0	0	.	.	.
pyrC.154	0	0	.	.	.
pyrC.155	0	0	.	.	.
pyrC.156	0	0	.	.	.
pyrC.157	0	0	.	.	.
pyrC.158	0	0	.	.	.
pyrC.159	0	0	.	.	.
pyrC.16	0	0	.	.	.
pyrC.160	0	0	.	.	.
pyrC.161	0	0	.	.	.
pyrC.162	0	0	.	.	.
pyrC.163	0	0	.	.	.
pyrC.164	0	0	.	.	.
pyrC.165	0	0	.	.	.
pyrC.166	0	0	.	.	.
pyrC.167	0	0	.	.	.
pyrC.168	0	0	.	.	.
pyrC.169	0	0	.	.	.
pyrC.17	0	0	.	.	.
pyrC.170	0	0	.	.	.
pyrC.171	0	0	.	.	.
pyrC.172	0	0	.	.	.
pyrC.173	0	0	.	.	.
pyrC.174	0	0	.	.	.
pyrC.175	0	0	.	.	.
pyrC.176	0	0	.	.	.
pyrC.177	0	0	.	.	.
pyrC.178	0	0	.	.	.
pyrC.179	0	0	.	.	.
pyrC.18	0	0	.	.	.
pyrC.180	0	0	.	.	.
pyrC.181	0	0	.	.	.
pyrC.182	0	0	.	.	.
pyrC.183	0	0	.	.	.
pyrC.184	0	0	.	.	.
pyrC.185	0	0	.	.	.
pyrC.186	0	0	.	.	.
pyrC.187	0	0	.	.	.
pyrC.188	0	0	.	.	.
pyrC.189	0	0	.	.	.
pyrC.19	0	0	.	.	.
pyrC.190	0	0	.	.	.
pyrC.191	0	0	.	.	.
pyrC.192	0	0	.	.	.
pyrC.193	0	0	.	.	.
pyrC.194	0	0	.	.	.
pyrC.195	0	0	.	.	.
pyrC.196	0	0	.	.	.
pyrC.197	0	0	.	.	.
pyrC.198	0	0	.	.	.
pyrC.199	0	0	.	.	.
pyrC.2	0	0	.	.	.
pyrC.20	0	0	.	.	.
pyrC.200	0	0	.	.	.
pyrC.201	0	0	.	.	.
pyrC.202	0	0	.	.	.
pyrC.203	0	0	.	.	.
pyrC.204	0	0	.	.	.
pyrC.205	0	0	.	.	.
pyrC.206	0	0	.	.	.
pyrC.207	0	0	.	.	.
pyrC.208	0	0	.	.	.
pyrC.209	0	0	.	.	.
pyrC.21	0	0	.	.	.
pyrC.210	0	0	.	.	.
pyrC.211	0	0	.	.	.
pyrC.212	0	0	.	.	.
pyrC.213	0	0	.	.	.
pyrC.214	0	0	.	.	.
pyrC.215	0	0	.	.	.
pyrC.216	0	0	.	.	.
pyrC.217	0	0	.	.	.
pyrC.218	0	0	.	.	.
pyrC.219	0	0	.	.	.
pyrC.22	0	0	.	.	.
pyrC.220	0	0	.	.	.
pyrC.221	0	0	.	.	.
pyrC.222	0	0	.	.	.
pyrC.223	0	0	.	.	.
pyrC.224	0	0	.	.	.
pyrC.225	0	0	.	.	.
pyrC.226	0	0	.	.	.
pyrC.227	0	0	.	.	.
pyrC.228	0	0	.	.	.
pyrC.229	0	0	.	.	.
pyrC.23	0	0	.	.	.
pyrC.230	0	0	.	.	.
pyrC.231	0	0	.	.	.
pyrC.232	0	0	.	.	.
pyrC.233	0	0	.	.	.
pyrC.234	0	0	.	.	.
pyrC.235	0	0	.	.	.
pyrC.236	0	0	.	.	.
pyrC.237	0	0	.	.	.
pyrC.238	0	0	.	.	.
pyrC.239	0	0	.	.	.
pyrC.24	0	0	.	.	.
pyrC.240	0	0	.	.	.
pyrC.241	0	0	.	.	.
pyrC.242	0	0	.	.	.
pyrC.243	0	0	.	.	.
pyrC.244	0	0	.	.	.
pyrC.245	0	0	.	.	.
pyrC.246	0	0	.	.	.
pyrC.247	0	0	.	.	.
pyrC.248	0	0	.	.	.
pyrC.249	0	0	.	.	.
pyrC.25	0	0	.	.	.
pyrC.250	0	0	.	.	.
pyrC.251	0	0	.	.	.
pyrC.252	0	0	.	.	.
pyrC.253	0	0	.	.	.
pyrC.254	0	0	.	.	.
pyrC.255	0	0	.	.	.
pyrC.256	0	0	.	.	.
pyrC.257	0	0	.	.	.
pyrC.258	0	0	.	.	.
pyrC.259	0	0	.	.	.
pyrC.26	0	0	.	.	.
pyrC.260	0	0	.	.	.
pyrC.261	0	0	.	.	.
pyrC.262	0	0	.	.	.
pyrC.263	0	0	.	.	.
pyrC.264	0	0	.	.	.
pyrC.265	0	0	.	.	.
pyrC.266	0	0	.	.	.
pyrC.267	0	0	.	.	.
pyrC.268	0	0	.	.	.
pyrC.269	0	0	.	.	.
pyrC.27	0	0	.	.	.
pyrC.270	0	0	.	.	.
pyrC.271	0	0	.	.	.
pyrC.272	0	0	.	.	.
pyrC.273	0	0	.	.	.
pyrC.274	0	0	.	.	.
pyrC.275	0	0	.	.	.
pyrC.276	0	0	.	.	.
pyrC.277	0	0	.	.	.
pyrC.278	0	0	.	.	.
pyrC.279	0	0	.	.	.
pyrC.28	0	0	.	.	.
pyrC.280	0	0	.	.	.
pyrC.281	0	0	.	.	.
pyrC.282	0	0	.	.	.
pyrC.283	0	0	.	.	.
pyrC.284	0	0	.	.	.
pyrC.285	0	0	.	.	.
pyrC.286	0	0	.	.	.
pyrC.287	0	0	.	.	.
pyrC.288	0	0	.	.	.
pyrC.289	0	0	.	.	.
pyrC.29	0	0	.	.	.
pyrC.290	0	0	.	.	.
pyrC.291	0	0	.	.	.
pyrC.292	0	0	.	.	.
pyrC.293	0	0	.	.	.
pyrC.294	0	0	.	.	.
pyrC.295	0	0	.	.	.
pyrC.296	0	0	.	.	.
pyrC.297	0	0	.	.	.
pyrC.298	0	0	.	.	.
pyrC.299	0	0	.	.	.
pyrC.3	0	0	.	.	.
pyrC.30	0	0	.	.	.
pyrC.300	0	0	.	.	.
pyrC.301	0	0	.	.	.
pyrC.302	0	0	.	.	.
pyrC.303	0	0	.	.	.
pyrC.304	0	0	.	.	.
pyrC.305	0	0	.	.	.
pyrC.306	0	0	.	.	.
pyrC.307	0	0	.	.	.
pyrC.308	0	0	.	.	.
pyrC.309	0	0	.	.	.
pyrC.31	0	0	.	.	.
pyrC.310	0	0	.	.	.
pyrC.311	0	0	.	.	.
pyrC.312	0	0	.	.	.
pyrC.313	0	0	.	.	.
pyrC.314	0	0	.	.	.
pyrC.315	0	0	.	.	.
pyrC.316	0	0	.	.	.
pyrC.317	0	0	.	.	.
pyrC.318	0	0	.	.	.
pyrC.319	0	0	.	.	.
pyrC.32	0	0	.	.	.
pyrC.320	0	0	.	.	.
pyrC.321	0	0	.	.	.
pyrC.322	0	0	.	.	.
pyrC.323	0	0	.	.	.
pyrC.324	0	0	.	.	.
pyrC.325	0	0	.	.	.
pyrC.326	0	0	.	.	.
pyrC.327	0	0	.	.	.
pyrC.328	0	0	.	.	.
pyrC.329	0	0	.	.	.
pyrC.33	0	0	.	.	.
pyrC.330	0	0	.	.	.
pyrC.331	0	0	.	.	.
pyrC.332	0	0	.	.	.
pyrC.333	0	0	.	.	.
pyrC.334	0	0	.	.	.
pyrC.335	0	0	.	.	.
pyrC.336	0	0	.	.	.
pyrC.337	0	0	.	.	.
pyrC.338	0	0	.	.	.
pyrC.339	0	0	.	.	.
pyrC.34	0	0	.	.	.
pyrC.340	0	0	.	.	.
pyrC.341	0	0	.	.	.
pyrC.342	0	0	.	.	.
pyrC.343	0	0	.	.	.
pyrC.344	0	0	.	.	.
pyrC.345	0	0	.	.	.
pyrC.346	0	0	.	.	.
pyrC.347	0	0	.	.	.
pyrC.348	0	0	.	.	.
pyrC.349	0	0	.	.	.
pyrC.35	0	0	.	.	.
pyrC.350	0	0	.	.	.
pyrC.351	0	0	.	.	.
pyrC.352	0	0	.	.	.
pyrC.353	0	0	.	.	.
pyrC.354	0	0	.	.	.
pyrC.355	0	0	.	.	.
pyrC.356	0	0	.	.	.
pyrC.357	0	0	.	.	.
pyrC.358	0	0	.	.	.
pyrC.359	0	0	.	.	.
pyrC.36	0	0	.	.	.
pyrC.360	0	0	.	.	.
pyrC.361	0	0	.	.	.
pyrC.362	0	0	.	.	.
pyrC.363	0	0	.	.	.
pyrC.364	0	0	.	.	.
pyrC.365	0	0	.	.	.
pyrC.366	0	0	.	.	.
pyrC.367	0	0	.	.	.
pyrC.368	0	0	.	.	.
pyrC.369	0	0	.	.	.
pyrC.37	0	0	.	.	.
pyrC.370	0	0	.	.	.
pyrC.371	0	0	.	.	.
pyrC.372	0	0	.	.	.
pyrC.373	0	0	.	.	.
pyrC.374	0	0	.	.	.
pyrC.375	0	0	.	.	.
pyrC.376	0	0	.	.	.
pyrC.377	0	0	.	.	.
pyrC.378	0	0	.	.	.
pyrC.379	0	0	.	.	.
pyrC.38	0	0	.	.	.
pyrC.380	0	0	.	.	.
pyrC.381	0	0	.	.	.
pyrC.382	0	0	.	.	.
pyrC.383	0	0	.	.	.
pyrC.384	0	0	.	.	.
pyrC.385	0	0	.	.	.
pyrC.386	0	0	.	.	.
pyrC.387	0	0	.	.	.
pyrC.388	0	0	.	.	.
pyrC.389	0	0	.	.	.
pyrC.39	0	0	.	.	.
pyrC.390	0	0	.	.	.
pyrC.391	0	0	.	.	.
pyrC.392	0	0	.	.	.
pyrC.393	0	0	.	.	.
pyrC.394	0	0	.	.	.
pyrC.395	0	0	.	.	.
pyrC.396	0	0	.	.	.
pyrC.397	0	0	.	.	.
pyrC.398	0	0	.	.	.
pyrC.399	0	0	.	.	.
pyrC.4	0	0	.	.	.
pyrC.40	0	0	.	.	.
pyrC.400	0	0	.	.	.
pyrC.401	0	0	.	.	.
pyrC.402	0	0	.	.	.
pyrC.403	0	0	.	.	.
pyrC.404	0	0	.	.	.
pyrC.405	0	0	.	.	.
pyrC.406	0	0	.	.	.
pyrC.407	0	0	.	.	.
pyrC.408	0	0	.	.	.
pyrC.409	0	0	.	.	.
pyrC.41	0	0	.	.	.
pyrC.410	0	0	.	.	.
pyrC.411	0	0	.	.	.
pyrC.412	0	0	.	.	.
pyrC.413	0	0	.	.	.
pyrC.414	0	0	.	.	.
pyrC.415	0	0	.	.	.
pyrC.416	0	0	.	.	.
pyrC.417	0	0	.	.	.
pyrC.418	0	0	.	.	.
pyrC.419	0	0	.	.	.
pyrC.42	0	0	.	.	.
pyrC.420	0	0	.	.	.
pyrC.421	0	0	.	.	.
pyrC.422	0	0	.	.	.
pyrC.423	0	0	.	.	.
pyrC.424	0	0	.	.	.
pyrC.425	0	0	.	.	.
pyrC.426	0	0	.	.	.
pyrC.427	0	0	.	.	.
pyrC.428	0	0	.	.	.
pyrC.429	0	0	.	.	.
pyrC.43	0	0	.	.	.
pyrC.430	0	0	.	.	.
pyrC.431	0	0	.	.	.
pyrC.432	0	0	.	.	.
pyrC.433	0	0	.	.	.
pyrC.434	0	0	.	.	.
pyrC.435	0	0	.	.	.
pyrC.436	0	0	.	.	.
pyrC.437	0	0	.	.	.
pyrC.438	0	0	.	.	.
pyrC.439	0	0	.	.	.
pyrC.44	0	0	.	.	.
pyrC.440	0	0	.	.	.
pyrC.441	0	0	.	.	.
pyrC.442	0	0	.	.	.
pyrC.443	0	0	.	.	.
pyrC.444	0	0	.	.	.
pyrC.445	0	0	.	.	.
pyrC.446	0	0	.	.	.
pyrC.447	0	0	.	.	.
pyrC.448	0	0	.	.	.
pyrC.449	0	0	.	.	.
pyrC.45	0	0	.	.	.
pyrC.450	0	0	.	.	.
pyrC.451	0	0	.	.	.
pyrC.452	0	0	.	.	.
pyrC.453	0	0	.	.	.
pyrC.454	0	0	.	.	.
pyrC.455	0	0	.	.	.
pyrC.456	0	0	.	.	.
pyrC.457	0	0	.	.	.
pyrC.458	0	0	.	.	.
pyrC.459	0	0	.	.	.
pyrC.46	0	0	.	.	.
pyrC.460	0	0	.	.	.
pyrC.461	0	0	.	.	.
pyrC.462	0	0	.	.	.
pyrC.463	0	0	.	.	.
pyrC.464	0	0	.	.	.
pyrC.465	0	0	.	.	.
pyrC.466	0	0	.	.	.
pyrC.467	0	0	.	.	.
pyrC.468	0	0	.	.	.
pyrC.469	0	0	.	.	.
pyrC.47	0	0	.	.	.
pyrC.470	0	0	.	.	.
pyrC.471	0	0	.	.	.
pyrC.472	0	0	.	.	.
pyrC.473	0	0	.	.	.
pyrC.474	0	0	.	.	.
pyrC.475	0	0	.	.	.
pyrC.476	0	0	.	.	.
pyrC.477	0	0	.	.	.
pyrC.478	0	0	.	.	.
pyrC.479	0	0	.	.	.
pyrC.48	0	0	.	.	.
pyrC.480	0	0	.	.	.
pyrC.481	0	0	.	.	.
pyrC.482	0	0	.	.	.
pyrC.483	0	0	.	.	.
pyrC.484	0	0	.	.	.
pyrC.485	0	0	.	.	.
pyrC.486	0	0	.	.	.
pyrC.487	0	0	.	.	.
pyrC.488	0	0	.	.	.
pyrC.489	0	0	.	.	.
pyrC.49	0	0	.	.	.
pyrC.490	0	0	.	.	.
pyrC.491	0	0	.	.	.
pyrC.492	0	0	.	.	.
pyrC.493	0	0	.	.	.
pyrC.494	0	0	.	.	.
pyrC.495	0	0	.	.	.
pyrC.5	0	0	.	.	.
pyrC.50	0	0	.	.	.
pyrC.51	0	0	.	.	.
pyrC.52	0	0	.	.	.
pyrC.53	0	0	.	.	.
pyrC.54	0	0	.	.	.
pyrC.55	0	0	.	.	.
pyrC.56	0	0	.	.	.
pyrC.57	0	0	.	.	.
pyrC.58	0	0	.	.	.
pyrC.59	0	0	.	.	.
pyrC.6	0	0	.	.	.
pyrC.60	0	0	.	.	.
pyrC.61	0	0	.	.	.
pyrC.62	0	0	.	.	.
pyrC.63	0	0	.	.	.
pyrC.64	0	0	.	.	.
pyrC.65	0	0	.	.	.
pyrC.66	0	0	.	.	.
pyrC.67	0	0	.	.	.
pyrC.68	0	0	.	.	.
pyrC.69	0	0	.	.	.
pyrC.7	0	0	.	.	.
pyrC.70	0	0	.	.	.
pyrC.71	0	0	.	.	.
pyrC.72	0	0	.	.	.
pyrC.73	0	0	.	.	.
pyrC.74	0	0	.	.	.
pyrC.75	0	0	.	.	.
pyrC.76	0	0	.	.	.
pyrC.77	0	0	.	.	.
pyrC.78	0	0	.	.	.
pyrC.79	0	0	.	.	.
pyrC.8	0	0	.	.	.
pyrC.80	0	0	.	.	.
pyrC.81	0	0	.	.	.
pyrC.82	0	0	.	.	.
pyrC.83	0	0	.	.	.
pyrC.84	0	0	.	.	.
pyrC.85	0	0	.	.	.
pyrC.86	0	0	.	.	.
pyrC.87	0	0	.	.	.
pyrC.88	0	0	.	.	.
pyrC.89	0	0	.	.	.
pyrC.9	0	0	.	.	.
pyrC.90	0	0	.	.	.
pyrC.91	0	0	.	.	.
pyrC.92	0	0	.	.	.
pyrC.93	0	0	.	.	.
pyrC.94	0	0	.	.	.
pyrC.95	0	0	.	.	.
pyrC.96	0	0	.	.	.
pyrC.97	0	0	.	.	.
pyrC.98	0	0	.	.	.
pyrC.99	0	0	.	.	.
recA.1	0	0	.	.	.
recA.10	0	0	.	.	.
recA.100	0	0	.	.	.
recA.101	0	0	.	.	.
recA.102	0	0	.	.	.
recA.103	0	0	.	.	.
recA.104	0	0	.	.	.
recA.105	0	0	.	.	.
recA.106	0	0	.	.	.
recA.107	0	0	.	.	.
recA.108	0	0	.	.	.
recA.109	0	0	.	.	.
recA.11	0	0	.	.	.
recA.110	0	0	.	.	.
recA.111	0	0	.	.	.
recA.112	0	0	.	.	.
recA.113	0	0	.	.	.
recA.114	0	0	.	.	.
recA.115	0	0	.	.	.
recA.116	0	0	.	.	.
recA.117	0	0	.	.	.
recA.118	0	0	.	.	.
recA.119	0	0	.	.	.
recA.12	0	0	.	.	.
recA.120	0	0	.	.	.
recA.121	0	0	.	.	.
recA.122	0	0	.	.	.
recA.123	0	0	.	.	.
recA.124	0	0	.	.	.
recA.125	0	0	.	.	.
recA.126	0	0	.	.	.
recA.127	0	0	.	.	.
recA.128	0	0	.	.	.
recA.129	0	0	.	.	.
recA.13	0	0	.	.	.
recA.130	0	0	.	.	.
recA.131	0	0	.	.	.
recA.132	0	0	.	.	.
recA.133	0	0	.	.	.
recA.134	0	0	.	.	.
recA.135	0	0	.	.	.
recA.136	0	0	.	.	.
recA.137	0	0	.	.	.
recA.138	0	0	.	.	.
recA.139	0	0	.	.	.
recA.14	0	0	.	.	.
recA.140	0	0	.	.	.
recA.141	0	0	.	.	.
recA.142	0	0	.	.	.
recA.143	0	0	.	.	.
recA.144	0	0	.	.	.
recA.145	0	0	.	.	.
recA.146	0	0	.	.	.
recA.147	0	0	.	.	.
recA.148	0	0	.	.	.
recA.149	0	0	.	.	.
recA.15	0	0	.	.	.
recA.150	0	0	.	.	.
recA.151	0	0	.	.	.
recA.152	0	0	.	.	.
recA.153	0	0	.	.	.
recA.154	0	0	.	.	.
recA.155	0	0	.	.	.
recA.156	0	0	.	.	.
recA.157	0	0	.	.	.
recA.158	0	0	.	.	.
recA.159	0	0	.	.	.
recA.16	0	0	.	.	.
recA.160	0	0	.	.	.
recA.161	0	0	.	.	.
recA.162	0	0	.	.	.
recA.163	0	0	.	.	.
recA.164	0	0	.	.	.
recA.165	0	0	.	.	.
recA.166	0	0	.	.	.
recA.167	0	0	.	.	.
recA.168	0	0	.	.	.
recA.169	0	0	.	.	.
recA.17	0	0	.	.	.
recA.170	0	0	.	.	.
recA.171	0	0	.	.	.
recA.172	0	0	.	.	.
recA.173	0	0	.	.	.
recA.174	0	0	.	.	.
recA.175	0	0	.	.	.
recA.176	0	0	.	.	.
recA.177	0	0	.	.	.
recA.178	0	0	.	.	.
recA.179	0	0	.	.	.
recA.18	0	0	.	.	.
recA.180	0	0	.	.	.
recA.181	0	0	.	.	.
recA.182	0	0	.	.	.
recA.183	0	0	.	.	.
recA.184	0	0	.	.	.
recA.185	0	0	.	.	.
recA.186	0	0	.	.	.
recA.187	0	0	.	.	.
recA.188	0	0	.	.	.
recA.189	0	0	.	.	.
recA.19	0	0	.	.	.
recA.190	0	0	.	.	.
recA.191	0	0	.	.	.
recA.192	0	0	.	.	.
recA.193	0	0	.	.	.
recA.194	0	0	.	.	.
recA.195	0	0	.	.	.
recA.196	0	0	.	.	.
recA.197	0	0	.	.	.
recA.198	0	0	.	.	.
recA.199	0	0	.	.	.
recA.2	0	0	.	.	.
recA.20	0	0	.	.	.
recA.200	0	0	.	.	.
recA.201	0	0	.	.	.
recA.202	0	0	.	.	.
recA.203	0	0	.	.	.
recA.204	0	0	.	.	.
recA.205	0	0	.	.	.
recA.206	0	0	.	.	.
recA.207	0	0	.	.	.
recA.208	0	0	.	.	.
recA.209	0	0	.	.	.
recA.21	0	0	.	.	.
recA.210	0	0	.	.	.
recA.211	0	0	.	.	.
recA.212	0	0	.	.	.
recA.213	0	0	.	.	.
recA.214	0	0	.	.	.
recA.215	0	0	.	.	.
recA.216	0	0	.	.	.
recA.217	0	0	.	.	.
recA.218	0	0	.	.	.
recA.219	0	0	.	.	.
recA.22	0	0	.	.	.
recA.220	0	0	.	.	.
recA.221	0	0	.	.	.
recA.222	0	0	.	.	.
recA.223	0	0	.	.	.
recA.224	0	0	.	.	.
recA.225	0	0	.	.	.
recA.226	0	0	.	.	.
recA.227	0	0	.	.	.
recA.228	0	0	.	.	.
recA.229	0	0	.	.	.
recA.23	0	0	.	.	.
recA.230	0	0	.	.	.
recA.231	0	0	.	.	.
recA.232	0	0	.	.	.
recA.233	0	0	.	.	.
recA.234	0	0	.	.	.
recA.235	0	0	.	.	.
recA.236	0	0	.	.	.
recA.237	0	0	.	.	.
recA.238	0	0	.	.	.
recA.239	0	0	.	.	.
recA.24	0	0	.	.	.
recA.240	0	0	.	.	.
recA.241	0	0	.	.	.
recA.242	0	0	.	.	.
recA.243	0	0	.	.	.
recA.244	0	0	.	.	.
recA.245	0	0	.	.	.
recA.246	0	0	.	.	.
recA.247	0	0	.	.	.
recA.248	0	0	.	.	.
recA.249	0	0	.	.	.
recA.25	0	0	.	.	.
recA.250	0	0	.	.	.
recA.251	0	0	.	.	.
recA.252	0	0	.	.	.
recA.253	0	0	.	.	.
recA.254	0	0	.	.	.
recA.255	0	0	.	.	.
recA.256	0	0	.	.	.
recA.257	0	0	.	.	.
recA.258	0	0	.	.	.
recA.259	0	0	.	.	.
recA.26	0	0	.	.	.
recA.260	0	0	.	.	.
recA.261	0	0	.	.	.
recA.262	0	0	.	.	.
recA.263	0	0	.	.	.
recA.264	0	0	.	.	.
recA.265	0	0	.	.	.
recA.266	0	0	.	.	.
recA.267	0	0	.	.	.
recA.268	0	0	.	.	.
recA.269	0	0	.	.	.
recA.27	0	0	.	.	.
recA.270	0	0	.	.	.
recA.271	0	0	.	.	.
recA.272	0	0	.	.	.
recA.273	0	0	.	.	.
recA.274	0	0	.	.	.
recA.275	0	0	.	.	.
recA.276	0	0	.	.	.
recA.277	0	0	.	.	.
recA.278	0	0	.	.	.
recA.279	0	0	.	.	.
recA.28	0	0	.	.	.
recA.280	0	0	.	.	.
recA.281	0	0	.	.	.
recA.282	0	0	.	.	.
recA.283	0	0	.	.	.
recA.284	0	0	.	.	.
recA.285	0	0	.	.	.
recA.286	0	0	.	.	.
recA.287	0	0	.	.	.
recA.288	0	0	.	.	.
recA.289	0	0	.	.	.
recA.29	0	0	.	.	.
recA.290	0	0	.	.	.
recA.291	0	0	.	.	.
recA.292	0	0	.	.	.
recA.293	0	0	.	.	.
recA.294	0	0	.	.	.
recA.295	0	0	.	.	.
recA.296	0	0	.	.	.
recA.297	0	0	.	.	.
recA.298	0	0	.	.	.
recA.299	0	0	.	.	.
recA.3	0	0	.	.	.
recA.30	0	0	.	.	.
recA.300	0	0	.	.	.
recA.301	0	0	.	.	.
recA.302	0	0	.	.	.
recA.303	0	0	.	.	.
recA.304	0	0	.	.	.
recA.305	0	0	.	.	.
recA.306	0	0	.	.	.
recA.307	0	0	.	.	.
recA.308	0	0	.	.	.
recA.309	0	0	.	.	.
recA.31	0	0	.	.	.
recA.310	0	0	.	.	.
recA.311	0	0	.	.	.
recA.312	0	0	.	.	.
recA.313	0	0	.	.	.
recA.314	0	0	.	.	.
recA.315	0	0	.	.	.
recA.316	0	0	.	.	.
recA.317	0	0	.	.	.
recA.318	0	0	.	.	.
recA.319	0	0	.	.	.
recA.32	0	0	.	.	.
recA.320	0	0	.	.	.
recA.321	0	0	.	.	.
recA.322	0	0	.	.	.
recA.323	0	0	.	.	.
recA.324	0	0	.	.	.
recA.325	0	0	.	.	.
recA.326	0	0	.	.	.
recA.327	0	0	.	.	.
recA.328	0	0	.	.	.
recA.329	0	0	.	.	.
recA.33	0	0	.	.	.
recA.330	0	0	.	.	.
recA.331	0	0	.	.	.
recA.332	0	0	.	.	.
recA.333	0	0	.	.	.
recA.334	0	0	.	.	.
recA.335	0	0	.	.	.
recA.336	0	0	.	.	.
recA.337	0	0	.	.	.
recA.338	0	0	.	.	.
recA.339	0	0	.	.	.
recA.34	0	0	.	.	.
recA.340	0	0	.	.	.
recA.341	0	0	.	.	.
recA.342	0	0	.	.	.
recA.343	0	0	.	.	.
recA.344	0	0	.	.	.
recA.345	0	0	.	.	.
recA.346	0	0	.	.	.
recA.347	0	0	.	.	.
recA.348	0	0	.	.	.
recA.349	0	0	.	.	.
recA.35	0	0	.	.	.
recA.350	0	0	.	.	.
recA.351	0	0	.	.	.
recA.352	0	0	.	.	.
recA.353	0	0	.	.	.
recA.354	0	0	.	.	.
recA.355	0	0	.	.	.
recA.356	0	0	.	.	.
recA.357	0	0	.	.	.
recA.358	0	0	.	.	.
recA.359	0	0	.	.	.
recA.36	0	0	.	.	.
recA.360	0	0	.	.	.
recA.361	0	0	.	.	.
recA.362	0	0	.	.	.
recA.363	0	0	.	.	.
recA.364	0	0	.	.	.
recA.365	0	0	.	.	.
recA.366	0	0	.	.	.
recA.367	0	0	.	.	.
recA.368	0	0	.	.	.
recA.369	0	0	.	.	.
recA.37	0	0	.	.	.
recA.370	0	0	.	.	.
recA.371	0	0	.	.	.
recA.372	0	0	.	.	.
recA.373	0	0	.	.	.
recA.374	0	0	.	.	.
recA.375	0	0	.	.	.
recA.376	0	0	.	.	.
recA.377	0	0	.	.	.
recA.378	0	0	.	.	.
recA.379	0	0	.	.	.
recA.38	0	0	.	.	.
recA.380	0	0	.	.	.
recA.381	0	0	.	.	.
recA.382	0	0	.	.	.
recA.383	0	0	.	.	.
recA.384	0	0	.	.	.
recA.385	0	0	.	.	.
recA.386	0	0	.	.	.
recA.387	0	0	.	.	.
recA.388	0	0	.	.	.
recA.389	0	0	.	.	.
recA.39	0	0	.	.	.
recA.390	0	0	.	.	.
recA.391	0	0	.	.	.
recA.392	0	0	.	.	.
recA.393	0	0	.	.	.
recA.394	0	0	.	.	.
recA.395	0	0	.	.	.
recA.396	0	0	.	.	.
recA.397	0	0	.	.	.
recA.398	0	0	.	.	.
recA.399	0	0	.	.	.
recA.4	0	0	.	.	.
recA.40	0	0	.	.	.
recA.400	0	0	.	.	.
recA.401	0	0	.	.	.
recA.402	0	0	.	.	.
recA.403	0	0	.	.	.
recA.404	0	0	.	.	.
recA.405	0	0	.	.	.
recA.406	0	0	.	.	.
recA.407	0	0	.	.	.
recA.408	0	0	.	.	.
recA.409	0	0	.	.	.
recA.41	0	0	.	.	.
recA.410	0	0	.	.	.
recA.411	0	0	.	.	.
recA.412	0	0	.	.	.
recA.413	0	0	.	.	.
recA.414	0	0	.	.	.
recA.415	0	0	.	.	.
recA.416	0	0	.	.	.
recA.417	0	0	.	.	.
recA.418	0	0	.	.	.
recA.419	0	0	.	.	.
recA.42	0	0	.	.	.
recA.420	0	0	.	.	.
recA.421	0	0	.	.	.
recA.422	0	0	.	.	.
recA.423	0	0	.	.	.
recA.424	0	0	.	.	.
recA.425	0	0	.	.	.
recA.426	0	0	.	.	.
recA.427	0	0	.	.	.
recA.428	0	0	.	.	.
recA.429	0	0	.	.	.
recA.43	0	0	.	.	.
recA.430	0	0	.	.	.
recA.431	0	0	.	.	.
recA.432	0	0	.	.	.
recA.433	0	0	.	.	.
recA.434	0	0	.	.	.
recA.435	0	0	.	.	.
recA.436	0	0	.	.	.
recA.437	0	0	.	.	.
recA.438	0	0	.	.	.
recA.439	0	0	.	.	.
recA.44	0	0	.	.	.
recA.440	0	0	.	.	.
recA.441	0	0	.	.	.
recA.442	0	0	.	.	.
recA.443	0	0	.	.	.
recA.444	0	0	.	.	.
recA.445	0	0	.	.	.
recA.446	0	0	.	.	.
recA.447	0	0	.	.	.
recA.448	0	0	.	.	.
recA.449	0	0	.	.	.
recA.45	0	0	.	.	.
recA.450	0	0	.	.	.
recA.451	0	0	.	.	.
recA.452	0	0	.	.	.
recA.453	0	0	.	.	.
recA.454	0	0	.	.	.
recA.455	0	0	.	.	.
recA.456	0	0	.	.	.
recA.46	0	0	.	.	.
recA.47	0	0	.	.	.
recA.48	0	0	.	.	.
recA.49	0	0	.	.	.
recA.5	0	0	.	.	.
recA.50	0	0	.	.	.
recA.51	0	0	.	.	.
recA.52	0	0	.	.	.
recA.53	0	0	.	.	.
recA.54	0	0	.	.	.
recA.55	0	0	.	.	.
recA.56	0	0	.	.	.
recA.57	0	0	.	.	.
recA.58	0	0	.	.	.
recA.59	0	0	.	.	.
recA.6	0	0	.	.	.
recA.60	0	0	.	.	.
recA.61	0	0	.	.	.
recA.62	0	0	.	.	.
recA.63	0	0	.	.	.
recA.64	0	0	.	.	.
recA.65	0	0	.	.	.
recA.66	0	0	.	.	.
recA.67	0	0	.	.	.
recA.68	0	0	.	.	.
recA.69	0	0	.	.	.
recA.7	0	0	.	.	.
recA.70	0	0	.	.	.
recA.71	0	0	.	.	.
recA.72	0	0	.	.	.
recA.73	0	0	.	.	.
recA.74	0	0	.	.	.
recA.75	0	0	.	.	.
recA.76	0	0	.	.	.
recA.77	0	0	.	.	.
recA.78	0	0	.	.	.
recA.79	0	0	.	.	.
recA.8	0	0	.	.	.
recA.80	0	0	.	.	.
recA.81	0	0	.	.	.
recA.82	0	0	.	.	.
recA.83	0	0	.	.	.
recA.84	0	0	.	.	.
recA.85	0	0	.	.	.
recA.86	0	0	.	.	.
recA.87	0	0	.	.	.
recA.88	0	0	.	.	.
recA.89	0	0	.	.	.
recA.9	0	0	.	.	.
recA.90	0	0	.	.	.
recA.91	0	0	.	.	.
recA.92	0	0	.	.	.
recA.93	0	0	.	.	.
recA.94	0	0	.	.	.
recA.95	0	0	.	.	.
recA.96	0	0	.	.	.
recA.97	0	0	.	.	.
recA.98	0	0	.	.	.
recA.99	0	0	.	.	.
tnaA.1	0	0	.	.	.
tnaA.10	0	0	.	.	.
tnaA.100	0	0	.	.	.
tnaA.101	0	0	.	.	.
tnaA.102	0	0	.	.	.
tnaA.103	0	0	.	.	.
tnaA.104	0	0	.	.	.
tnaA.105	0	0	.	.	.
tnaA.106	0	0	.	.	.
tnaA.107	0	0	.	.	.
tnaA.108	0	0	.	.	.
tnaA.109	0	0	.	.	.
tnaA.11	0	0	.	.	.
tnaA.110	0	0	.	.	.
tnaA.111	0	0	.	.	.
tnaA.112	0	0	.	.	.
tnaA.113	0	0	.	.	.
tnaA.114	0	0	.	.	.
tnaA.115	0	0	.	.	.
tnaA.116	0	0	.	.	.
tnaA.117	0	0	.	.	.
tnaA.118	0	0	.	.	.
tnaA.119	0	0	.	.	.
tnaA.12	0	0	.	.	.
tnaA.120	0	0	.	.	.
tnaA.121	0	0	.	.	.
tnaA.122	0	0	.	.	.
tnaA.123	0	0	.	.	.
tnaA.124	0	0	.	.	.
tnaA.125	0	0	.	.	.
tnaA.126	0	0	.	.	.
tnaA.127	0	0	.	.	.
tnaA.128	0	0	.	.	.
tnaA.129	0	0	.	.	.
tnaA.13	0	0	.	.	.
tnaA.130	0	0	.	.	.
tnaA.131	0	0	.	.	.
tnaA.132	0	0	.	.	.
tnaA.133	0	0	.	.	.
tnaA.134	0	0	.	.	.
tnaA.135	0	0	.	.	.
tnaA.136	0	0	.	.	.
tnaA.137	0	0	.	.	.
tnaA.138	0	0	.	.	.
tnaA.139	0	0	.	.	.
tnaA.14	0	0	.	.	.
tnaA.140	0	0	.	.	.
tnaA.141	0	0	.	.	.
tnaA.142	0	0	.	.	.
tnaA.143	0	0	.	.	.
tnaA.144	0	0	.	.	.
tnaA.145	0	0	.	.	.
tnaA.146	0	0	.	.	.
tnaA.147	0	0	.	.	.
tnaA.148	0	0	.	.	.
tnaA.149	0	0	.	.	.
tnaA.15	0	0	.	.	.
tnaA.150	0	0	.	.	.
tnaA.151	0	0	.	.	.
tnaA.152	0	0	.	.	.
tnaA.153	0	0	.	.	.
tnaA.154	0	0	.	.	.
tnaA.155	0	0	.	.	.
tnaA.156	0	0	.	.	.
tnaA.157	0	0	.	.	.
tnaA.158	0	0	.	.	.
tnaA.159	0	0	.	.	.
tnaA.16	0	0	.	.	.
tnaA.160	0	0	.	.	.
tnaA.161	0	0	.	.	.
tnaA.162	0	0	.	.	.
tnaA.163	0	0	.	.	.
tnaA.164	0	0	.	.	.
tnaA.165	0	0	.	.	.
tnaA.166	0	0	.	.	.
tnaA.167	0	0	.	.	.
tnaA.168	0	0	.	.	.
tnaA.169	0	0	.	.	.
tnaA.17	0	0	.	.	.
tnaA.170	0	0	.	.	.
tnaA.171	0	0	.	.	.
tnaA.172	0	0	.	.	.
tnaA.173	0	0	.	.	.
tnaA.174	0	0	.	.	.
tnaA.175	0	0	.	.	.
tnaA.176	0	0	.	.	.
tnaA.177	0	0	.	.	.
tnaA.178	0	0	.	.	.
tnaA.179	0	0	.	.	.
tnaA.18	0	0	.	.	.
tnaA.180	0	0	.	.	.
tnaA.181	0	0	.	.	.
tnaA.182	0	0	.	.	.
tnaA.183	0	0	.	.	.
tnaA.184	0	0	.	.	.
tnaA.185	0	0	.	.	.
tnaA.186	0	0	.	.	.
tnaA.187	0	0	.	.	.
tnaA.188	0	0	.	.	.
tnaA.189	0	0	.	.	.
tnaA.19	0	0	.	.	.
tnaA.190	0	0	.	.	.
tnaA.191	0	0	.	.	.
tnaA.192	0	0	.	.	.
tnaA.193	0	0	.	.	.
tnaA.194	0	0	.	.	.
tnaA.195	0	0	.	.	.
tnaA.196	0	0	.	.	.
tnaA.197	0	0	.	.	.
tnaA.198	0	0	.	.	.
tnaA.199	0	0	.	.	.
tnaA.2	0	0	.	.	.
tnaA.20	0	0	.	.	.
tnaA.200	0	0	.	.	.
tnaA.201	0	0	.	.	.
tnaA.202	0	0	.	.	.
tnaA.203	0	0	.	.	.
tnaA.204	0	0	.	.	.
tnaA.205	0	0	.	.	.
tnaA.206	0	0	.	.	.
tnaA.207	0	0	.	.	.
tnaA.208	0	0	.	.	.
tnaA.209	0	0	.	.	.
tnaA.21	0	0	.	.	.
tnaA.210	0	0	.	.	.
tnaA.211	0	0	.	.	.
tnaA.212	0	0	.	.	.
tnaA.213	0	0	.	.	.
tnaA.214	0	0	.	.	.
tnaA.215	0	0	.	.	.
tnaA.216	0	0	.	.	.
tnaA.217	0	0	.	.	.
tnaA.218	0	0	.	.	.
tnaA.219	0	0	.	.	.
tnaA.22	0	0	.	.	.
tnaA.220	0	0	.	.	.
tnaA.221	0	0	.	.	.
tnaA.222	0	0	.	.	.
tnaA.223	0	0	.	.	.
tnaA.224	0	0	.	.	.
tnaA.225	0	0	.	.	.
tnaA.226	0	0	.	.	.
tnaA.227	0	0	.	.	.
tnaA.228	0	0	.	.	.
tnaA.229	0	0	.	.	.
tnaA.23	0	0	.	.	.
tnaA.230	0	0	.	.	.
tnaA.231	0	0	.	.	.
tnaA.232	0	0	.	.	.
tnaA.233	0	0	.	.	.
tnaA.234	0	0	.	.	.
tnaA.235	0	0	.	.	.
tnaA.236	0	0	.	.	.
tnaA.237	0	0	.	.	.
tnaA.238	0	0	.	.	.
tnaA.239	0	0	.	.	.
tnaA.24	0	0	.	.	.
tnaA.240	0	0	.	.	.
tnaA.241	0	0	.	.	.
tnaA.242	0	0	.	.	.
tnaA.243	0	0	.	.	.
tnaA.244	0	0	.	.	.
tnaA.245	0	0	.	.	.
tnaA.246	0	0	.	.	.
tnaA.247	0	0	.	.	.
tnaA.248	0	0	.	.	.
tnaA.249	0	0	.	.	.
tnaA.25	0	0	.	.	.
tnaA.250	0	0	.	.	.
tnaA.251	0	0	.	.	.
tnaA.252	0	0	.	.	.
tnaA.253	0	0	.	.	.
tnaA.254	0	0	.	.	.
tnaA.255	0	0	.	.	.
tnaA.256	0	0	.	.	.
tnaA.257	0	0	.	.	.
tnaA.258	0	0	.	.	.
tnaA.259	0	0	.	.	.
tnaA.26	0	0	.	.	.
tnaA.260	0	0	.	.	.
tnaA.261	0	0	.	.	.
tnaA.262	0	0	.	.	.
tnaA.263	0	0	.	.	.
tnaA.264	0	0	.	.	.
tnaA.265	0	0	.	.	.
tnaA.266	0	0	.	.	.
tnaA.267	0	0	.	.	.
tnaA.268	0	0	.	.	.
tnaA.269	0	0	.	.	.
tnaA.27	0	0	.	.	.
tnaA.270	0	0	.	.	.
tnaA.271	0	0	.	.	.
tnaA.272	0	0	.	.	.
tnaA.273	0	0	.	.	.
tnaA.274	0	0	.	.	.
tnaA.275	0	0	.	.	.
tnaA.276	0	0	.	.	.
tnaA.277	0	0	.	.	.
tnaA.278	0	0	.	.	.
tnaA.279	0	0	.	.	.
tnaA.28	0	0	.	.	.
tnaA.280	0	0	.	.	.
tnaA.281	0	0	.	.	.
tnaA.282	0	0	.	.	.
tnaA.283	0	0	.	.	.
tnaA.284	0	0	.	.	.
tnaA.285	0	0	.	.	.
tnaA.286	0	0	.	.	.
tnaA.287	0	0	.	.	.
tnaA.288	0	0	.	.	.
tnaA.289	0	0	.	.	.
tnaA.29	0	0	.	.	.
tnaA.290	0	0	.	.	.
tnaA.291	0	0	.	.	.
tnaA.292	0	0	.	.	.
tnaA.293	0	0	.	.	.
tnaA.294	0	0	.	.	.
tnaA.295	0	0	.	.	.
tnaA.296	0	0	.	.	.
tnaA.297	0	0	.	.	.
tnaA.298	0	0	.	.	.
tnaA.299	0	0	.	.	.
tnaA.3	0	0	.	.	.
tnaA.30	0	0	.	.	.
tnaA.300	0	0	.	.	.
tnaA.301	0	0	.	.	.
tnaA.302	0	0	.	.	.
tnaA.303	0	0	.	.	.
tnaA.304	0	0	.	.	.
tnaA.305	0	0	.	.	.
tnaA.306	0	0	.	.	.
tnaA.307	0	0	.	.	.
tnaA.308	0	0	.	.	.
tnaA.309	0	0	.	.	.
tnaA.31	0	0	.	.	.
tnaA.310	0	0	.	.	.
tnaA.311	0	0	.	.	.
tnaA.312	0	0	.	.	.
tnaA.313	0	0	.	.	.
tnaA.314	0	0	.	.	.
tnaA.315	0	0	.	.	.
tnaA.316	0	0	.	.	.
tnaA.317	0	0	.	.	.
tnaA.318	0	0	.	.	.
tnaA.319	0	0	.	.	.
tnaA.32	0	0	.	.	.
tnaA.320	0	0	.	.	.
tnaA.33	0	0	.	.	.
tnaA.34	0	0	.	.	.
tnaA.35	0	0	.	.	.
tnaA.36	0	0	.	.	.
tnaA.37	0	0	.	.	.
tnaA.38	0	0	.	.	.
tnaA.39	0	0	.	.	.
tnaA.4	0	0	.	.	.
tnaA.40	0	0	.	.	.
tnaA.41	0	0	.	.	.
tnaA.42	0	0	.	.	.
tnaA.43	0	0	.	.	.
tnaA.44	0	0	.	.	.
tnaA.45	0	0	.	.	.
tnaA.46	0	0	.	.	.
tnaA.47	0	0	.	.	.
tnaA.48	0	0	.	.	.
tnaA.49	0	0	.	.	.
tnaA.5	0	0	.	.	.
tnaA.50	0	0	.	.	.
tnaA.51	0	0	.	.	.
tnaA.52	0	0	.	.	.
tnaA.53	0	0	.	.	.
tnaA.54	0	0	.	.	.
tnaA.55	0	0	.	.	.
tnaA.56	0	0	.	.	.
tnaA.57	0	0	.	.	.
tnaA.58	0	0	.	.	.
tnaA.59	0	0	.	.	.
tnaA.6	0	0	.	.	.
tnaA.60	0	0	.	.	.
tnaA.61	0	0	.	.	.
tnaA.62	0	0	.	.	.
tnaA.63	0	0	.	.	.
tnaA.64	0	0	.	.	.
tnaA.65	0	0	.	.	.
tnaA.66	0	0	.	.	.
tnaA.67	0	0	.	.	.
tnaA.68	0	0	.	.	.
tnaA.69	0	0	.	.	.
tnaA.7	0	0	.	.	.
tnaA.70	0	0	.	.	.
tnaA.71	0	0	.	.	.
tnaA.72	0	0	.	.	.
tnaA.73	0	0	.	.	.
tnaA.74	0	0	.	.	.
tnaA.75	0	0	.	.	.
tnaA.76	0	0	.	.	.
tnaA.77	0	0	.	.	.
tnaA.78	0	0	.	.	.
tnaA.79	0	0	.	.	.
tnaA.8	0	0	.	.	.
tnaA.80	0	0	.	.	.
tnaA.81	0	0	.	.	.
tnaA.82	0	0	.	.	.
tnaA.83	0	0	.	.	.
tnaA.84	0	0	.	.	.
tnaA.85	0	0	.	.	.
tnaA.86	0	0	.	.	.
tnaA.87	0	0	.	.	.
tnaA.88	0	0	.	.	.
tnaA.89	0	0	.	.	.
tnaA.9	0	0	.	.	.
tnaA.90	0	0	.	.	.
tnaA.91	0	0	.	.	.
tnaA.92	0	0	.	.	.
tnaA.93	0	0	.	.	.
tnaA.94	0	0	.	.	.
tnaA.95	0	0	.	.	.
tnaA.96	0	0	.	.	.
tnaA.97	0	0	.	.	.
tnaA.98	0	0	.	.	.
tnaA.99	0	0	.	.	.
