ftsQ.1	0	0	.	.	.
ftsQ.10	0	0	.	.	.
ftsQ.11	0	0	.	.	.
ftsQ.12	0	0	.	.	.
ftsQ.13	0	0	.	.	.
ftsQ.14	0	0	.	.	.
ftsQ.15	0	0	.	.	.
ftsQ.16	0	0	.	.	.
ftsQ.17	0	0	.	.	.
ftsQ.18	0	0	.	.	.
ftsQ.19	0	0	.	.	.
ftsQ.2	0	0	.	.	.
ftsQ.20	0	0	.	.	.
ftsQ.21	0	0	.	.	.
ftsQ.22	0	0	.	.	.
ftsQ.23	0	0	.	.	.
ftsQ.24	0	0	.	.	.
ftsQ.25	0	0	.	.	.
ftsQ.26	0	0	.	.	.
ftsQ.27	0	0	.	.	.
ftsQ.28	0	0	.	.	.
ftsQ.29	0	0	.	.	.
ftsQ.3	0	0	.	.	.
ftsQ.30	0	0	.	.	.
ftsQ.31	0	0	.	.	.
ftsQ.32	0	0	.	.	.
ftsQ.33	0	0	.	.	.
ftsQ.34	0	0	.	.	.
ftsQ.35	0	0	.	.	.
ftsQ.36	0	0	.	.	.
ftsQ.37	0	0	.	.	.
ftsQ.38	0	0	.	.	.
ftsQ.39	0	0	.	.	.
ftsQ.4	0	0	.	.	.
ftsQ.40	0	0	.	.	.
ftsQ.5	0	0	.	.	.
ftsQ.6	0	0	.	.	.
ftsQ.7	0	0	.	.	.
ftsQ.8	0	0	.	.	.
ftsQ.9	0	0	.	.	.
gpdxJ.1	0	0	.	.	.
gpdxJ.10	0	0	.	.	.
gpdxJ.11	0	0	.	.	.
gpdxJ.12	0	0	.	.	.
gpdxJ.13	0	0	.	.	.
gpdxJ.14	0	0	.	.	.
gpdxJ.15	0	0	.	.	.
gpdxJ.16	0	0	.	.	.
gpdxJ.17	0	0	.	.	.
gpdxJ.18	0	0	.	.	.
gpdxJ.19	0	0	.	.	.
gpdxJ.2	0	0	.	.	.
gpdxJ.20	0	0	.	.	.
gpdxJ.21	0	0	.	.	.
gpdxJ.22	0	0	.	.	.
gpdxJ.23	0	0	.	.	.
gpdxJ.24	0	0	.	.	.
gpdxJ.25	0	0	.	.	.
gpdxJ.26	0	0	.	.	.
gpdxJ.27	0	0	.	.	.
gpdxJ.28	0	0	.	.	.
gpdxJ.29	0	0	.	.	.
gpdxJ.3	0	0	.	.	.
gpdxJ.30	0	0	.	.	.
gpdxJ.31	0	0	.	.	.
gpdxJ.32	0	0	.	.	.
gpdxJ.33	0	0	.	.	.
gpdxJ.34	0	0	.	.	.
gpdxJ.35	0	0	.	.	.
gpdxJ.36	0	0	.	.	.
gpdxJ.37	0	0	.	.	.
gpdxJ.4	0	0	.	.	.
gpdxJ.5	0	0	.	.	.
gpdxJ.6	0	0	.	.	.
gpdxJ.7	0	0	.	.	.
gpdxJ.8	0	0	.	.	.
gpdxJ.9	0	0	.	.	.
hagB.1	0	0	.	.	.
hagB.10	0	0	.	.	.
hagB.11	0	0	.	.	.
hagB.12	0	0	.	.	.
hagB.13	0	0	.	.	.
hagB.14	0	0	.	.	.
hagB.15	0	0	.	.	.
hagB.16	0	0	.	.	.
hagB.17	0	0	.	.	.
hagB.18	0	0	.	.	.
hagB.19	0	0	.	.	.
hagB.2	0	0	.	.	.
hagB.20	0	0	.	.	.
hagB.21	0	0	.	.	.
hagB.22	0	0	.	.	.
hagB.23	0	0	.	.	.
hagB.24	0	0	.	.	.
hagB.25	0	0	.	.	.
hagB.26	0	0	.	.	.
hagB.27	0	0	.	.	.
hagB.28	0	0	.	.	.
hagB.29	0	0	.	.	.
hagB.3	0	0	.	.	.
hagB.30	0	0	.	.	.
hagB.31	0	0	.	.	.
hagB.32	0	0	.	.	.
hagB.33	0	0	.	.	.
hagB.34	0	0	.	.	.
hagB.35	0	0	.	.	.
hagB.36	0	0	.	.	.
hagB.37	0	0	.	.	.
hagB.4	0	0	.	.	.
hagB.5	0	0	.	.	.
hagB.6	0	0	.	.	.
hagB.7	0	0	.	.	.
hagB.8	0	0	.	.	.
hagB.9	0	0	.	.	.
mcmA.1	0	0	.	.	.
mcmA.10	0	0	.	.	.
mcmA.11	0	0	.	.	.
mcmA.12	0	0	.	.	.
mcmA.13	0	0	.	.	.
mcmA.14	0	0	.	.	.
mcmA.15	0	0	.	.	.
mcmA.16	0	0	.	.	.
mcmA.17	0	0	.	.	.
mcmA.18	0	0	.	.	.
mcmA.19	0	0	.	.	.
mcmA.2	0	0	.	.	.
mcmA.20	0	0	.	.	.
mcmA.21	0	0	.	.	.
mcmA.22	0	0	.	.	.
mcmA.23	0	0	.	.	.
mcmA.24	0	0	.	.	.
mcmA.25	0	0	.	.	.
mcmA.26	0	0	.	.	.
mcmA.27	0	0	.	.	.
mcmA.28	0	0	.	.	.
mcmA.29	0	0	.	.	.
mcmA.3	0	0	.	.	.
mcmA.30	0	0	.	.	.
mcmA.4	0	0	.	.	.
mcmA.5	0	0	.	.	.
mcmA.6	0	0	.	.	.
mcmA.7	0	0	.	.	.
mcmA.8	0	0	.	.	.
mcmA.9	0	0	.	.	.
pepO.1	0	0	.	.	.
pepO.10	0	0	.	.	.
pepO.11	0	0	.	.	.
pepO.12	0	0	.	.	.
pepO.13	0	0	.	.	.
pepO.14	0	0	.	.	.
pepO.15	0	0	.	.	.
pepO.16	0	0	.	.	.
pepO.17	0	0	.	.	.
pepO.18	0	0	.	.	.
pepO.19	0	0	.	.	.
pepO.2	0	0	.	.	.
pepO.20	0	0	.	.	.
pepO.21	0	0	.	.	.
pepO.22	0	0	.	.	.
pepO.23	0	0	.	.	.
pepO.24	0	0	.	.	.
pepO.25	0	0	.	.	.
pepO.26	0	0	.	.	.
pepO.27	0	0	.	.	.
pepO.28	0	0	.	.	.
pepO.29	0	0	.	.	.
pepO.3	0	0	.	.	.
pepO.30	0	0	.	.	.
pepO.31	0	0	.	.	.
pepO.32	0	0	.	.	.
pepO.33	0	0	.	.	.
pepO.34	0	0	.	.	.
pepO.35	0	0	.	.	.
pepO.36	0	0	.	.	.
pepO.37	0	0	.	.	.
pepO.4	0	0	.	.	.
pepO.5	0	0	.	.	.
pepO.6	0	0	.	.	.
pepO.7	0	0	.	.	.
pepO.8	0	0	.	.	.
pepO.9	0	0	.	.	.
pga.1	0	0	.	.	.
pga.10	0	0	.	.	.
pga.11	0	0	.	.	.
pga.12	0	0	.	.	.
pga.13	0	0	.	.	.
pga.14	0	0	.	.	.
pga.15	0	0	.	.	.
pga.16	0	0	.	.	.
pga.17	0	0	.	.	.
pga.18	0	0	.	.	.
pga.19	0	0	.	.	.
pga.2	0	0	.	.	.
pga.20	0	0	.	.	.
pga.21	0	0	.	.	.
pga.22	0	0	.	.	.
pga.23	0	0	.	.	.
pga.24	0	0	.	.	.
pga.25	0	0	.	.	.
pga.26	0	0	.	.	.
pga.27	0	0	.	.	.
pga.3	0	0	.	.	.
pga.4	0	0	.	.	.
pga.5	0	0	.	.	.
pga.6	0	0	.	.	.
pga.7	0	0	.	.	.
pga.8	0	0	.	.	.
pga.9	0	0	.	.	.
recA.1	0	0	.	.	.
recA.10	0	0	.	.	.
recA.11	0	0	.	.	.
recA.12	0	0	.	.	.
recA.13	0	0	.	.	.
recA.14	0	0	.	.	.
recA.2	0	0	.	.	.
recA.3	0	0	.	.	.
recA.4	0	0	.	.	.
recA.5	0	0	.	.	.
recA.6	0	0	.	.	.
recA.7	0	0	.	.	.
recA.8	0	0	.	.	.
recA.9	0	0	.	.	.
