arcC.1	0	0	.	.	.
arcC.10	0	0	.	.	.
arcC.11	0	0	.	.	.
arcC.12	0	0	.	.	.
arcC.13	0	0	.	.	.
arcC.14	0	0	.	.	.
arcC.15	0	0	.	.	.
arcC.16	0	0	.	.	.
arcC.17	0	0	.	.	.
arcC.18	0	0	.	.	.
arcC.19	0	0	.	.	.
arcC.2	0	0	.	.	.
arcC.20	0	0	.	.	.
arcC.21	0	0	.	.	.
arcC.22	0	0	.	.	.
arcC.23	0	0	.	.	.
arcC.24	0	0	.	.	.
arcC.25	0	0	.	.	.
arcC.26	0	0	.	.	.
arcC.27	0	0	.	.	.
arcC.28	0	0	.	.	.
arcC.29	0	0	.	.	.
arcC.3	0	0	.	.	.
arcC.30	0	0	.	.	.
arcC.31	0	0	.	.	.
arcC.32	0	0	.	.	.
arcC.33	0	0	.	.	.
arcC.34	0	0	.	.	.
arcC.35	0	0	.	.	.
arcC.36	0	0	.	.	.
arcC.37	0	0	.	.	.
arcC.38	0	0	.	.	.
arcC.39	0	0	.	.	.
arcC.4	0	0	.	.	.
arcC.40	0	0	.	.	.
arcC.41	0	0	.	.	.
arcC.42	0	0	.	.	.
arcC.43	0	0	.	.	.
arcC.44	0	0	.	.	.
arcC.45	0	0	.	.	.
arcC.46	0	0	.	.	.
arcC.47	0	0	.	.	.
arcC.48	0	0	.	.	.
arcC.49	0	0	.	.	.
arcC.5	0	0	.	.	.
arcC.50	0	0	.	.	.
arcC.51	0	0	.	.	.
arcC.52	0	0	.	.	.
arcC.53	0	0	.	.	.
arcC.54	0	0	.	.	.
arcC.55	0	0	.	.	.
arcC.56	0	0	.	.	.
arcC.57	0	0	.	.	.
arcC.58	0	0	.	.	.
arcC.59	0	0	.	.	.
arcC.6	0	0	.	.	.
arcC.60	0	0	.	.	.
arcC.61	0	0	.	.	.
arcC.62	0	0	.	.	.
arcC.63	0	0	.	.	.
arcC.64	0	0	.	.	.
arcC.65	0	0	.	.	.
arcC.66	0	0	.	.	.
arcC.67	0	0	.	.	.
arcC.68	0	0	.	.	.
arcC.69	0	0	.	.	.
arcC.7	0	0	.	.	.
arcC.70	0	0	.	.	.
arcC.75	0	0	.	.	.
arcC.79	0	0	.	.	.
arcC.8	0	0	.	.	.
arcC.80	0	0	.	.	.
arcC.81	0	0	.	.	.
arcC.82	0	0	.	.	.
arcC.83	0	0	.	.	.
arcC.84	0	0	.	.	.
arcC.85	0	0	.	.	.
arcC.86	0	0	.	.	.
arcC.87	0	0	.	.	.
arcC.88	0	0	.	.	.
arcC.89	0	0	.	.	.
arcC.9	0	0	.	.	.
arcC.90	0	0	.	.	.
arcC.91	0	0	.	.	.
arcC.92	0	0	.	.	.
arcC.93	0	0	.	.	.
arcC.94	0	0	.	.	.
ddl.1	0	0	.	.	.
ddl.10	0	0	.	.	.
ddl.11	0	0	.	.	.
ddl.12	0	0	.	.	.
ddl.13	0	0	.	.	.
ddl.14	0	0	.	.	.
ddl.15	0	0	.	.	.
ddl.16	0	0	.	.	.
ddl.17	0	0	.	.	.
ddl.18	0	0	.	.	.
ddl.19	0	0	.	.	.
ddl.2	0	0	.	.	.
ddl.20	0	0	.	.	.
ddl.21	0	0	.	.	.
ddl.22	0	0	.	.	.
ddl.23	0	0	.	.	.
ddl.24	0	0	.	.	.
ddl.25	0	0	.	.	.
ddl.26	0	0	.	.	.
ddl.27	0	0	.	.	.
ddl.28	0	0	.	.	.
ddl.29	0	0	.	.	.
ddl.3	0	0	.	.	.
ddl.30	0	0	.	.	.
ddl.31	0	0	.	.	.
ddl.32	0	0	.	.	.
ddl.33	0	0	.	.	.
ddl.34	0	0	.	.	.
ddl.35	0	0	.	.	.
ddl.36	0	0	.	.	.
ddl.37	0	0	.	.	.
ddl.38	0	0	.	.	.
ddl.39	0	0	.	.	.
ddl.4	0	0	.	.	.
ddl.40	0	0	.	.	.
ddl.41	0	0	.	.	.
ddl.42	0	0	.	.	.
ddl.43	0	0	.	.	.
ddl.44	0	0	.	.	.
ddl.45	0	0	.	.	.
ddl.46	0	0	.	.	.
ddl.47	0	0	.	.	.
ddl.48	0	0	.	.	.
ddl.49	0	0	.	.	.
ddl.5	0	0	.	.	.
ddl.50	0	0	.	.	.
ddl.51	0	0	.	.	.
ddl.52	0	0	.	.	.
ddl.53	0	0	.	.	.
ddl.54	0	0	.	.	.
ddl.55	0	0	.	.	.
ddl.56	0	0	.	.	.
ddl.57	0	0	.	.	.
ddl.58	0	0	.	.	.
ddl.59	0	0	.	.	.
ddl.6	0	0	.	.	.
ddl.60	0	0	.	.	.
ddl.61	0	0	.	.	.
ddl.62	0	0	.	.	.
ddl.63	0	0	.	.	.
ddl.64	0	0	.	.	.
ddl.65	0	0	.	.	.
ddl.66	0	0	.	.	.
ddl.67	0	0	.	.	.
ddl.68	0	0	.	.	.
ddl.69	0	0	.	.	.
ddl.7	0	0	.	.	.
ddl.70	0	0	.	.	.
ddl.71	0	0	.	.	.
ddl.72	0	0	.	.	.
ddl.73	0	0	.	.	.
ddl.74	0	0	.	.	.
ddl.8	0	0	.	.	.
ddl.9	0	0	.	.	.
gki.1	0	0	.	.	.
gki.10	0	0	.	.	.
gki.11	0	0	.	.	.
gki.12	0	0	.	.	.
gki.13	0	0	.	.	.
gki.14	0	0	.	.	.
gki.15	0	0	.	.	.
gki.16	0	0	.	.	.
gki.17	0	0	.	.	.
gki.18	0	0	.	.	.
gki.19	0	0	.	.	.
gki.2	0	0	.	.	.
gki.20	0	0	.	.	.
gki.21	0	0	.	.	.
gki.22	0	0	.	.	.
gki.23	0	0	.	.	.
gki.24	0	0	.	.	.
gki.25	0	0	.	.	.
gki.26	0	0	.	.	.
gki.27	0	0	.	.	.
gki.28	0	0	.	.	.
gki.29	0	0	.	.	.
gki.3	0	0	.	.	.
gki.30	0	0	.	.	.
gki.31	0	0	.	.	.
gki.32	0	0	.	.	.
gki.33	0	0	.	.	.
gki.34	0	0	.	.	.
gki.35	0	0	.	.	.
gki.36	0	0	.	.	.
gki.37	0	0	.	.	.
gki.38	0	0	.	.	.
gki.39	0	0	.	.	.
gki.4	0	0	.	.	.
gki.40	0	0	.	.	.
gki.41	0	0	.	.	.
gki.42	0	0	.	.	.
gki.43	0	0	.	.	.
gki.44	0	0	.	.	.
gki.45	0	0	.	.	.
gki.46	0	0	.	.	.
gki.47	0	0	.	.	.
gki.48	0	0	.	.	.
gki.49	0	0	.	.	.
gki.5	0	0	.	.	.
gki.50	0	0	.	.	.
gki.51	0	0	.	.	.
gki.52	0	0	.	.	.
gki.53	0	0	.	.	.
gki.54	0	0	.	.	.
gki.55	0	0	.	.	.
gki.56	0	0	.	.	.
gki.57	0	0	.	.	.
gki.58	0	0	.	.	.
gki.59	0	0	.	.	.
gki.6	0	0	.	.	.
gki.60	0	0	.	.	.
gki.61	0	0	.	.	.
gki.62	0	0	.	.	.
gki.63	0	0	.	.	.
gki.64	0	0	.	.	.
gki.65	0	0	.	.	.
gki.66	0	0	.	.	.
gki.67	0	0	.	.	.
gki.68	0	0	.	.	.
gki.69	0	0	.	.	.
gki.7	0	0	.	.	.
gki.70	0	0	.	.	.
gki.71	0	0	.	.	.
gki.72	0	0	.	.	.
gki.73	0	0	.	.	.
gki.74	0	0	.	.	.
gki.75	0	0	.	.	.
gki.76	0	0	.	.	.
gki.77	0	0	.	.	.
gki.78	0	0	.	.	.
gki.8	0	0	.	.	.
gki.9	0	0	.	.	.
recP.1	0	0	.	.	.
recP.10	0	0	.	.	.
recP.11	0	0	.	.	.
recP.12	0	0	.	.	.
recP.13	0	0	.	.	.
recP.14	0	0	.	.	.
recP.15	0	0	.	.	.
recP.16	0	0	.	.	.
recP.17	0	0	.	.	.
recP.18	0	0	.	.	.
recP.19	0	0	.	.	.
recP.2	0	0	.	.	.
recP.20	0	0	.	.	.
recP.21	0	0	.	.	.
recP.22	0	0	.	.	.
recP.23	0	0	.	.	.
recP.24	0	0	.	.	.
recP.25	0	0	.	.	.
recP.26	0	0	.	.	.
recP.27	0	0	.	.	.
recP.28	0	0	.	.	.
recP.29	0	0	.	.	.
recP.3	0	0	.	.	.
recP.30	0	0	.	.	.
recP.31	0	0	.	.	.
recP.32	0	0	.	.	.
recP.33	0	0	.	.	.
recP.34	0	0	.	.	.
recP.35	0	0	.	.	.
recP.36	0	0	.	.	.
recP.37	0	0	.	.	.
recP.38	0	0	.	.	.
recP.4	0	0	.	.	.
recP.40	0	0	.	.	.
recP.5	0	0	.	.	.
recP.6	0	0	.	.	.
recP.7	0	0	.	.	.
recP.8	0	0	.	.	.
recP.9	0	0	.	.	.
tdk.1	0	0	.	.	.
tdk.10	0	0	.	.	.
tdk.100	0	0	.	.	.
tdk.101	0	0	.	.	.
tdk.102	0	0	.	.	.
tdk.103	0	0	.	.	.
tdk.104	0	0	.	.	.
tdk.105	0	0	.	.	.
tdk.106	0	0	.	.	.
tdk.107	0	0	.	.	.
tdk.108	0	0	.	.	.
tdk.109	0	0	.	.	.
tdk.11	0	0	.	.	.
tdk.110	0	0	.	.	.
tdk.111	0	0	.	.	.
tdk.112	0	0	.	.	.
tdk.113	0	0	.	.	.
tdk.114	0	0	.	.	.
tdk.115	0	0	.	.	.
tdk.116	0	0	.	.	.
tdk.117	0	0	.	.	.
tdk.118	0	0	.	.	.
tdk.119	0	0	.	.	.
tdk.12	0	0	.	.	.
tdk.120	0	0	.	.	.
tdk.121	0	0	.	.	.
tdk.122	0	0	.	.	.
tdk.123	0	0	.	.	.
tdk.124	0	0	.	.	.
tdk.125	0	0	.	.	.
tdk.126	0	0	.	.	.
tdk.127	0	0	.	.	.
tdk.128	0	0	.	.	.
tdk.129	0	0	.	.	.
tdk.13	0	0	.	.	.
tdk.14	0	0	.	.	.
tdk.15	0	0	.	.	.
tdk.16	0	0	.	.	.
tdk.17	0	0	.	.	.
tdk.18	0	0	.	.	.
tdk.19	0	0	.	.	.
tdk.2	0	0	.	.	.
tdk.20	0	0	.	.	.
tdk.21	0	0	.	.	.
tdk.22	0	0	.	.	.
tdk.23	0	0	.	.	.
tdk.24	0	0	.	.	.
tdk.25	0	0	.	.	.
tdk.26	0	0	.	.	.
tdk.27	0	0	.	.	.
tdk.28	0	0	.	.	.
tdk.29	0	0	.	.	.
tdk.3	0	0	.	.	.
tdk.30	0	0	.	.	.
tdk.31	0	0	.	.	.
tdk.32	0	0	.	.	.
tdk.33	0	0	.	.	.
tdk.34	0	0	.	.	.
tdk.35	0	0	.	.	.
tdk.36	0	0	.	.	.
tdk.37	0	0	.	.	.
tdk.38	0	0	.	.	.
tdk.39	0	0	.	.	.
tdk.4	0	0	.	.	.
tdk.40	0	0	.	.	.
tdk.41	0	0	.	.	.
tdk.42	0	0	.	.	.
tdk.43	0	0	.	.	.
tdk.44	0	0	.	.	.
tdk.45	0	0	.	.	.
tdk.46	0	0	.	.	.
tdk.47	0	0	.	.	.
tdk.48	0	0	.	.	.
tdk.49	0	0	.	.	.
tdk.5	0	0	.	.	.
tdk.50	0	0	.	.	.
tdk.51	0	0	.	.	.
tdk.52	0	0	.	.	.
tdk.53	0	0	.	.	.
tdk.54	0	0	.	.	.
tdk.55	0	0	.	.	.
tdk.56	0	0	.	.	.
tdk.57	0	0	.	.	.
tdk.58	0	0	.	.	.
tdk.59	0	0	.	.	.
tdk.6	0	0	.	.	.
tdk.60	0	0	.	.	.
tdk.61	0	0	.	.	.
tdk.62	0	0	.	.	.
tdk.63	0	0	.	.	.
tdk.64	0	0	.	.	.
tdk.65	0	0	.	.	.
tdk.66	0	0	.	.	.
tdk.67	0	0	.	.	.
tdk.68	0	0	.	.	.
tdk.69	0	0	.	.	.
tdk.7	0	0	.	.	.
tdk.70	0	0	.	.	.
tdk.71	0	0	.	.	.
tdk.72	0	0	.	.	.
tdk.73	0	0	.	.	.
tdk.74	0	0	.	.	.
tdk.75	0	0	.	.	.
tdk.76	0	0	.	.	.
tdk.77	0	0	.	.	.
tdk.78	0	0	.	.	.
tdk.79	0	0	.	.	.
tdk.8	0	0	.	.	.
tdk.80	0	0	.	.	.
tdk.81	0	0	.	.	.
tdk.82	0	0	.	.	.
tdk.83	0	0	.	.	.
tdk.84	0	0	.	.	.
tdk.85	0	0	.	.	.
tdk.86	0	0	.	.	.
tdk.87	0	0	.	.	.
tdk.88	0	0	.	.	.
tdk.89	0	0	.	.	.
tdk.9	0	0	.	.	.
tdk.90	0	0	.	.	.
tdk.91	0	0	.	.	.
tdk.92	0	0	.	.	.
tdk.93	0	0	.	.	.
tdk.94	0	0	.	.	.
tdk.95	0	0	.	.	.
tdk.96	0	0	.	.	.
tdk.97	0	0	.	.	.
tdk.98	0	0	.	.	.
tdk.99	0	0	.	.	.
tpi.1	0	0	.	.	.
tpi.10	0	0	.	.	.
tpi.11	0	0	.	.	.
tpi.12	0	0	.	.	.
tpi.13	0	0	.	.	.
tpi.14	0	0	.	.	.
tpi.15	0	0	.	.	.
tpi.16	0	0	.	.	.
tpi.17	0	0	.	.	.
tpi.18	0	0	.	.	.
tpi.19	0	0	.	.	.
tpi.2	0	0	.	.	.
tpi.20	0	0	.	.	.
tpi.21	0	0	.	.	.
tpi.22	0	0	.	.	.
tpi.23	0	0	.	.	.
tpi.24	0	0	.	.	.
tpi.25	0	0	.	.	.
tpi.26	0	0	.	.	.
tpi.27	0	0	.	.	.
tpi.28	0	0	.	.	.
tpi.29	0	0	.	.	.
tpi.3	0	0	.	.	.
tpi.30	0	0	.	.	.
tpi.31	0	0	.	.	.
tpi.32	0	0	.	.	.
tpi.33	0	0	.	.	.
tpi.34	0	0	.	.	.
tpi.35	0	0	.	.	.
tpi.36	0	0	.	.	.
tpi.37	0	0	.	.	.
tpi.38	0	0	.	.	.
tpi.39	0	0	.	.	.
tpi.4	0	0	.	.	.
tpi.40	0	0	.	.	.
tpi.41	0	0	.	.	.
tpi.43	0	0	.	.	.
tpi.44	0	0	.	.	.
tpi.45	0	0	.	.	.
tpi.46	0	0	.	.	.
tpi.47	0	0	.	.	.
tpi.48	0	0	.	.	.
tpi.49	0	0	.	.	.
tpi.5	0	0	.	.	.
tpi.50	0	0	.	.	.
tpi.51	0	0	.	.	.
tpi.6	0	0	.	.	.
tpi.7	0	0	.	.	.
tpi.8	0	0	.	.	.
tpi.9	0	0	.	.	.
yqiL.1	0	0	.	.	.
yqiL.10	0	0	.	.	.
yqiL.11	0	0	.	.	.
yqiL.12	0	0	.	.	.
yqiL.13	0	0	.	.	.
yqiL.14	0	0	.	.	.
yqiL.15	0	0	.	.	.
yqiL.16	0	0	.	.	.
yqiL.17	0	0	.	.	.
yqiL.18	0	0	.	.	.
yqiL.19	0	0	.	.	.
yqiL.2	0	0	.	.	.
yqiL.20	0	0	.	.	.
yqiL.21	0	0	.	.	.
yqiL.22	0	0	.	.	.
yqiL.23	0	0	.	.	.
yqiL.24	0	0	.	.	.
yqiL.25	0	0	.	.	.
yqiL.26	0	0	.	.	.
yqiL.27	0	0	.	.	.
yqiL.28	0	0	.	.	.
yqiL.29	0	0	.	.	.
yqiL.3	0	0	.	.	.
yqiL.30	0	0	.	.	.
yqiL.31	0	0	.	.	.
yqiL.32	0	0	.	.	.
yqiL.33	0	0	.	.	.
yqiL.34	0	0	.	.	.
yqiL.35	0	0	.	.	.
yqiL.36	0	0	.	.	.
yqiL.37	0	0	.	.	.
yqiL.38	0	0	.	.	.
yqiL.39	0	0	.	.	.
yqiL.4	0	0	.	.	.
yqiL.40	0	0	.	.	.
yqiL.41	0	0	.	.	.
yqiL.42	0	0	.	.	.
yqiL.43	0	0	.	.	.
yqiL.44	0	0	.	.	.
yqiL.45	0	0	.	.	.
yqiL.46	0	0	.	.	.
yqiL.47	0	0	.	.	.
yqiL.48	0	0	.	.	.
yqiL.49	0	0	.	.	.
yqiL.5	0	0	.	.	.
yqiL.50	0	0	.	.	.
yqiL.51	0	0	.	.	.
yqiL.52	0	0	.	.	.
yqiL.53	0	0	.	.	.
yqiL.54	0	0	.	.	.
yqiL.55	0	0	.	.	.
yqiL.56	0	0	.	.	.
yqiL.57	0	0	.	.	.
yqiL.58	0	0	.	.	.
yqiL.59	0	0	.	.	.
yqiL.6	0	0	.	.	.
yqiL.60	0	0	.	.	.
yqiL.61	0	0	.	.	.
yqiL.62	0	0	.	.	.
yqiL.63	0	0	.	.	.
yqiL.64	0	0	.	.	.
yqiL.65	0	0	.	.	.
yqiL.66	0	0	.	.	.
yqiL.67	0	0	.	.	.
yqiL.68	0	0	.	.	.
yqiL.69	0	0	.	.	.
yqiL.7	0	0	.	.	.
yqiL.70	0	0	.	.	.
yqiL.71	0	0	.	.	.
yqiL.74	0	0	.	.	.
yqiL.75	0	0	.	.	.
yqiL.76	0	0	.	.	.
yqiL.77	0	0	.	.	.
yqiL.78	0	0	.	.	.
yqiL.79	0	0	.	.	.
yqiL.8	0	0	.	.	.
yqiL.80	0	0	.	.	.
yqiL.81	0	0	.	.	.
yqiL.82	0	0	.	.	.
yqiL.83	0	0	.	.	.
yqiL.84	0	0	.	.	.
yqiL.85	0	0	.	.	.
yqiL.9	0	0	.	.	.
