adk.1	adk.10	adk.11	adk.12	adk.13	adk.14	adk.15	adk.16	adk.17	adk.18	adk.19	adk.2	adk.20	adk.21	adk.3	adk.4	adk.5	adk.6	adk.7	adk.8	adk.9
aroE.1	aroE.10	aroE.11	aroE.12	aroE.13	aroE.14	aroE.15	aroE.2	aroE.3	aroE.4	aroE.5	aroE.6	aroE.7	aroE.8	aroE.9
deoD.1	deoD.10	deoD.11	deoD.12	deoD.13	deoD.14	deoD.15	deoD.16	deoD.17	deoD.18	deoD.19	deoD.2	deoD.20	deoD.3	deoD.4	deoD.5	deoD.6	deoD.7	deoD.8	deoD.9
gapDH.1	gapDH.10	gapDH.11	gapDH.12	gapDH.13	gapDH.14	gapDH.15	gapDH.2	gapDH.3	gapDH.4	gapDH.5	gapDH.6	gapDH.7	gapDH.8	gapDH.9
gnd.1	gnd.10	gnd.11	gnd.12	gnd.13	gnd.14	gnd.15	gnd.16	gnd.17	gnd.2	gnd.3	gnd.4	gnd.5	gnd.6	gnd.7	gnd.8	gnd.9
mdh.1	mdh.10	mdh.11	mdh.12	mdh.13	mdh.14	mdh.15	mdh.16	mdh.17	mdh.18	mdh.19	mdh.2	mdh.3	mdh.4	mdh.5	mdh.6	mdh.7	mdh.8	mdh.9
zwf.1	zwf.10	zwf.11	zwf.12	zwf.13	zwf.14	zwf.15	zwf.16	zwf.17	zwf.18	zwf.19	zwf.2	zwf.20	zwf.3	zwf.4	zwf.5	zwf.6	zwf.7	zwf.8	zwf.9
