ADE2	ADE2.1	ADE2.10	ADE2.11	ADE2.12	ADE2.13	ADE2.14	ADE2.15	ADE2.16	ADE2.17	ADE2.18	ADE2.19	ADE2.2	ADE2.20	ADE2.21	ADE2.22	ADE2.23	ADE2.24	ADE2.25	ADE2.26	ADE2.3	ADE2.4	ADE2.5	ADE2.6	ADE2.7	ADE2.8	ADE2.9
HIS3	HIS3.1	HIS3.10	HIS3.11	HIS3.12	HIS3.13	HIS3.14	HIS3.15	HIS3.16	HIS3.17	HIS3.18	HIS3.19	HIS3.2	HIS3.20	HIS3.21	HIS3.22	HIS3.23	HIS3.3	HIS3.4	HIS3.5	HIS3.6	HIS3.7	HIS3.8	HIS3.9
LEU2	LEU2.1	LEU2.10	LEU2.11	LEU2.12	LEU2.13	LEU2.14	LEU2.15	LEU2.16	LEU2.17	LEU2.18	LEU2.19	LEU2.2	LEU2.20	LEU2.21	LEU2.22	LEU2.23	LEU2.24	LEU2.25	LEU2.26	LEU2.27	LEU2.3	LEU2.4	LEU2.5	LEU2.6	LEU2.7	LEU2.8	LEU2.9
LYS2D	LYS2D.1	LYS2D.10	LYS2D.11	LYS2D.12	LYS2D.13	LYS2D.14	LYS2D.15	LYS2D.16	LYS2D.17	LYS2D.18	LYS2D.19	LYS2D.2	LYS2D.20	LYS2D.21	LYS2D.22	LYS2D.23	LYS2D.24	LYS2D.25	LYS2D.26	LYS2D.27	LYS2D.3	LYS2D.4	LYS2D.5	LYS2D.6	LYS2D.7	LYS2D.8	LYS2D.9
NMT1	NMT1.1	NMT1.10	NMT1.11	NMT1.12	NMT1.13	NMT1.14	NMT1.15	NMT1.16	NMT1.17	NMT1.18	NMT1.19	NMT1.2	NMT1.20	NMT1.21	NMT1.22	NMT1.23	NMT1.24	NMT1.25	NMT1.26	NMT1.27	NMT1.28	NMT1.29	NMT1.3	NMT1.30	NMT1.31	NMT1.32	NMT1.33	NMT1.34	NMT1.35	NMT1.4	NMT1.5	NMT1.6	NMT1.7	NMT1.8	NMT1.9
TRP1	TRP1.1	TRP1.10	TRP1.11	TRP1.12	TRP1.13	TRP1.14	TRP1.15	TRP1.16	TRP1.17	TRP1.18	TRP1.19	TRP1.2	TRP1.20	TRP1.21	TRP1.22	TRP1.23	TRP1.24	TRP1.25	TRP1.26	TRP1.27	TRP1.28	TRP1.29	TRP1.3	TRP1.30	TRP1.31	TRP1.32	TRP1.33	TRP1.34	TRP1.35	TRP1.4	TRP1.5	TRP1.6	TRP1.7	TRP1.8	TRP1.9
