Actin	Actin.1	Actin.10	Actin.11	Actin.12	Actin.13	Actin.14	Actin.15	Actin.16	Actin.17	Actin.18	Actin.19	Actin.2	Actin.20	Actin.21	Actin.22	Actin.23	Actin.24	Actin.25	Actin.26	Actin.27	Actin.28	Actin.29	Actin.3	Actin.30	Actin.31	Actin.32	Actin.33	Actin.34	Actin.35	Actin.36	Actin.37	Actin.38	Actin.39	Actin.4	Actin.40	Actin.41	Actin.42	Actin.43	Actin.44	Actin.45	Actin.46	Actin.47	Actin.48	Actin.49	Actin.5	Actin.50	Actin.51	Actin.52	Actin.53	Actin.54	Actin.55	Actin.56	Actin.57	Actin.58	Actin.59	Actin.6	Actin.60	Actin.61	Actin.62	Actin.63	Actin.64	Actin.65	Actin.66	Actin.67	Actin.68	Actin.69	Actin.7	Actin.70	Actin.71	Actin.72	Actin.73	Actin.74	Actin.75	Actin.76	Actin.8	Actin.9
Cox1	Cox1.1	Cox1.10	Cox1.11	Cox1.12	Cox1.13	Cox1.2	Cox1.3	Cox1.4	Cox1.5	Cox1.6	Cox1.7	Cox1.8	Cox1.9
Cox3	Cox3.1	Cox3.10	Cox3.11	Cox3.12	Cox3.13	Cox3.14	Cox3.15	Cox3.16	Cox3.2	Cox3.3	Cox3.4	Cox3.5	Cox3.6	Cox3.7	Cox3.8	Cox3.9
Ef_1a	Ef_1a.1	Ef_1a.10	Ef_1a.11	Ef_1a.12	Ef_1a.13	Ef_1a.14	Ef_1a.15	Ef_1a.16	Ef_1a.17	Ef_1a.18	Ef_1a.19	Ef_1a.2	Ef_1a.20	Ef_1a.21	Ef_1a.22	Ef_1a.23	Ef_1a.24	Ef_1a.25	Ef_1a.26	Ef_1a.27	Ef_1a.28	Ef_1a.29	Ef_1a.3	Ef_1a.30	Ef_1a.4	Ef_1a.5	Ef_1a.6	Ef_1a.7	Ef_1a.8	Ef_1a.9
Its1	Its1.1	Its1.10	Its1.11	Its1.12	Its1.13	Its1.14	Its1.15	Its1.16	Its1.17	Its1.18	Its1.19	Its1.2	Its1.20	Its1.21	Its1.22	Its1.23	Its1.24	Its1.25	Its1.26	Its1.27	Its1.28	Its1.29	Its1.3	Its1.30	Its1.31	Its1.4	Its1.5	Its1.6	Its1.7	Its1.8	Its1.9
Nad4	Nad4.1	Nad4.10	Nad4.100	Nad4.101	Nad4.11	Nad4.12	Nad4.13	Nad4.14	Nad4.15	Nad4.16	Nad4.17	Nad4.18	Nad4.19	Nad4.2	Nad4.20	Nad4.21	Nad4.22	Nad4.23	Nad4.24	Nad4.25	Nad4.26	Nad4.27	Nad4.28	Nad4.29	Nad4.3	Nad4.30	Nad4.31	Nad4.32	Nad4.33	Nad4.34	Nad4.35	Nad4.36	Nad4.37	Nad4.38	Nad4.39	Nad4.4	Nad4.40	Nad4.41	Nad4.42	Nad4.43	Nad4.44	Nad4.45	Nad4.46	Nad4.47	Nad4.48	Nad4.49	Nad4.5	Nad4.50	Nad4.51	Nad4.52	Nad4.53	Nad4.54	Nad4.55	Nad4.56	Nad4.57	Nad4.58	Nad4.59	Nad4.6	Nad4.60	Nad4.61	Nad4.62	Nad4.63	Nad4.64	Nad4.65	Nad4.66	Nad4.67	Nad4.68	Nad4.69	Nad4.7	Nad4.70	Nad4.71	Nad4.72	Nad4.73	Nad4.74	Nad4.75	Nad4.76	Nad4.77	Nad4.78	Nad4.79	Nad4.8	Nad4.80	Nad4.81	Nad4.82	Nad4.83	Nad4.84	Nad4.85	Nad4.86	Nad4.87	Nad4.88	Nad4.89	Nad4.9	Nad4.90	Nad4.91	Nad4.92	Nad4.93	Nad4.94	Nad4.95	Nad4.96	Nad4.97	Nad4.98	Nad4.99
Nad5	Nad5.1	Nad5.10	Nad5.100	Nad5.101	Nad5.102	Nad5.103	Nad5.104	Nad5.105	Nad5.106	Nad5.107	Nad5.108	Nad5.109	Nad5.11	Nad5.110	Nad5.111	Nad5.112	Nad5.113	Nad5.114	Nad5.115	Nad5.116	Nad5.117	Nad5.118	Nad5.119	Nad5.12	Nad5.13	Nad5.14	Nad5.15	Nad5.16	Nad5.17	Nad5.18	Nad5.19	Nad5.2	Nad5.20	Nad5.21	Nad5.22	Nad5.23	Nad5.24	Nad5.25	Nad5.26	Nad5.27	Nad5.28	Nad5.29	Nad5.3	Nad5.30	Nad5.31	Nad5.32	Nad5.33	Nad5.34	Nad5.35	Nad5.36	Nad5.37	Nad5.38	Nad5.39	Nad5.4	Nad5.40	Nad5.41	Nad5.42	Nad5.43	Nad5.44	Nad5.45	Nad5.46	Nad5.47	Nad5.48	Nad5.49	Nad5.5	Nad5.50	Nad5.51	Nad5.52	Nad5.53	Nad5.54	Nad5.55	Nad5.56	Nad5.57	Nad5.58	Nad5.59	Nad5.6	Nad5.60	Nad5.61	Nad5.62	Nad5.63	Nad5.64	Nad5.65	Nad5.66	Nad5.67	Nad5.68	Nad5.69	Nad5.7	Nad5.70	Nad5.71	Nad5.72	Nad5.73	Nad5.74	Nad5.75	Nad5.76	Nad5.77	Nad5.78	Nad5.79	Nad5.8	Nad5.80	Nad5.81	Nad5.82	Nad5.83	Nad5.84	Nad5.85	Nad5.86	Nad5.87	Nad5.88	Nad5.89	Nad5.9	Nad5.90	Nad5.91	Nad5.92	Nad5.93	Nad5.94	Nad5.95	Nad5.96	Nad5.97	Nad5.98	Nad5.99
Tubulin	Tubulin.1	Tubulin.10	Tubulin.11	Tubulin.12	Tubulin.13	Tubulin.14	Tubulin.15	Tubulin.16	Tubulin.17	Tubulin.18	Tubulin.19	Tubulin.2	Tubulin.3	Tubulin.4	Tubulin.5	Tubulin.6	Tubulin.7	Tubulin.8	Tubulin.9
