AAT1a	AAT1a.1	AAT1a.10	AAT1a.100	AAT1a.101	AAT1a.102	AAT1a.103	AAT1a.104	AAT1a.105	AAT1a.106	AAT1a.107	AAT1a.108	AAT1a.109	AAT1a.11	AAT1a.110	AAT1a.111	AAT1a.112	AAT1a.113	AAT1a.114	AAT1a.115	AAT1a.116	AAT1a.117	AAT1a.118	AAT1a.119	AAT1a.12	AAT1a.120	AAT1a.121	AAT1a.122	AAT1a.123	AAT1a.124	AAT1a.125	AAT1a.126	AAT1a.127	AAT1a.128	AAT1a.129	AAT1a.13	AAT1a.130	AAT1a.131	AAT1a.132	AAT1a.133	AAT1a.134	AAT1a.135	AAT1a.136	AAT1a.137	AAT1a.138	AAT1a.139	AAT1a.14	AAT1a.140	AAT1a.141	AAT1a.142	AAT1a.143	AAT1a.144	AAT1a.145	AAT1a.146	AAT1a.147	AAT1a.148	AAT1a.149	AAT1a.15	AAT1a.150	AAT1a.151	AAT1a.152	AAT1a.153	AAT1a.154	AAT1a.155	AAT1a.156	AAT1a.157	AAT1a.158	AAT1a.159	AAT1a.16	AAT1a.160	AAT1a.161	AAT1a.162	AAT1a.163	AAT1a.164	AAT1a.165	AAT1a.166	AAT1a.167	AAT1a.168	AAT1a.169	AAT1a.17	AAT1a.170	AAT1a.171	AAT1a.172	AAT1a.173	AAT1a.174	AAT1a.175	AAT1a.176	AAT1a.177	AAT1a.178	AAT1a.179	AAT1a.18	AAT1a.180	AAT1a.181	AAT1a.182	AAT1a.19	AAT1a.2	AAT1a.20	AAT1a.21	AAT1a.22	AAT1a.23	AAT1a.24	AAT1a.25	AAT1a.26	AAT1a.27	AAT1a.28	AAT1a.29	AAT1a.3	AAT1a.30	AAT1a.31	AAT1a.32	AAT1a.33	AAT1a.34	AAT1a.35	AAT1a.36	AAT1a.37	AAT1a.38	AAT1a.39	AAT1a.4	AAT1a.40	AAT1a.41	AAT1a.42	AAT1a.43	AAT1a.44	AAT1a.45	AAT1a.46	AAT1a.47	AAT1a.48	AAT1a.49	AAT1a.5	AAT1a.50	AAT1a.51	AAT1a.52	AAT1a.53	AAT1a.54	AAT1a.55	AAT1a.56	AAT1a.57	AAT1a.58	AAT1a.59	AAT1a.6	AAT1a.60	AAT1a.61	AAT1a.62	AAT1a.63	AAT1a.64	AAT1a.65	AAT1a.66	AAT1a.67	AAT1a.68	AAT1a.69	AAT1a.7	AAT1a.70	AAT1a.71	AAT1a.72	AAT1a.73	AAT1a.74	AAT1a.75	AAT1a.76	AAT1a.77	AAT1a.78	AAT1a.79	AAT1a.8	AAT1a.80	AAT1a.81	AAT1a.82	AAT1a.83	AAT1a.84	AAT1a.85	AAT1a.86	AAT1a.87	AAT1a.88	AAT1a.89	AAT1a.9	AAT1a.90	AAT1a.91	AAT1a.92	AAT1a.93	AAT1a.94	AAT1a.95	AAT1a.96	AAT1a.97	AAT1a.98	AAT1a.99
ACC1	ACC1.1	ACC1.10	ACC1.100	ACC1.101	ACC1.102	ACC1.103	ACC1.104	ACC1.105	ACC1.106	ACC1.107	ACC1.108	ACC1.109	ACC1.11	ACC1.110	ACC1.111	ACC1.112	ACC1.113	ACC1.114	ACC1.115	ACC1.116	ACC1.12	ACC1.13	ACC1.14	ACC1.15	ACC1.16	ACC1.17	ACC1.18	ACC1.19	ACC1.2	ACC1.20	ACC1.21	ACC1.22	ACC1.23	ACC1.24	ACC1.25	ACC1.26	ACC1.27	ACC1.28	ACC1.29	ACC1.3	ACC1.30	ACC1.31	ACC1.32	ACC1.33	ACC1.34	ACC1.35	ACC1.36	ACC1.37	ACC1.38	ACC1.39	ACC1.4	ACC1.40	ACC1.41	ACC1.42	ACC1.43	ACC1.44	ACC1.45	ACC1.46	ACC1.47	ACC1.48	ACC1.49	ACC1.5	ACC1.50	ACC1.51	ACC1.52	ACC1.53	ACC1.54	ACC1.55	ACC1.56	ACC1.57	ACC1.58	ACC1.59	ACC1.6	ACC1.60	ACC1.61	ACC1.62	ACC1.63	ACC1.64	ACC1.65	ACC1.66	ACC1.67	ACC1.68	ACC1.69	ACC1.7	ACC1.70	ACC1.71	ACC1.72	ACC1.73	ACC1.74	ACC1.75	ACC1.76	ACC1.77	ACC1.78	ACC1.79	ACC1.8	ACC1.80	ACC1.81	ACC1.82	ACC1.83	ACC1.84	ACC1.85	ACC1.86	ACC1.87	ACC1.88	ACC1.89	ACC1.9	ACC1.90	ACC1.91	ACC1.92	ACC1.93	ACC1.94	ACC1.95	ACC1.96	ACC1.97	ACC1.98	ACC1.99
ADP1	ADP1.1	ADP1.10	ADP1.100	ADP1.101	ADP1.102	ADP1.103	ADP1.104	ADP1.105	ADP1.106	ADP1.107	ADP1.108	ADP1.109	ADP1.11	ADP1.110	ADP1.111	ADP1.112	ADP1.113	ADP1.114	ADP1.115	ADP1.116	ADP1.117	ADP1.118	ADP1.119	ADP1.12	ADP1.120	ADP1.121	ADP1.122	ADP1.123	ADP1.124	ADP1.125	ADP1.126	ADP1.127	ADP1.128	ADP1.129	ADP1.13	ADP1.130	ADP1.131	ADP1.132	ADP1.133	ADP1.134	ADP1.135	ADP1.136	ADP1.137	ADP1.138	ADP1.139	ADP1.14	ADP1.140	ADP1.141	ADP1.142	ADP1.143	ADP1.144	ADP1.145	ADP1.146	ADP1.147	ADP1.148	ADP1.149	ADP1.15	ADP1.150	ADP1.151	ADP1.152	ADP1.153	ADP1.154	ADP1.155	ADP1.156	ADP1.157	ADP1.158	ADP1.159	ADP1.16	ADP1.160	ADP1.161	ADP1.162	ADP1.163	ADP1.164	ADP1.165	ADP1.166	ADP1.167	ADP1.168	ADP1.169	ADP1.17	ADP1.170	ADP1.171	ADP1.172	ADP1.173	ADP1.18	ADP1.19	ADP1.2	ADP1.20	ADP1.21	ADP1.22	ADP1.23	ADP1.24	ADP1.25	ADP1.26	ADP1.27	ADP1.28	ADP1.29	ADP1.3	ADP1.30	ADP1.31	ADP1.32	ADP1.33	ADP1.34	ADP1.35	ADP1.36	ADP1.37	ADP1.38	ADP1.39	ADP1.4	ADP1.40	ADP1.41	ADP1.42	ADP1.43	ADP1.44	ADP1.45	ADP1.46	ADP1.47	ADP1.48	ADP1.49	ADP1.5	ADP1.50	ADP1.51	ADP1.52	ADP1.53	ADP1.54	ADP1.55	ADP1.56	ADP1.57	ADP1.58	ADP1.59	ADP1.6	ADP1.60	ADP1.61	ADP1.62	ADP1.63	ADP1.64	ADP1.65	ADP1.66	ADP1.67	ADP1.68	ADP1.69	ADP1.7	ADP1.70	ADP1.71	ADP1.72	ADP1.73	ADP1.74	ADP1.75	ADP1.76	ADP1.77	ADP1.78	ADP1.79	ADP1.8	ADP1.80	ADP1.81	ADP1.82	ADP1.83	ADP1.84	ADP1.85	ADP1.86	ADP1.87	ADP1.88	ADP1.89	ADP1.9	ADP1.90	ADP1.91	ADP1.92	ADP1.93	ADP1.94	ADP1.95	ADP1.96	ADP1.97	ADP1.98	ADP1.99
MPIb	MPIb.1	MPIb.10	MPIb.100	MPIb.101	MPIb.102	MPIb.103	MPIb.104	MPIb.105	MPIb.106	MPIb.107	MPIb.108	MPIb.109	MPIb.11	MPIb.110	MPIb.111	MPIb.112	MPIb.113	MPIb.114	MPIb.115	MPIb.116	MPIb.117	MPIb.118	MPIb.119	MPIb.12	MPIb.120	MPIb.121	MPIb.122	MPIb.123	MPIb.124	MPIb.125	MPIb.126	MPIb.127	MPIb.128	MPIb.129	MPIb.13	MPIb.130	MPIb.131	MPIb.132	MPIb.133	MPIb.134	MPIb.135	MPIb.136	MPIb.137	MPIb.138	MPIb.139	MPIb.14	MPIb.140	MPIb.141	MPIb.142	MPIb.143	MPIb.144	MPIb.145	MPIb.146	MPIb.147	MPIb.148	MPIb.149	MPIb.15	MPIb.150	MPIb.151	MPIb.152	MPIb.153	MPIb.154	MPIb.155	MPIb.156	MPIb.157	MPIb.158	MPIb.159	MPIb.16	MPIb.160	MPIb.161	MPIb.162	MPIb.163	MPIb.164	MPIb.165	MPIb.166	MPIb.167	MPIb.168	MPIb.169	MPIb.17	MPIb.170	MPIb.171	MPIb.172	MPIb.173	MPIb.174	MPIb.175	MPIb.18	MPIb.19	MPIb.2	MPIb.20	MPIb.21	MPIb.22	MPIb.23	MPIb.24	MPIb.25	MPIb.26	MPIb.27	MPIb.28	MPIb.29	MPIb.3	MPIb.30	MPIb.31	MPIb.32	MPIb.33	MPIb.34	MPIb.35	MPIb.36	MPIb.37	MPIb.38	MPIb.39	MPIb.4	MPIb.40	MPIb.41	MPIb.42	MPIb.43	MPIb.44	MPIb.45	MPIb.46	MPIb.47	MPIb.48	MPIb.49	MPIb.5	MPIb.50	MPIb.51	MPIb.52	MPIb.53	MPIb.54	MPIb.55	MPIb.56	MPIb.57	MPIb.58	MPIb.59	MPIb.6	MPIb.60	MPIb.61	MPIb.62	MPIb.63	MPIb.64	MPIb.65	MPIb.66	MPIb.67	MPIb.68	MPIb.69	MPIb.7	MPIb.70	MPIb.71	MPIb.72	MPIb.73	MPIb.74	MPIb.75	MPIb.76	MPIb.77	MPIb.78	MPIb.79	MPIb.8	MPIb.80	MPIb.81	MPIb.82	MPIb.83	MPIb.84	MPIb.85	MPIb.86	MPIb.87	MPIb.88	MPIb.89	MPIb.9	MPIb.90	MPIb.91	MPIb.92	MPIb.93	MPIb.94	MPIb.95	MPIb.96	MPIb.97	MPIb.98	MPIb.99
SYA1	SYA1.1	SYA1.10	SYA1.100	SYA1.101	SYA1.102	SYA1.103	SYA1.104	SYA1.105	SYA1.106	SYA1.107	SYA1.108	SYA1.109	SYA1.11	SYA1.110	SYA1.111	SYA1.112	SYA1.113	SYA1.114	SYA1.115	SYA1.116	SYA1.117	SYA1.118	SYA1.119	SYA1.12	SYA1.120	SYA1.121	SYA1.122	SYA1.123	SYA1.124	SYA1.125	SYA1.126	SYA1.127	SYA1.128	SYA1.129	SYA1.13	SYA1.130	SYA1.131	SYA1.132	SYA1.133	SYA1.134	SYA1.135	SYA1.136	SYA1.137	SYA1.138	SYA1.139	SYA1.14	SYA1.140	SYA1.141	SYA1.142	SYA1.143	SYA1.144	SYA1.145	SYA1.146	SYA1.147	SYA1.148	SYA1.149	SYA1.15	SYA1.150	SYA1.151	SYA1.152	SYA1.153	SYA1.154	SYA1.155	SYA1.156	SYA1.157	SYA1.158	SYA1.159	SYA1.16	SYA1.160	SYA1.161	SYA1.162	SYA1.163	SYA1.164	SYA1.165	SYA1.166	SYA1.167	SYA1.168	SYA1.169	SYA1.17	SYA1.170	SYA1.171	SYA1.172	SYA1.173	SYA1.174	SYA1.175	SYA1.176	SYA1.177	SYA1.178	SYA1.179	SYA1.18	SYA1.180	SYA1.181	SYA1.182	SYA1.183	SYA1.184	SYA1.185	SYA1.186	SYA1.187	SYA1.188	SYA1.189	SYA1.19	SYA1.190	SYA1.191	SYA1.192	SYA1.193	SYA1.194	SYA1.195	SYA1.196	SYA1.197	SYA1.198	SYA1.199	SYA1.2	SYA1.20	SYA1.200	SYA1.201	SYA1.202	SYA1.203	SYA1.204	SYA1.205	SYA1.206	SYA1.207	SYA1.208	SYA1.209	SYA1.21	SYA1.210	SYA1.211	SYA1.212	SYA1.213	SYA1.214	SYA1.215	SYA1.216	SYA1.217	SYA1.218	SYA1.219	SYA1.22	SYA1.220	SYA1.221	SYA1.222	SYA1.223	SYA1.224	SYA1.225	SYA1.226	SYA1.227	SYA1.228	SYA1.229	SYA1.23	SYA1.230	SYA1.231	SYA1.232	SYA1.233	SYA1.234	SYA1.235	SYA1.236	SYA1.237	SYA1.238	SYA1.239	SYA1.24	SYA1.25	SYA1.26	SYA1.27	SYA1.28	SYA1.29	SYA1.3	SYA1.30	SYA1.31	SYA1.32	SYA1.33	SYA1.34	SYA1.35	SYA1.36	SYA1.37	SYA1.38	SYA1.39	SYA1.4	SYA1.40	SYA1.41	SYA1.42	SYA1.43	SYA1.44	SYA1.45	SYA1.46	SYA1.47	SYA1.48	SYA1.49	SYA1.5	SYA1.50	SYA1.51	SYA1.52	SYA1.53	SYA1.54	SYA1.55	SYA1.56	SYA1.57	SYA1.58	SYA1.59	SYA1.6	SYA1.60	SYA1.61	SYA1.62	SYA1.63	SYA1.64	SYA1.65	SYA1.66	SYA1.67	SYA1.68	SYA1.69	SYA1.7	SYA1.70	SYA1.71	SYA1.72	SYA1.73	SYA1.74	SYA1.75	SYA1.76	SYA1.77	SYA1.78	SYA1.79	SYA1.8	SYA1.80	SYA1.81	SYA1.82	SYA1.83	SYA1.84	SYA1.85	SYA1.86	SYA1.87	SYA1.88	SYA1.89	SYA1.9	SYA1.90	SYA1.91	SYA1.92	SYA1.93	SYA1.94	SYA1.95	SYA1.96	SYA1.97	SYA1.98	SYA1.99
VPS13	VPS13.1	VPS13.10	VPS13.100	VPS13.101	VPS13.102	VPS13.103	VPS13.104	VPS13.105	VPS13.106	VPS13.107	VPS13.108	VPS13.109	VPS13.11	VPS13.110	VPS13.111	VPS13.112	VPS13.113	VPS13.114	VPS13.115	VPS13.116	VPS13.117	VPS13.118	VPS13.119	VPS13.12	VPS13.120	VPS13.121	VPS13.122	VPS13.123	VPS13.124	VPS13.125	VPS13.126	VPS13.127	VPS13.128	VPS13.129	VPS13.13	VPS13.130	VPS13.131	VPS13.132	VPS13.133	VPS13.134	VPS13.135	VPS13.136	VPS13.137	VPS13.138	VPS13.139	VPS13.14	VPS13.140	VPS13.141	VPS13.142	VPS13.143	VPS13.144	VPS13.145	VPS13.146	VPS13.147	VPS13.148	VPS13.149	VPS13.15	VPS13.150	VPS13.151	VPS13.152	VPS13.153	VPS13.154	VPS13.155	VPS13.156	VPS13.157	VPS13.158	VPS13.159	VPS13.16	VPS13.160	VPS13.161	VPS13.162	VPS13.163	VPS13.164	VPS13.165	VPS13.166	VPS13.167	VPS13.168	VPS13.169	VPS13.17	VPS13.170	VPS13.171	VPS13.172	VPS13.173	VPS13.174	VPS13.175	VPS13.176	VPS13.177	VPS13.178	VPS13.179	VPS13.18	VPS13.180	VPS13.181	VPS13.182	VPS13.183	VPS13.184	VPS13.185	VPS13.186	VPS13.187	VPS13.188	VPS13.189	VPS13.19	VPS13.190	VPS13.191	VPS13.192	VPS13.193	VPS13.194	VPS13.195	VPS13.196	VPS13.197	VPS13.198	VPS13.199	VPS13.2	VPS13.20	VPS13.200	VPS13.201	VPS13.202	VPS13.203	VPS13.204	VPS13.205	VPS13.206	VPS13.207	VPS13.208	VPS13.209	VPS13.21	VPS13.210	VPS13.211	VPS13.212	VPS13.213	VPS13.214	VPS13.215	VPS13.216	VPS13.217	VPS13.218	VPS13.219	VPS13.22	VPS13.220	VPS13.221	VPS13.222	VPS13.223	VPS13.224	VPS13.225	VPS13.226	VPS13.227	VPS13.228	VPS13.229	VPS13.23	VPS13.230	VPS13.231	VPS13.232	VPS13.233	VPS13.234	VPS13.235	VPS13.236	VPS13.237	VPS13.238	VPS13.239	VPS13.24	VPS13.240	VPS13.241	VPS13.242	VPS13.243	VPS13.244	VPS13.245	VPS13.246	VPS13.247	VPS13.248	VPS13.249	VPS13.25	VPS13.250	VPS13.251	VPS13.252	VPS13.253	VPS13.254	VPS13.255	VPS13.256	VPS13.257	VPS13.258	VPS13.259	VPS13.26	VPS13.260	VPS13.261	VPS13.262	VPS13.263	VPS13.264	VPS13.265	VPS13.266	VPS13.267	VPS13.268	VPS13.269	VPS13.27	VPS13.270	VPS13.271	VPS13.272	VPS13.273	VPS13.274	VPS13.275	VPS13.276	VPS13.277	VPS13.278	VPS13.279	VPS13.28	VPS13.280	VPS13.281	VPS13.282	VPS13.283	VPS13.284	VPS13.285	VPS13.286	VPS13.287	VPS13.288	VPS13.289	VPS13.29	VPS13.290	VPS13.291	VPS13.292	VPS13.293	VPS13.294	VPS13.295	VPS13.296	VPS13.297	VPS13.298	VPS13.299	VPS13.3	VPS13.30	VPS13.300	VPS13.301	VPS13.302	VPS13.303	VPS13.304	VPS13.305	VPS13.306	VPS13.307	VPS13.308	VPS13.309	VPS13.31	VPS13.32	VPS13.33	VPS13.34	VPS13.35	VPS13.36	VPS13.37	VPS13.38	VPS13.39	VPS13.4	VPS13.40	VPS13.41	VPS13.42	VPS13.43	VPS13.44	VPS13.45	VPS13.46	VPS13.47	VPS13.48	VPS13.49	VPS13.5	VPS13.50	VPS13.51	VPS13.52	VPS13.53	VPS13.54	VPS13.55	VPS13.56	VPS13.57	VPS13.58	VPS13.59	VPS13.6	VPS13.60	VPS13.61	VPS13.62	VPS13.63	VPS13.64	VPS13.65	VPS13.66	VPS13.67	VPS13.68	VPS13.69	VPS13.7	VPS13.70	VPS13.71	VPS13.72	VPS13.73	VPS13.74	VPS13.75	VPS13.76	VPS13.77	VPS13.78	VPS13.79	VPS13.8	VPS13.80	VPS13.81	VPS13.82	VPS13.83	VPS13.84	VPS13.85	VPS13.86	VPS13.87	VPS13.88	VPS13.89	VPS13.9	VPS13.90	VPS13.91	VPS13.92	VPS13.93	VPS13.94	VPS13.95	VPS13.96	VPS13.97	VPS13.98	VPS13.99
ZWF1b	ZWF1b.1	ZWF1b.10	ZWF1b.100	ZWF1b.101	ZWF1b.102	ZWF1b.103	ZWF1b.104	ZWF1b.105	ZWF1b.106	ZWF1b.107	ZWF1b.108	ZWF1b.109	ZWF1b.11	ZWF1b.110	ZWF1b.111	ZWF1b.112	ZWF1b.113	ZWF1b.114	ZWF1b.115	ZWF1b.116	ZWF1b.117	ZWF1b.118	ZWF1b.119	ZWF1b.12	ZWF1b.120	ZWF1b.121	ZWF1b.122	ZWF1b.123	ZWF1b.124	ZWF1b.125	ZWF1b.126	ZWF1b.127	ZWF1b.128	ZWF1b.129	ZWF1b.13	ZWF1b.130	ZWF1b.131	ZWF1b.132	ZWF1b.133	ZWF1b.134	ZWF1b.135	ZWF1b.136	ZWF1b.137	ZWF1b.138	ZWF1b.139	ZWF1b.14	ZWF1b.140	ZWF1b.141	ZWF1b.142	ZWF1b.143	ZWF1b.144	ZWF1b.145	ZWF1b.146	ZWF1b.147	ZWF1b.148	ZWF1b.149	ZWF1b.15	ZWF1b.150	ZWF1b.151	ZWF1b.152	ZWF1b.153	ZWF1b.154	ZWF1b.155	ZWF1b.156	ZWF1b.157	ZWF1b.158	ZWF1b.159	ZWF1b.16	ZWF1b.160	ZWF1b.161	ZWF1b.162	ZWF1b.163	ZWF1b.164	ZWF1b.165	ZWF1b.166	ZWF1b.167	ZWF1b.168	ZWF1b.169	ZWF1b.17	ZWF1b.170	ZWF1b.171	ZWF1b.172	ZWF1b.173	ZWF1b.174	ZWF1b.175	ZWF1b.176	ZWF1b.177	ZWF1b.178	ZWF1b.179	ZWF1b.18	ZWF1b.180	ZWF1b.181	ZWF1b.182	ZWF1b.183	ZWF1b.184	ZWF1b.185	ZWF1b.186	ZWF1b.187	ZWF1b.188	ZWF1b.189	ZWF1b.19	ZWF1b.190	ZWF1b.191	ZWF1b.192	ZWF1b.193	ZWF1b.194	ZWF1b.195	ZWF1b.196	ZWF1b.197	ZWF1b.198	ZWF1b.199	ZWF1b.2	ZWF1b.20	ZWF1b.200	ZWF1b.201	ZWF1b.202	ZWF1b.203	ZWF1b.204	ZWF1b.205	ZWF1b.206	ZWF1b.207	ZWF1b.208	ZWF1b.209	ZWF1b.21	ZWF1b.210	ZWF1b.211	ZWF1b.212	ZWF1b.213	ZWF1b.214	ZWF1b.215	ZWF1b.216	ZWF1b.217	ZWF1b.218	ZWF1b.219	ZWF1b.22	ZWF1b.220	ZWF1b.221	ZWF1b.222	ZWF1b.223	ZWF1b.224	ZWF1b.225	ZWF1b.226	ZWF1b.227	ZWF1b.228	ZWF1b.229	ZWF1b.23	ZWF1b.230	ZWF1b.231	ZWF1b.232	ZWF1b.233	ZWF1b.234	ZWF1b.235	ZWF1b.236	ZWF1b.237	ZWF1b.238	ZWF1b.239	ZWF1b.24	ZWF1b.240	ZWF1b.241	ZWF1b.242	ZWF1b.243	ZWF1b.244	ZWF1b.245	ZWF1b.246	ZWF1b.247	ZWF1b.248	ZWF1b.249	ZWF1b.25	ZWF1b.250	ZWF1b.251	ZWF1b.252	ZWF1b.253	ZWF1b.254	ZWF1b.255	ZWF1b.256	ZWF1b.257	ZWF1b.258	ZWF1b.259	ZWF1b.26	ZWF1b.260	ZWF1b.261	ZWF1b.262	ZWF1b.263	ZWF1b.264	ZWF1b.265	ZWF1b.266	ZWF1b.267	ZWF1b.268	ZWF1b.269	ZWF1b.27	ZWF1b.270	ZWF1b.271	ZWF1b.272	ZWF1b.273	ZWF1b.274	ZWF1b.275	ZWF1b.276	ZWF1b.277	ZWF1b.278	ZWF1b.279	ZWF1b.28	ZWF1b.280	ZWF1b.281	ZWF1b.282	ZWF1b.283	ZWF1b.284	ZWF1b.285	ZWF1b.286	ZWF1b.287	ZWF1b.288	ZWF1b.289	ZWF1b.29	ZWF1b.290	ZWF1b.291	ZWF1b.292	ZWF1b.293	ZWF1b.294	ZWF1b.295	ZWF1b.296	ZWF1b.297	ZWF1b.3	ZWF1b.30	ZWF1b.31	ZWF1b.32	ZWF1b.33	ZWF1b.34	ZWF1b.35	ZWF1b.36	ZWF1b.37	ZWF1b.38	ZWF1b.39	ZWF1b.4	ZWF1b.40	ZWF1b.41	ZWF1b.42	ZWF1b.43	ZWF1b.44	ZWF1b.45	ZWF1b.46	ZWF1b.47	ZWF1b.48	ZWF1b.49	ZWF1b.5	ZWF1b.50	ZWF1b.51	ZWF1b.52	ZWF1b.53	ZWF1b.54	ZWF1b.55	ZWF1b.56	ZWF1b.57	ZWF1b.58	ZWF1b.59	ZWF1b.6	ZWF1b.60	ZWF1b.61	ZWF1b.62	ZWF1b.63	ZWF1b.64	ZWF1b.65	ZWF1b.66	ZWF1b.67	ZWF1b.68	ZWF1b.69	ZWF1b.7	ZWF1b.70	ZWF1b.71	ZWF1b.72	ZWF1b.73	ZWF1b.74	ZWF1b.75	ZWF1b.76	ZWF1b.77	ZWF1b.78	ZWF1b.79	ZWF1b.8	ZWF1b.80	ZWF1b.81	ZWF1b.82	ZWF1b.83	ZWF1b.84	ZWF1b.85	ZWF1b.86	ZWF1b.87	ZWF1b.88	ZWF1b.89	ZWF1b.9	ZWF1b.90	ZWF1b.91	ZWF1b.92	ZWF1b.93	ZWF1b.94	ZWF1b.95	ZWF1b.96	ZWF1b.97	ZWF1b.98	ZWF1b.99
