Chy_aspA.1	Chy_aspA.10	Chy_aspA.11	Chy_aspA.12	Chy_aspA.13	Chy_aspA.14	Chy_aspA.15	Chy_aspA.16	Chy_aspA.17	Chy_aspA.18	Chy_aspA.19	Chy_aspA.2	Chy_aspA.20	Chy_aspA.21	Chy_aspA.22	Chy_aspA.3	Chy_aspA.4	Chy_aspA.5	Chy_aspA.6	Chy_aspA.7	Chy_aspA.8	Chy_aspA.9
Chy_atpA.1	Chy_atpA.10	Chy_atpA.11	Chy_atpA.12	Chy_atpA.13	Chy_atpA.14	Chy_atpA.15	Chy_atpA.16	Chy_atpA.17	Chy_atpA.18	Chy_atpA.19	Chy_atpA.2	Chy_atpA.20	Chy_atpA.21	Chy_atpA.22	Chy_atpA.3	Chy_atpA.4	Chy_atpA.5	Chy_atpA.6	Chy_atpA.7	Chy_atpA.8	Chy_atpA.9
Chy_glnA.1	Chy_glnA.10	Chy_glnA.11	Chy_glnA.12	Chy_glnA.13	Chy_glnA.14	Chy_glnA.15	Chy_glnA.16	Chy_glnA.17	Chy_glnA.18	Chy_glnA.19	Chy_glnA.2	Chy_glnA.20	Chy_glnA.21	Chy_glnA.22	Chy_glnA.23	Chy_glnA.24	Chy_glnA.25	Chy_glnA.3	Chy_glnA.4	Chy_glnA.5	Chy_glnA.6	Chy_glnA.7	Chy_glnA.8	Chy_glnA.9
Chy_gltA.1	Chy_gltA.10	Chy_gltA.11	Chy_gltA.12	Chy_gltA.13	Chy_gltA.14	Chy_gltA.15	Chy_gltA.16	Chy_gltA.17	Chy_gltA.18	Chy_gltA.19	Chy_gltA.2	Chy_gltA.20	Chy_gltA.21	Chy_gltA.22	Chy_gltA.23	Chy_gltA.24	Chy_gltA.25	Chy_gltA.26	Chy_gltA.27	Chy_gltA.3	Chy_gltA.4	Chy_gltA.5	Chy_gltA.6	Chy_gltA.7	Chy_gltA.8	Chy_gltA.9
Chy_glyA.1	Chy_glyA.10	Chy_glyA.11	Chy_glyA.12	Chy_glyA.13	Chy_glyA.14	Chy_glyA.15	Chy_glyA.16	Chy_glyA.17	Chy_glyA.18	Chy_glyA.19	Chy_glyA.2	Chy_glyA.20	Chy_glyA.21	Chy_glyA.22	Chy_glyA.23	Chy_glyA.24	Chy_glyA.25	Chy_glyA.26	Chy_glyA.27	Chy_glyA.28	Chy_glyA.3	Chy_glyA.4	Chy_glyA.5	Chy_glyA.6	Chy_glyA.7	Chy_glyA.8	Chy_glyA.9
Chy_pgm.1	Chy_pgm.10	Chy_pgm.11	Chy_pgm.12	Chy_pgm.13	Chy_pgm.14	Chy_pgm.15	Chy_pgm.16	Chy_pgm.17	Chy_pgm.18	Chy_pgm.19	Chy_pgm.2	Chy_pgm.20	Chy_pgm.21	Chy_pgm.22	Chy_pgm.23	Chy_pgm.24	Chy_pgm.25	Chy_pgm.26	Chy_pgm.27	Chy_pgm.28	Chy_pgm.29	Chy_pgm.3	Chy_pgm.4	Chy_pgm.5	Chy_pgm.6	Chy_pgm.7	Chy_pgm.8	Chy_pgm.9
Chy_tkt.1	Chy_tkt.10	Chy_tkt.11	Chy_tkt.12	Chy_tkt.13	Chy_tkt.14	Chy_tkt.15	Chy_tkt.16	Chy_tkt.17	Chy_tkt.18	Chy_tkt.19	Chy_tkt.2	Chy_tkt.20	Chy_tkt.21	Chy_tkt.22	Chy_tkt.23	Chy_tkt.24	Chy_tkt.25	Chy_tkt.26	Chy_tkt.27	Chy_tkt.28	Chy_tkt.29	Chy_tkt.3	Chy_tkt.30	Chy_tkt.31	Chy_tkt.32	Chy_tkt.33	Chy_tkt.34	Chy_tkt.4	Chy_tkt.5	Chy_tkt.6	Chy_tkt.7	Chy_tkt.8	Chy_tkt.9
