ftsH.1	0	0	.	.	.
ftsH.10	0	0	.	.	.
ftsH.11	0	0	.	.	.
ftsH.12	0	0	.	.	.
ftsH.13	0	0	.	.	.
ftsH.14	0	0	.	.	.
ftsH.15	0	0	.	.	.
ftsH.16	0	0	.	.	.
ftsH.17	0	0	.	.	.
ftsH.18	0	0	.	.	.
ftsH.19	0	0	.	.	.
ftsH.2	0	0	.	.	.
ftsH.20	0	0	.	.	.
ftsH.21	0	0	.	.	.
ftsH.22	0	0	.	.	.
ftsH.23	0	0	.	.	.
ftsH.24	0	0	.	.	.
ftsH.25	0	0	.	.	.
ftsH.26	0	0	.	.	.
ftsH.27	0	0	.	.	.
ftsH.28	0	0	.	.	.
ftsH.29	0	0	.	.	.
ftsH.3	0	0	.	.	.
ftsH.30	0	0	.	.	.
ftsH.31	0	0	.	.	.
ftsH.32	0	0	.	.	.
ftsH.33	0	0	.	.	.
ftsH.34	0	0	.	.	.
ftsH.35	0	0	.	.	.
ftsH.36	0	0	.	.	.
ftsH.37	0	0	.	.	.
ftsH.38	0	0	.	.	.
ftsH.39	0	0	.	.	.
ftsH.4	0	0	.	.	.
ftsH.40	0	0	.	.	.
ftsH.42	0	0	.	.	.
ftsH.43	0	0	.	.	.
ftsH.44	0	0	.	.	.
ftsH.45	0	0	.	.	.
ftsH.46	0	0	.	.	.
ftsH.47	0	0	.	.	.
ftsH.48	0	0	.	.	.
ftsH.49	0	0	.	.	.
ftsH.5	0	0	.	.	.
ftsH.50	0	0	.	.	.
ftsH.51	0	0	.	.	.
ftsH.52	0	0	.	.	.
ftsH.53	0	0	.	.	.
ftsH.54	0	0	.	.	.
ftsH.55	0	0	.	.	.
ftsH.56	0	0	.	.	.
ftsH.57	0	0	.	.	.
ftsH.58	0	0	.	.	.
ftsH.59	0	0	.	.	.
ftsH.6	0	0	.	.	.
ftsH.60	0	0	.	.	.
ftsH.61	0	0	.	.	.
ftsH.62	0	0	.	.	.
ftsH.7	0	0	.	.	.
ftsH.8	0	0	.	.	.
ftsH.9	0	0	.	.	.
rpL22.1	0	0	.	.	.
rpL22.10	0	0	.	.	.
rpL22.11	0	0	.	.	.
rpL22.12	0	0	.	.	.
rpL22.13	0	0	.	.	.
rpL22.14	0	0	.	.	.
rpL22.15	0	0	.	.	.
rpL22.16	0	0	.	.	.
rpL22.17	0	0	.	.	.
rpL22.18	0	0	.	.	.
rpL22.19	0	0	.	.	.
rpL22.2	0	0	.	.	.
rpL22.20	0	0	.	.	.
rpL22.21	0	0	.	.	.
rpL22.22	0	0	.	.	.
rpL22.23	0	0	.	.	.
rpL22.24	0	0	.	.	.
rpL22.25	0	0	.	.	.
rpL22.26	0	0	.	.	.
rpL22.3	0	0	.	.	.
rpL22.4	0	0	.	.	.
rpL22.5	0	0	.	.	.
rpL22.6	0	0	.	.	.
rpL22.7	0	0	.	.	.
rpL22.8	0	0	.	.	.
rpL22.9	0	0	.	.	.
thrS.1	0	0	.	.	.
thrS.10	0	0	.	.	.
thrS.11	0	0	.	.	.
thrS.12	0	0	.	.	.
thrS.13	0	0	.	.	.
thrS.14	0	0	.	.	.
thrS.15	0	0	.	.	.
thrS.16	0	0	.	.	.
thrS.17	0	0	.	.	.
thrS.18	0	0	.	.	.
thrS.19	0	0	.	.	.
thrS.2	0	0	.	.	.
thrS.20	0	0	.	.	.
thrS.21	0	0	.	.	.
thrS.22	0	0	.	.	.
thrS.23	0	0	.	.	.
thrS.24	0	0	.	.	.
thrS.25	0	0	.	.	.
thrS.26	0	0	.	.	.
thrS.27	0	0	.	.	.
thrS.28	0	0	.	.	.
thrS.29	0	0	.	.	.
thrS.3	0	0	.	.	.
thrS.30	0	0	.	.	.
thrS.4	0	0	.	.	.
thrS.5	0	0	.	.	.
thrS.6	0	0	.	.	.
thrS.7	0	0	.	.	.
thrS.8	0	0	.	.	.
thrS.9	0	0	.	.	.
valS.1	0	0	.	.	.
valS.10	0	0	.	.	.
valS.11	0	0	.	.	.
valS.12	0	0	.	.	.
valS.13	0	0	.	.	.
valS.14	0	0	.	.	.
valS.15	0	0	.	.	.
valS.16	0	0	.	.	.
valS.17	0	0	.	.	.
valS.18	0	0	.	.	.
valS.19	0	0	.	.	.
valS.2	0	0	.	.	.
valS.20	0	0	.	.	.
valS.21	0	0	.	.	.
valS.22	0	0	.	.	.
valS.23	0	0	.	.	.
valS.25	0	0	.	.	.
valS.26	0	0	.	.	.
valS.27	0	0	.	.	.
valS.28	0	0	.	.	.
valS.29	0	0	.	.	.
valS.3	0	0	.	.	.
valS.30	0	0	.	.	.
valS.4	0	0	.	.	.
valS.5	0	0	.	.	.
valS.6	0	0	.	.	.
valS.7	0	0	.	.	.
valS.8	0	0	.	.	.
valS.9	0	0	.	.	.
