arcC.1	0	0	.	.	.
arcC.10	0	0	.	.	.
arcC.11	0	0	.	.	.
arcC.12	0	0	.	.	.
arcC.13	0	0	.	.	.
arcC.14	0	0	.	.	.
arcC.15	0	0	.	.	.
arcC.16	0	0	.	.	.
arcC.17	0	0	.	.	.
arcC.18	0	0	.	.	.
arcC.19	0	0	.	.	.
arcC.2	0	0	.	.	.
arcC.20	0	0	.	.	.
arcC.21	0	0	.	.	.
arcC.22	0	0	.	.	.
arcC.23	0	0	.	.	.
arcC.24	0	0	.	.	.
arcC.25	0	0	.	.	.
arcC.26	0	0	.	.	.
arcC.27	0	0	.	.	.
arcC.28	0	0	.	.	.
arcC.29	0	0	.	.	.
arcC.3	0	0	.	.	.
arcC.30	0	0	.	.	.
arcC.31	0	0	.	.	.
arcC.32	0	0	.	.	.
arcC.33	0	0	.	.	.
arcC.34	0	0	.	.	.
arcC.35	0	0	.	.	.
arcC.36	0	0	.	.	.
arcC.37	0	0	.	.	.
arcC.38	0	0	.	.	.
arcC.39	0	0	.	.	.
arcC.4	0	0	.	.	.
arcC.40	0	0	.	.	.
arcC.41	0	0	.	.	.
arcC.42	0	0	.	.	.
arcC.43	0	0	.	.	.
arcC.44	0	0	.	.	.
arcC.45	0	0	.	.	.
arcC.46	0	0	.	.	.
arcC.47	0	0	.	.	.
arcC.48	0	0	.	.	.
arcC.49	0	0	.	.	.
arcC.5	0	0	.	.	.
arcC.50	0	0	.	.	.
arcC.51	0	0	.	.	.
arcC.52	0	0	.	.	.
arcC.53	0	0	.	.	.
arcC.54	0	0	.	.	.
arcC.6	0	0	.	.	.
arcC.7	0	0	.	.	.
arcC.8	0	0	.	.	.
arcC.9	0	0	.	.	.
nrdE.1	0	0	.	.	.
nrdE.10	0	0	.	.	.
nrdE.11	0	0	.	.	.
nrdE.12	0	0	.	.	.
nrdE.13	0	0	.	.	.
nrdE.14	0	0	.	.	.
nrdE.15	0	0	.	.	.
nrdE.16	0	0	.	.	.
nrdE.17	0	0	.	.	.
nrdE.18	0	0	.	.	.
nrdE.19	0	0	.	.	.
nrdE.2	0	0	.	.	.
nrdE.20	0	0	.	.	.
nrdE.21	0	0	.	.	.
nrdE.22	0	0	.	.	.
nrdE.23	0	0	.	.	.
nrdE.24	0	0	.	.	.
nrdE.25	0	0	.	.	.
nrdE.26	0	0	.	.	.
nrdE.27	0	0	.	.	.
nrdE.28	0	0	.	.	.
nrdE.29	0	0	.	.	.
nrdE.3	0	0	.	.	.
nrdE.30	0	0	.	.	.
nrdE.31	0	0	.	.	.
nrdE.32	0	0	.	.	.
nrdE.33	0	0	.	.	.
nrdE.34	0	0	.	.	.
nrdE.35	0	0	.	.	.
nrdE.36	0	0	.	.	.
nrdE.37	0	0	.	.	.
nrdE.38	0	0	.	.	.
nrdE.39	0	0	.	.	.
nrdE.4	0	0	.	.	.
nrdE.40	0	0	.	.	.
nrdE.41	0	0	.	.	.
nrdE.42	0	0	.	.	.
nrdE.43	0	0	.	.	.
nrdE.44	0	0	.	.	.
nrdE.45	0	0	.	.	.
nrdE.46	0	0	.	.	.
nrdE.47	0	0	.	.	.
nrdE.48	0	0	.	.	.
nrdE.49	0	0	.	.	.
nrdE.5	0	0	.	.	.
nrdE.50	0	0	.	.	.
nrdE.51	0	0	.	.	.
nrdE.52	0	0	.	.	.
nrdE.53	0	0	.	.	.
nrdE.54	0	0	.	.	.
nrdE.55	0	0	.	.	.
nrdE.56	0	0	.	.	.
nrdE.57	0	0	.	.	.
nrdE.58	0	0	.	.	.
nrdE.59	0	0	.	.	.
nrdE.6	0	0	.	.	.
nrdE.60	0	0	.	.	.
nrdE.61	0	0	.	.	.
nrdE.62	0	0	.	.	.
nrdE.63	0	0	.	.	.
nrdE.64	0	0	.	.	.
nrdE.65	0	0	.	.	.
nrdE.66	0	0	.	.	.
nrdE.67	0	0	.	.	.
nrdE.68	0	0	.	.	.
nrdE.69	0	0	.	.	.
nrdE.7	0	0	.	.	.
nrdE.70	0	0	.	.	.
nrdE.71	0	0	.	.	.
nrdE.72	0	0	.	.	.
nrdE.73	0	0	.	.	.
nrdE.8	0	0	.	.	.
nrdE.9	0	0	.	.	.
proS.1	0	0	.	.	.
proS.10	0	0	.	.	.
proS.11	0	0	.	.	.
proS.12	0	0	.	.	.
proS.13	0	0	.	.	.
proS.14	0	0	.	.	.
proS.15	0	0	.	.	.
proS.16	0	0	.	.	.
proS.17	0	0	.	.	.
proS.18	0	0	.	.	.
proS.19	0	0	.	.	.
proS.2	0	0	.	.	.
proS.20	0	0	.	.	.
proS.21	0	0	.	.	.
proS.22	0	0	.	.	.
proS.23	0	0	.	.	.
proS.24	0	0	.	.	.
proS.25	0	0	.	.	.
proS.26	0	0	.	.	.
proS.27	0	0	.	.	.
proS.28	0	0	.	.	.
proS.29	0	0	.	.	.
proS.3	0	0	.	.	.
proS.30	0	0	.	.	.
proS.31	0	0	.	.	.
proS.32	0	0	.	.	.
proS.33	0	0	.	.	.
proS.34	0	0	.	.	.
proS.35	0	0	.	.	.
proS.36	0	0	.	.	.
proS.37	0	0	.	.	.
proS.38	0	0	.	.	.
proS.39	0	0	.	.	.
proS.4	0	0	.	.	.
proS.40	0	0	.	.	.
proS.41	0	0	.	.	.
proS.42	0	0	.	.	.
proS.43	0	0	.	.	.
proS.44	0	0	.	.	.
proS.45	0	0	.	.	.
proS.46	0	0	.	.	.
proS.47	0	0	.	.	.
proS.48	0	0	.	.	.
proS.49	0	0	.	.	.
proS.5	0	0	.	.	.
proS.50	0	0	.	.	.
proS.51	0	0	.	.	.
proS.52	0	0	.	.	.
proS.53	0	0	.	.	.
proS.54	0	0	.	.	.
proS.55	0	0	.	.	.
proS.56	0	0	.	.	.
proS.57	0	0	.	.	.
proS.58	0	0	.	.	.
proS.59	0	0	.	.	.
proS.6	0	0	.	.	.
proS.60	0	0	.	.	.
proS.61	0	0	.	.	.
proS.62	0	0	.	.	.
proS.63	0	0	.	.	.
proS.64	0	0	.	.	.
proS.65	0	0	.	.	.
proS.66	0	0	.	.	.
proS.67	0	0	.	.	.
proS.68	0	0	.	.	.
proS.69	0	0	.	.	.
proS.7	0	0	.	.	.
proS.70	0	0	.	.	.
proS.71	0	0	.	.	.
proS.72	0	0	.	.	.
proS.73	0	0	.	.	.
proS.74	0	0	.	.	.
proS.75	0	0	.	.	.
proS.76	0	0	.	.	.
proS.77	0	0	.	.	.
proS.78	0	0	.	.	.
proS.79	0	0	.	.	.
proS.8	0	0	.	.	.
proS.80	0	0	.	.	.
proS.81	0	0	.	.	.
proS.82	0	0	.	.	.
proS.83	0	0	.	.	.
proS.84	0	0	.	.	.
proS.85	0	0	.	.	.
proS.86	0	0	.	.	.
proS.9	0	0	.	.	.
spi.1	0	0	.	.	.
spi.10	0	0	.	.	.
spi.11	0	0	.	.	.
spi.12	0	0	.	.	.
spi.13	0	0	.	.	.
spi.14	0	0	.	.	.
spi.15	0	0	.	.	.
spi.16	0	0	.	.	.
spi.17	0	0	.	.	.
spi.18	0	0	.	.	.
spi.19	0	0	.	.	.
spi.2	0	0	.	.	.
spi.20	0	0	.	.	.
spi.21	0	0	.	.	.
spi.22	0	0	.	.	.
spi.23	0	0	.	.	.
spi.24	0	0	.	.	.
spi.25	0	0	.	.	.
spi.26	0	0	.	.	.
spi.27	0	0	.	.	.
spi.28	0	0	.	.	.
spi.29	0	0	.	.	.
spi.3	0	0	.	.	.
spi.30	0	0	.	.	.
spi.31	0	0	.	.	.
spi.32	0	0	.	.	.
spi.33	0	0	.	.	.
spi.34	0	0	.	.	.
spi.35	0	0	.	.	.
spi.36	0	0	.	.	.
spi.37	0	0	.	.	.
spi.38	0	0	.	.	.
spi.39	0	0	.	.	.
spi.4	0	0	.	.	.
spi.40	0	0	.	.	.
spi.41	0	0	.	.	.
spi.42	0	0	.	.	.
spi.43	0	0	.	.	.
spi.44	0	0	.	.	.
spi.45	0	0	.	.	.
spi.46	0	0	.	.	.
spi.47	0	0	.	.	.
spi.48	0	0	.	.	.
spi.49	0	0	.	.	.
spi.5	0	0	.	.	.
spi.50	0	0	.	.	.
spi.51	0	0	.	.	.
spi.52	0	0	.	.	.
spi.53	0	0	.	.	.
spi.54	0	0	.	.	.
spi.55	0	0	.	.	.
spi.56	0	0	.	.	.
spi.57	0	0	.	.	.
spi.58	0	0	.	.	.
spi.59	0	0	.	.	.
spi.6	0	0	.	.	.
spi.60	0	0	.	.	.
spi.61	0	0	.	.	.
spi.62	0	0	.	.	.
spi.63	0	0	.	.	.
spi.64	0	0	.	.	.
spi.65	0	0	.	.	.
spi.66	0	0	.	.	.
spi.67	0	0	.	.	.
spi.68	0	0	.	.	.
spi.69	0	0	.	.	.
spi.7	0	0	.	.	.
spi.70	0	0	.	.	.
spi.71	0	0	.	.	.
spi.72	0	0	.	.	.
spi.73	0	0	.	.	.
spi.74	0	0	.	.	.
spi.75	0	0	.	.	.
spi.76	0	0	.	.	.
spi.77	0	0	.	.	.
spi.78	0	0	.	.	.
spi.79	0	0	.	.	.
spi.8	0	0	.	.	.
spi.80	0	0	.	.	.
spi.81	0	0	.	.	.
spi.82	0	0	.	.	.
spi.83	0	0	.	.	.
spi.84	0	0	.	.	.
spi.85	0	0	.	.	.
spi.86	0	0	.	.	.
spi.87	0	0	.	.	.
spi.88	0	0	.	.	.
spi.89	0	0	.	.	.
spi.9	0	0	.	.	.
spi.90	0	0	.	.	.
spi.91	0	0	.	.	.
spi.92	0	0	.	.	.
tdk.1	0	0	.	.	.
tdk.10	0	0	.	.	.
tdk.11	0	0	.	.	.
tdk.12	0	0	.	.	.
tdk.13	0	0	.	.	.
tdk.14	0	0	.	.	.
tdk.15	0	0	.	.	.
tdk.16	0	0	.	.	.
tdk.17	0	0	.	.	.
tdk.18	0	0	.	.	.
tdk.19	0	0	.	.	.
tdk.2	0	0	.	.	.
tdk.20	0	0	.	.	.
tdk.21	0	0	.	.	.
tdk.22	0	0	.	.	.
tdk.23	0	0	.	.	.
tdk.24	0	0	.	.	.
tdk.25	0	0	.	.	.
tdk.26	0	0	.	.	.
tdk.27	0	0	.	.	.
tdk.28	0	0	.	.	.
tdk.29	0	0	.	.	.
tdk.3	0	0	.	.	.
tdk.30	0	0	.	.	.
tdk.31	0	0	.	.	.
tdk.32	0	0	.	.	.
tdk.33	0	0	.	.	.
tdk.34	0	0	.	.	.
tdk.35	0	0	.	.	.
tdk.36	0	0	.	.	.
tdk.37	0	0	.	.	.
tdk.38	0	0	.	.	.
tdk.39	0	0	.	.	.
tdk.4	0	0	.	.	.
tdk.40	0	0	.	.	.
tdk.41	0	0	.	.	.
tdk.42	0	0	.	.	.
tdk.43	0	0	.	.	.
tdk.44	0	0	.	.	.
tdk.45	0	0	.	.	.
tdk.46	0	0	.	.	.
tdk.47	0	0	.	.	.
tdk.48	0	0	.	.	.
tdk.49	0	0	.	.	.
tdk.5	0	0	.	.	.
tdk.50	0	0	.	.	.
tdk.51	0	0	.	.	.
tdk.52	0	0	.	.	.
tdk.53	0	0	.	.	.
tdk.54	0	0	.	.	.
tdk.55	0	0	.	.	.
tdk.56	0	0	.	.	.
tdk.57	0	0	.	.	.
tdk.58	0	0	.	.	.
tdk.59	0	0	.	.	.
tdk.6	0	0	.	.	.
tdk.60	0	0	.	.	.
tdk.61	0	0	.	.	.
tdk.62	0	0	.	.	.
tdk.7	0	0	.	.	.
tdk.8	0	0	.	.	.
tdk.9	0	0	.	.	.
tpi.1	0	0	.	.	.
tpi.10	0	0	.	.	.
tpi.11	0	0	.	.	.
tpi.12	0	0	.	.	.
tpi.13	0	0	.	.	.
tpi.14	0	0	.	.	.
tpi.15	0	0	.	.	.
tpi.16	0	0	.	.	.
tpi.17	0	0	.	.	.
tpi.18	0	0	.	.	.
tpi.19	0	0	.	.	.
tpi.2	0	0	.	.	.
tpi.20	0	0	.	.	.
tpi.21	0	0	.	.	.
tpi.22	0	0	.	.	.
tpi.23	0	0	.	.	.
tpi.24	0	0	.	.	.
tpi.25	0	0	.	.	.
tpi.26	0	0	.	.	.
tpi.27	0	0	.	.	.
tpi.28	0	0	.	.	.
tpi.29	0	0	.	.	.
tpi.3	0	0	.	.	.
tpi.30	0	0	.	.	.
tpi.31	0	0	.	.	.
tpi.32	0	0	.	.	.
tpi.33	0	0	.	.	.
tpi.34	0	0	.	.	.
tpi.35	0	0	.	.	.
tpi.36	0	0	.	.	.
tpi.37	0	0	.	.	.
tpi.38	0	0	.	.	.
tpi.39	0	0	.	.	.
tpi.4	0	0	.	.	.
tpi.40	0	0	.	.	.
tpi.41	0	0	.	.	.
tpi.42	0	0	.	.	.
tpi.43	0	0	.	.	.
tpi.44	0	0	.	.	.
tpi.45	0	0	.	.	.
tpi.46	0	0	.	.	.
tpi.47	0	0	.	.	.
tpi.48	0	0	.	.	.
tpi.49	0	0	.	.	.
tpi.5	0	0	.	.	.
tpi.50	0	0	.	.	.
tpi.51	0	0	.	.	.
tpi.52	0	0	.	.	.
tpi.53	0	0	.	.	.
tpi.54	0	0	.	.	.
tpi.55	0	0	.	.	.
tpi.56	0	0	.	.	.
tpi.57	0	0	.	.	.
tpi.58	0	0	.	.	.
tpi.59	0	0	.	.	.
tpi.6	0	0	.	.	.
tpi.60	0	0	.	.	.
tpi.61	0	0	.	.	.
tpi.62	0	0	.	.	.
tpi.63	0	0	.	.	.
tpi.7	0	0	.	.	.
tpi.8	0	0	.	.	.
tpi.9	0	0	.	.	.
yqiL.1	0	0	.	.	.
yqiL.10	0	0	.	.	.
yqiL.11	0	0	.	.	.
yqiL.12	0	0	.	.	.
yqiL.13	0	0	.	.	.
yqiL.14	0	0	.	.	.
yqiL.15	0	0	.	.	.
yqiL.16	0	0	.	.	.
yqiL.17	0	0	.	.	.
yqiL.18	0	0	.	.	.
yqiL.19	0	0	.	.	.
yqiL.2	0	0	.	.	.
yqiL.20	0	0	.	.	.
yqiL.21	0	0	.	.	.
yqiL.22	0	0	.	.	.
yqiL.23	0	0	.	.	.
yqiL.24	0	0	.	.	.
yqiL.25	0	0	.	.	.
yqiL.26	0	0	.	.	.
yqiL.27	0	0	.	.	.
yqiL.28	0	0	.	.	.
yqiL.29	0	0	.	.	.
yqiL.3	0	0	.	.	.
yqiL.30	0	0	.	.	.
yqiL.31	0	0	.	.	.
yqiL.32	0	0	.	.	.
yqiL.33	0	0	.	.	.
yqiL.34	0	0	.	.	.
yqiL.35	0	0	.	.	.
yqiL.36	0	0	.	.	.
yqiL.37	0	0	.	.	.
yqiL.38	0	0	.	.	.
yqiL.39	0	0	.	.	.
yqiL.4	0	0	.	.	.
yqiL.40	0	0	.	.	.
yqiL.41	0	0	.	.	.
yqiL.42	0	0	.	.	.
yqiL.43	0	0	.	.	.
yqiL.44	0	0	.	.	.
yqiL.45	0	0	.	.	.
yqiL.46	0	0	.	.	.
yqiL.47	0	0	.	.	.
yqiL.48	0	0	.	.	.
yqiL.49	0	0	.	.	.
yqiL.5	0	0	.	.	.
yqiL.50	0	0	.	.	.
yqiL.51	0	0	.	.	.
yqiL.52	0	0	.	.	.
yqiL.53	0	0	.	.	.
yqiL.54	0	0	.	.	.
yqiL.55	0	0	.	.	.
yqiL.56	0	0	.	.	.
yqiL.57	0	0	.	.	.
yqiL.58	0	0	.	.	.
yqiL.59	0	0	.	.	.
yqiL.6	0	0	.	.	.
yqiL.60	0	0	.	.	.
yqiL.61	0	0	.	.	.
yqiL.62	0	0	.	.	.
yqiL.63	0	0	.	.	.
yqiL.64	0	0	.	.	.
yqiL.65	0	0	.	.	.
yqiL.66	0	0	.	.	.
yqiL.67	0	0	.	.	.
yqiL.68	0	0	.	.	.
yqiL.69	0	0	.	.	.
yqiL.7	0	0	.	.	.
yqiL.70	0	0	.	.	.
yqiL.71	0	0	.	.	.
yqiL.72	0	0	.	.	.
yqiL.73	0	0	.	.	.
yqiL.74	0	0	.	.	.
yqiL.75	0	0	.	.	.
yqiL.76	0	0	.	.	.
yqiL.77	0	0	.	.	.
yqiL.78	0	0	.	.	.
yqiL.79	0	0	.	.	.
yqiL.8	0	0	.	.	.
yqiL.80	0	0	.	.	.
yqiL.81	0	0	.	.	.
yqiL.82	0	0	.	.	.
yqiL.83	0	0	.	.	.
yqiL.84	0	0	.	.	.
yqiL.85	0	0	.	.	.
yqiL.86	0	0	.	.	.
yqiL.9	0	0	.	.	.
