adk.1	0	0	.	.	.
adk.10	0	0	.	.	.
adk.101	0	0	.	.	.
adk.102	0	0	.	.	.
adk.103	0	0	.	.	.
adk.104	0	0	.	.	.
adk.105	0	0	.	.	.
adk.106	0	0	.	.	.
adk.107	0	0	.	.	.
adk.108	0	0	.	.	.
adk.109	0	0	.	.	.
adk.11	0	0	.	.	.
adk.110	0	0	.	.	.
adk.111	0	0	.	.	.
adk.112	0	0	.	.	.
adk.113	0	0	.	.	.
adk.114	0	0	.	.	.
adk.115	0	0	.	.	.
adk.116	0	0	.	.	.
adk.117	0	0	.	.	.
adk.118	0	0	.	.	.
adk.119	0	0	.	.	.
adk.12	0	0	.	.	.
adk.120	0	0	.	.	.
adk.121	0	0	.	.	.
adk.122	0	0	.	.	.
adk.123	0	0	.	.	.
adk.124	0	0	.	.	.
adk.127	0	0	.	.	.
adk.128	0	0	.	.	.
adk.13	0	0	.	.	.
adk.136	0	0	.	.	.
adk.137	0	0	.	.	.
adk.138	0	0	.	.	.
adk.139	0	0	.	.	.
adk.14	0	0	.	.	.
adk.140	0	0	.	.	.
adk.142	0	0	.	.	.
adk.143	0	0	.	.	.
adk.144	0	0	.	.	.
adk.145	0	0	.	.	.
adk.146	0	0	.	.	.
adk.147	0	0	.	.	.
adk.148	0	0	.	.	.
adk.149	0	0	.	.	.
adk.15	0	0	.	.	.
adk.150	0	0	.	.	.
adk.151	0	0	.	.	.
adk.152	0	0	.	.	.
adk.153	0	0	.	.	.
adk.154	0	0	.	.	.
adk.155	0	0	.	.	.
adk.156	0	0	.	.	.
adk.16	0	0	.	.	.
adk.17	0	0	.	.	.
adk.18	0	0	.	.	.
adk.19	0	0	.	.	.
adk.2	0	0	.	.	.
adk.20	0	0	.	.	.
adk.21	0	0	.	.	.
adk.22	0	0	.	.	.
adk.23	0	0	.	.	.
adk.24	0	0	.	.	.
adk.25	0	0	.	.	.
adk.26	0	0	.	.	.
adk.27	0	0	.	.	.
adk.28	0	0	.	.	.
adk.29	0	0	.	.	.
adk.3	0	0	.	.	.
adk.30	0	0	.	.	.
adk.31	0	0	.	.	.
adk.32	0	0	.	.	.
adk.33	0	0	.	.	.
adk.34	0	0	.	.	.
adk.35	0	0	.	.	.
adk.36	0	0	.	.	.
adk.37	0	0	.	.	.
adk.38	0	0	.	.	.
adk.39	0	0	.	.	.
adk.4	0	0	.	.	.
adk.40	0	0	.	.	.
adk.41	0	0	.	.	.
adk.42	0	0	.	.	.
adk.43	0	0	.	.	.
adk.44	0	0	.	.	.
adk.45	0	0	.	.	.
adk.46	0	0	.	.	.
adk.47	0	0	.	.	.
adk.48	0	0	.	.	.
adk.49	0	0	.	.	.
adk.5	0	0	.	.	.
adk.50	0	0	.	.	.
adk.51	0	0	.	.	.
adk.52	0	0	.	.	.
adk.53	0	0	.	.	.
adk.54	0	0	.	.	.
adk.55	0	0	.	.	.
adk.56	0	0	.	.	.
adk.57	0	0	.	.	.
adk.58	0	0	.	.	.
adk.59	0	0	.	.	.
adk.6	0	0	.	.	.
adk.60	0	0	.	.	.
adk.61	0	0	.	.	.
adk.62	0	0	.	.	.
adk.64	0	0	.	.	.
adk.66	0	0	.	.	.
adk.68	0	0	.	.	.
adk.69	0	0	.	.	.
adk.7	0	0	.	.	.
adk.70	0	0	.	.	.
adk.71	0	0	.	.	.
adk.72	0	0	.	.	.
adk.73	0	0	.	.	.
adk.74	0	0	.	.	.
adk.75	0	0	.	.	.
adk.76	0	0	.	.	.
adk.77	0	0	.	.	.
adk.78	0	0	.	.	.
adk.79	0	0	.	.	.
adk.80	0	0	.	.	.
adk.81	0	0	.	.	.
adk.82	0	0	.	.	.
adk.83	0	0	.	.	.
adk.84	0	0	.	.	.
adk.85	0	0	.	.	.
adk.86	0	0	.	.	.
adk.87	0	0	.	.	.
adk.88	0	0	.	.	.
adk.89	0	0	.	.	.
adk.9	0	0	.	.	.
adk.90	0	0	.	.	.
adk.91	0	0	.	.	.
adk.92	0	0	.	.	.
adk.93	0	0	.	.	.
adk.94	0	0	.	.	.
adk.95	0	0	.	.	.
argA.1	0	0	.	.	.
argA.10	0	0	.	.	.
argA.100	0	0	.	.	.
argA.101	0	0	.	.	.
argA.102	0	0	.	.	.
argA.103	0	0	.	.	.
argA.104	0	0	.	.	.
argA.108	0	0	.	.	.
argA.109	0	0	.	.	.
argA.11	0	0	.	.	.
argA.110	0	0	.	.	.
argA.111	0	0	.	.	.
argA.112	0	0	.	.	.
argA.113	0	0	.	.	.
argA.114	0	0	.	.	.
argA.115	0	0	.	.	.
argA.116	0	0	.	.	.
argA.117	0	0	.	.	.
argA.118	0	0	.	.	.
argA.119	0	0	.	.	.
argA.12	0	0	.	.	.
argA.120	0	0	.	.	.
argA.121	0	0	.	.	.
argA.122	0	0	.	.	.
argA.127	0	0	.	.	.
argA.13	0	0	.	.	.
argA.133	0	0	.	.	.
argA.134	0	0	.	.	.
argA.135	0	0	.	.	.
argA.136	0	0	.	.	.
argA.138	0	0	.	.	.
argA.14	0	0	.	.	.
argA.142	0	0	.	.	.
argA.143	0	0	.	.	.
argA.144	0	0	.	.	.
argA.145	0	0	.	.	.
argA.146	0	0	.	.	.
argA.147	0	0	.	.	.
argA.148	0	0	.	.	.
argA.149	0	0	.	.	.
argA.15	0	0	.	.	.
argA.150	0	0	.	.	.
argA.151	0	0	.	.	.
argA.16	0	0	.	.	.
argA.17	0	0	.	.	.
argA.18	0	0	.	.	.
argA.19	0	0	.	.	.
argA.2	0	0	.	.	.
argA.20	0	0	.	.	.
argA.21	0	0	.	.	.
argA.22	0	0	.	.	.
argA.23	0	0	.	.	.
argA.24	0	0	.	.	.
argA.25	0	0	.	.	.
argA.26	0	0	.	.	.
argA.27	0	0	.	.	.
argA.28	0	0	.	.	.
argA.29	0	0	.	.	.
argA.3	0	0	.	.	.
argA.30	0	0	.	.	.
argA.31	0	0	.	.	.
argA.32	0	0	.	.	.
argA.33	0	0	.	.	.
argA.34	0	0	.	.	.
argA.35	0	0	.	.	.
argA.36	0	0	.	.	.
argA.37	0	0	.	.	.
argA.38	0	0	.	.	.
argA.39	0	0	.	.	.
argA.4	0	0	.	.	.
argA.40	0	0	.	.	.
argA.41	0	0	.	.	.
argA.42	0	0	.	.	.
argA.43	0	0	.	.	.
argA.44	0	0	.	.	.
argA.45	0	0	.	.	.
argA.46	0	0	.	.	.
argA.47	0	0	.	.	.
argA.48	0	0	.	.	.
argA.49	0	0	.	.	.
argA.5	0	0	.	.	.
argA.50	0	0	.	.	.
argA.51	0	0	.	.	.
argA.52	0	0	.	.	.
argA.53	0	0	.	.	.
argA.54	0	0	.	.	.
argA.55	0	0	.	.	.
argA.56	0	0	.	.	.
argA.57	0	0	.	.	.
argA.58	0	0	.	.	.
argA.59	0	0	.	.	.
argA.6	0	0	.	.	.
argA.60	0	0	.	.	.
argA.61	0	0	.	.	.
argA.62	0	0	.	.	.
argA.63	0	0	.	.	.
argA.64	0	0	.	.	.
argA.65	0	0	.	.	.
argA.66	0	0	.	.	.
argA.67	0	0	.	.	.
argA.69	0	0	.	.	.
argA.7	0	0	.	.	.
argA.70	0	0	.	.	.
argA.71	0	0	.	.	.
argA.72	0	0	.	.	.
argA.73	0	0	.	.	.
argA.74	0	0	.	.	.
argA.75	0	0	.	.	.
argA.76	0	0	.	.	.
argA.77	0	0	.	.	.
argA.78	0	0	.	.	.
argA.79	0	0	.	.	.
argA.8	0	0	.	.	.
argA.80	0	0	.	.	.
argA.81	0	0	.	.	.
argA.82	0	0	.	.	.
argA.83	0	0	.	.	.
argA.84	0	0	.	.	.
argA.85	0	0	.	.	.
argA.86	0	0	.	.	.
argA.87	0	0	.	.	.
argA.88	0	0	.	.	.
argA.89	0	0	.	.	.
argA.9	0	0	.	.	.
argA.90	0	0	.	.	.
argA.91	0	0	.	.	.
argA.92	0	0	.	.	.
argA.93	0	0	.	.	.
argA.94	0	0	.	.	.
argA.95	0	0	.	.	.
argA.96	0	0	.	.	.
argA.97	0	0	.	.	.
argA.98	0	0	.	.	.
argA.99	0	0	.	.	.
aroA.1	0	0	.	.	.
aroA.10	0	0	.	.	.
aroA.100	0	0	.	.	.
aroA.101	0	0	.	.	.
aroA.102	0	0	.	.	.
aroA.103	0	0	.	.	.
aroA.104	0	0	.	.	.
aroA.105	0	0	.	.	.
aroA.106	0	0	.	.	.
aroA.107	0	0	.	.	.
aroA.108	0	0	.	.	.
aroA.109	0	0	.	.	.
aroA.11	0	0	.	.	.
aroA.110	0	0	.	.	.
aroA.111	0	0	.	.	.
aroA.112	0	0	.	.	.
aroA.113	0	0	.	.	.
aroA.114	0	0	.	.	.
aroA.115	0	0	.	.	.
aroA.116	0	0	.	.	.
aroA.117	0	0	.	.	.
aroA.118	0	0	.	.	.
aroA.119	0	0	.	.	.
aroA.12	0	0	.	.	.
aroA.120	0	0	.	.	.
aroA.121	0	0	.	.	.
aroA.122	0	0	.	.	.
aroA.123	0	0	.	.	.
aroA.124	0	0	.	.	.
aroA.125	0	0	.	.	.
aroA.126	0	0	.	.	.
aroA.127	0	0	.	.	.
aroA.128	0	0	.	.	.
aroA.129	0	0	.	.	.
aroA.13	0	0	.	.	.
aroA.130	0	0	.	.	.
aroA.131	0	0	.	.	.
aroA.132	0	0	.	.	.
aroA.133	0	0	.	.	.
aroA.134	0	0	.	.	.
aroA.135	0	0	.	.	.
aroA.136	0	0	.	.	.
aroA.137	0	0	.	.	.
aroA.138	0	0	.	.	.
aroA.14	0	0	.	.	.
aroA.141	0	0	.	.	.
aroA.142	0	0	.	.	.
aroA.15	0	0	.	.	.
aroA.153	0	0	.	.	.
aroA.154	0	0	.	.	.
aroA.155	0	0	.	.	.
aroA.156	0	0	.	.	.
aroA.157	0	0	.	.	.
aroA.158	0	0	.	.	.
aroA.159	0	0	.	.	.
aroA.16	0	0	.	.	.
aroA.160	0	0	.	.	.
aroA.161	0	0	.	.	.
aroA.162	0	0	.	.	.
aroA.163	0	0	.	.	.
aroA.166	0	0	.	.	.
aroA.167	0	0	.	.	.
aroA.168	0	0	.	.	.
aroA.169	0	0	.	.	.
aroA.17	0	0	.	.	.
aroA.170	0	0	.	.	.
aroA.171	0	0	.	.	.
aroA.172	0	0	.	.	.
aroA.173	0	0	.	.	.
aroA.174	0	0	.	.	.
aroA.175	0	0	.	.	.
aroA.18	0	0	.	.	.
aroA.19	0	0	.	.	.
aroA.2	0	0	.	.	.
aroA.20	0	0	.	.	.
aroA.21	0	0	.	.	.
aroA.22	0	0	.	.	.
aroA.23	0	0	.	.	.
aroA.24	0	0	.	.	.
aroA.25	0	0	.	.	.
aroA.26	0	0	.	.	.
aroA.27	0	0	.	.	.
aroA.28	0	0	.	.	.
aroA.29	0	0	.	.	.
aroA.3	0	0	.	.	.
aroA.30	0	0	.	.	.
aroA.31	0	0	.	.	.
aroA.32	0	0	.	.	.
aroA.33	0	0	.	.	.
aroA.34	0	0	.	.	.
aroA.35	0	0	.	.	.
aroA.36	0	0	.	.	.
aroA.37	0	0	.	.	.
aroA.38	0	0	.	.	.
aroA.39	0	0	.	.	.
aroA.4	0	0	.	.	.
aroA.40	0	0	.	.	.
aroA.41	0	0	.	.	.
aroA.42	0	0	.	.	.
aroA.43	0	0	.	.	.
aroA.44	0	0	.	.	.
aroA.45	0	0	.	.	.
aroA.46	0	0	.	.	.
aroA.47	0	0	.	.	.
aroA.48	0	0	.	.	.
aroA.49	0	0	.	.	.
aroA.5	0	0	.	.	.
aroA.50	0	0	.	.	.
aroA.51	0	0	.	.	.
aroA.52	0	0	.	.	.
aroA.53	0	0	.	.	.
aroA.54	0	0	.	.	.
aroA.55	0	0	.	.	.
aroA.56	0	0	.	.	.
aroA.57	0	0	.	.	.
aroA.58	0	0	.	.	.
aroA.59	0	0	.	.	.
aroA.6	0	0	.	.	.
aroA.60	0	0	.	.	.
aroA.61	0	0	.	.	.
aroA.62	0	0	.	.	.
aroA.63	0	0	.	.	.
aroA.64	0	0	.	.	.
aroA.65	0	0	.	.	.
aroA.66	0	0	.	.	.
aroA.67	0	0	.	.	.
aroA.68	0	0	.	.	.
aroA.69	0	0	.	.	.
aroA.7	0	0	.	.	.
aroA.70	0	0	.	.	.
aroA.72	0	0	.	.	.
aroA.74	0	0	.	.	.
aroA.75	0	0	.	.	.
aroA.76	0	0	.	.	.
aroA.77	0	0	.	.	.
aroA.78	0	0	.	.	.
aroA.79	0	0	.	.	.
aroA.8	0	0	.	.	.
aroA.80	0	0	.	.	.
aroA.81	0	0	.	.	.
aroA.82	0	0	.	.	.
aroA.83	0	0	.	.	.
aroA.84	0	0	.	.	.
aroA.85	0	0	.	.	.
aroA.86	0	0	.	.	.
aroA.87	0	0	.	.	.
aroA.88	0	0	.	.	.
aroA.89	0	0	.	.	.
aroA.9	0	0	.	.	.
aroA.90	0	0	.	.	.
aroA.91	0	0	.	.	.
aroA.92	0	0	.	.	.
aroA.93	0	0	.	.	.
aroA.94	0	0	.	.	.
aroA.95	0	0	.	.	.
aroA.96	0	0	.	.	.
aroA.97	0	0	.	.	.
aroA.98	0	0	.	.	.
aroA.99	0	0	.	.	.
glnA.1	0	0	.	.	.
glnA.10	0	0	.	.	.
glnA.101	0	0	.	.	.
glnA.102	0	0	.	.	.
glnA.103	0	0	.	.	.
glnA.104	0	0	.	.	.
glnA.105	0	0	.	.	.
glnA.106	0	0	.	.	.
glnA.107	0	0	.	.	.
glnA.108	0	0	.	.	.
glnA.109	0	0	.	.	.
glnA.11	0	0	.	.	.
glnA.110	0	0	.	.	.
glnA.111	0	0	.	.	.
glnA.112	0	0	.	.	.
glnA.113	0	0	.	.	.
glnA.114	0	0	.	.	.
glnA.115	0	0	.	.	.
glnA.116	0	0	.	.	.
glnA.117	0	0	.	.	.
glnA.118	0	0	.	.	.
glnA.119	0	0	.	.	.
glnA.12	0	0	.	.	.
glnA.120	0	0	.	.	.
glnA.121	0	0	.	.	.
glnA.122	0	0	.	.	.
glnA.123	0	0	.	.	.
glnA.124	0	0	.	.	.
glnA.125	0	0	.	.	.
glnA.126	0	0	.	.	.
glnA.127	0	0	.	.	.
glnA.128	0	0	.	.	.
glnA.129	0	0	.	.	.
glnA.13	0	0	.	.	.
glnA.130	0	0	.	.	.
glnA.131	0	0	.	.	.
glnA.132	0	0	.	.	.
glnA.134	0	0	.	.	.
glnA.135	0	0	.	.	.
glnA.14	0	0	.	.	.
glnA.141	0	0	.	.	.
glnA.142	0	0	.	.	.
glnA.143	0	0	.	.	.
glnA.144	0	0	.	.	.
glnA.145	0	0	.	.	.
glnA.146	0	0	.	.	.
glnA.147	0	0	.	.	.
glnA.148	0	0	.	.	.
glnA.149	0	0	.	.	.
glnA.15	0	0	.	.	.
glnA.150	0	0	.	.	.
glnA.151	0	0	.	.	.
glnA.152	0	0	.	.	.
glnA.153	0	0	.	.	.
glnA.154	0	0	.	.	.
glnA.155	0	0	.	.	.
glnA.156	0	0	.	.	.
glnA.157	0	0	.	.	.
glnA.16	0	0	.	.	.
glnA.17	0	0	.	.	.
glnA.18	0	0	.	.	.
glnA.19	0	0	.	.	.
glnA.2	0	0	.	.	.
glnA.20	0	0	.	.	.
glnA.21	0	0	.	.	.
glnA.22	0	0	.	.	.
glnA.23	0	0	.	.	.
glnA.24	0	0	.	.	.
glnA.25	0	0	.	.	.
glnA.26	0	0	.	.	.
glnA.27	0	0	.	.	.
glnA.28	0	0	.	.	.
glnA.29	0	0	.	.	.
glnA.3	0	0	.	.	.
glnA.30	0	0	.	.	.
glnA.31	0	0	.	.	.
glnA.32	0	0	.	.	.
glnA.33	0	0	.	.	.
glnA.34	0	0	.	.	.
glnA.35	0	0	.	.	.
glnA.36	0	0	.	.	.
glnA.37	0	0	.	.	.
glnA.38	0	0	.	.	.
glnA.39	0	0	.	.	.
glnA.4	0	0	.	.	.
glnA.40	0	0	.	.	.
glnA.41	0	0	.	.	.
glnA.42	0	0	.	.	.
glnA.43	0	0	.	.	.
glnA.44	0	0	.	.	.
glnA.45	0	0	.	.	.
glnA.46	0	0	.	.	.
glnA.47	0	0	.	.	.
glnA.48	0	0	.	.	.
glnA.49	0	0	.	.	.
glnA.5	0	0	.	.	.
glnA.50	0	0	.	.	.
glnA.51	0	0	.	.	.
glnA.52	0	0	.	.	.
glnA.53	0	0	.	.	.
glnA.54	0	0	.	.	.
glnA.55	0	0	.	.	.
glnA.56	0	0	.	.	.
glnA.57	0	0	.	.	.
glnA.58	0	0	.	.	.
glnA.59	0	0	.	.	.
glnA.6	0	0	.	.	.
glnA.60	0	0	.	.	.
glnA.61	0	0	.	.	.
glnA.62	0	0	.	.	.
glnA.63	0	0	.	.	.
glnA.64	0	0	.	.	.
glnA.65	0	0	.	.	.
glnA.66	0	0	.	.	.
glnA.67	0	0	.	.	.
glnA.68	0	0	.	.	.
glnA.7	0	0	.	.	.
glnA.71	0	0	.	.	.
glnA.72	0	0	.	.	.
glnA.73	0	0	.	.	.
glnA.74	0	0	.	.	.
glnA.75	0	0	.	.	.
glnA.76	0	0	.	.	.
glnA.77	0	0	.	.	.
glnA.78	0	0	.	.	.
glnA.79	0	0	.	.	.
glnA.8	0	0	.	.	.
glnA.80	0	0	.	.	.
glnA.81	0	0	.	.	.
glnA.82	0	0	.	.	.
glnA.83	0	0	.	.	.
glnA.84	0	0	.	.	.
glnA.85	0	0	.	.	.
glnA.86	0	0	.	.	.
glnA.87	0	0	.	.	.
glnA.88	0	0	.	.	.
glnA.89	0	0	.	.	.
glnA.9	0	0	.	.	.
glnA.90	0	0	.	.	.
glnA.91	0	0	.	.	.
glnA.92	0	0	.	.	.
glnA.93	0	0	.	.	.
glnA.94	0	0	.	.	.
glnA.95	0	0	.	.	.
glnA.96	0	0	.	.	.
glnA.97	0	0	.	.	.
glnA.98	0	0	.	.	.
glnA.99	0	0	.	.	.
thrA.1	0	0	.	.	.
thrA.10	0	0	.	.	.
thrA.100	0	0	.	.	.
thrA.101	0	0	.	.	.
thrA.102	0	0	.	.	.
thrA.103	0	0	.	.	.
thrA.104	0	0	.	.	.
thrA.105	0	0	.	.	.
thrA.106	0	0	.	.	.
thrA.107	0	0	.	.	.
thrA.108	0	0	.	.	.
thrA.109	0	0	.	.	.
thrA.11	0	0	.	.	.
thrA.110	0	0	.	.	.
thrA.111	0	0	.	.	.
thrA.112	0	0	.	.	.
thrA.113	0	0	.	.	.
thrA.114	0	0	.	.	.
thrA.115	0	0	.	.	.
thrA.118	0	0	.	.	.
thrA.119	0	0	.	.	.
thrA.12	0	0	.	.	.
thrA.120	0	0	.	.	.
thrA.121	0	0	.	.	.
thrA.122	0	0	.	.	.
thrA.123	0	0	.	.	.
thrA.124	0	0	.	.	.
thrA.125	0	0	.	.	.
thrA.126	0	0	.	.	.
thrA.127	0	0	.	.	.
thrA.128	0	0	.	.	.
thrA.129	0	0	.	.	.
thrA.13	0	0	.	.	.
thrA.130	0	0	.	.	.
thrA.131	0	0	.	.	.
thrA.132	0	0	.	.	.
thrA.133	0	0	.	.	.
thrA.134	0	0	.	.	.
thrA.135	0	0	.	.	.
thrA.136	0	0	.	.	.
thrA.137	0	0	.	.	.
thrA.138	0	0	.	.	.
thrA.139	0	0	.	.	.
thrA.14	0	0	.	.	.
thrA.140	0	0	.	.	.
thrA.141	0	0	.	.	.
thrA.142	0	0	.	.	.
thrA.143	0	0	.	.	.
thrA.144	0	0	.	.	.
thrA.145	0	0	.	.	.
thrA.146	0	0	.	.	.
thrA.147	0	0	.	.	.
thrA.148	0	0	.	.	.
thrA.15	0	0	.	.	.
thrA.150	0	0	.	.	.
thrA.151	0	0	.	.	.
thrA.16	0	0	.	.	.
thrA.160	0	0	.	.	.
thrA.161	0	0	.	.	.
thrA.162	0	0	.	.	.
thrA.163	0	0	.	.	.
thrA.164	0	0	.	.	.
thrA.165	0	0	.	.	.
thrA.166	0	0	.	.	.
thrA.167	0	0	.	.	.
thrA.168	0	0	.	.	.
thrA.169	0	0	.	.	.
thrA.17	0	0	.	.	.
thrA.170	0	0	.	.	.
thrA.171	0	0	.	.	.
thrA.172	0	0	.	.	.
thrA.173	0	0	.	.	.
thrA.174	0	0	.	.	.
thrA.175	0	0	.	.	.
thrA.176	0	0	.	.	.
thrA.177	0	0	.	.	.
thrA.178	0	0	.	.	.
thrA.179	0	0	.	.	.
thrA.18	0	0	.	.	.
thrA.180	0	0	.	.	.
thrA.181	0	0	.	.	.
thrA.182	0	0	.	.	.
thrA.183	0	0	.	.	.
thrA.19	0	0	.	.	.
thrA.2	0	0	.	.	.
thrA.20	0	0	.	.	.
thrA.21	0	0	.	.	.
thrA.22	0	0	.	.	.
thrA.23	0	0	.	.	.
thrA.24	0	0	.	.	.
thrA.25	0	0	.	.	.
thrA.26	0	0	.	.	.
thrA.27	0	0	.	.	.
thrA.28	0	0	.	.	.
thrA.29	0	0	.	.	.
thrA.3	0	0	.	.	.
thrA.30	0	0	.	.	.
thrA.31	0	0	.	.	.
thrA.32	0	0	.	.	.
thrA.33	0	0	.	.	.
thrA.34	0	0	.	.	.
thrA.35	0	0	.	.	.
thrA.36	0	0	.	.	.
thrA.37	0	0	.	.	.
thrA.38	0	0	.	.	.
thrA.39	0	0	.	.	.
thrA.4	0	0	.	.	.
thrA.40	0	0	.	.	.
thrA.41	0	0	.	.	.
thrA.42	0	0	.	.	.
thrA.43	0	0	.	.	.
thrA.44	0	0	.	.	.
thrA.45	0	0	.	.	.
thrA.46	0	0	.	.	.
thrA.47	0	0	.	.	.
thrA.48	0	0	.	.	.
thrA.49	0	0	.	.	.
thrA.5	0	0	.	.	.
thrA.50	0	0	.	.	.
thrA.51	0	0	.	.	.
thrA.52	0	0	.	.	.
thrA.53	0	0	.	.	.
thrA.54	0	0	.	.	.
thrA.55	0	0	.	.	.
thrA.56	0	0	.	.	.
thrA.57	0	0	.	.	.
thrA.58	0	0	.	.	.
thrA.59	0	0	.	.	.
thrA.6	0	0	.	.	.
thrA.60	0	0	.	.	.
thrA.61	0	0	.	.	.
thrA.62	0	0	.	.	.
thrA.63	0	0	.	.	.
thrA.64	0	0	.	.	.
thrA.65	0	0	.	.	.
thrA.66	0	0	.	.	.
thrA.67	0	0	.	.	.
thrA.68	0	0	.	.	.
thrA.69	0	0	.	.	.
thrA.7	0	0	.	.	.
thrA.70	0	0	.	.	.
thrA.71	0	0	.	.	.
thrA.72	0	0	.	.	.
thrA.73	0	0	.	.	.
thrA.74	0	0	.	.	.
thrA.75	0	0	.	.	.
thrA.76	0	0	.	.	.
thrA.77	0	0	.	.	.
thrA.78	0	0	.	.	.
thrA.8	0	0	.	.	.
thrA.83	0	0	.	.	.
thrA.84	0	0	.	.	.
thrA.85	0	0	.	.	.
thrA.86	0	0	.	.	.
thrA.87	0	0	.	.	.
thrA.89	0	0	.	.	.
thrA.9	0	0	.	.	.
thrA.90	0	0	.	.	.
thrA.91	0	0	.	.	.
thrA.92	0	0	.	.	.
thrA.93	0	0	.	.	.
thrA.94	0	0	.	.	.
thrA.95	0	0	.	.	.
thrA.96	0	0	.	.	.
thrA.97	0	0	.	.	.
thrA.98	0	0	.	.	.
thrA.99	0	0	.	.	.
tmk.1	0	0	.	.	.
tmk.10	0	0	.	.	.
tmk.100	0	0	.	.	.
tmk.101	0	0	.	.	.
tmk.102	0	0	.	.	.
tmk.103	0	0	.	.	.
tmk.104	0	0	.	.	.
tmk.105	0	0	.	.	.
tmk.106	0	0	.	.	.
tmk.107	0	0	.	.	.
tmk.108	0	0	.	.	.
tmk.109	0	0	.	.	.
tmk.11	0	0	.	.	.
tmk.110	0	0	.	.	.
tmk.111	0	0	.	.	.
tmk.112	0	0	.	.	.
tmk.113	0	0	.	.	.
tmk.114	0	0	.	.	.
tmk.115	0	0	.	.	.
tmk.116	0	0	.	.	.
tmk.117	0	0	.	.	.
tmk.118	0	0	.	.	.
tmk.119	0	0	.	.	.
tmk.12	0	0	.	.	.
tmk.120	0	0	.	.	.
tmk.121	0	0	.	.	.
tmk.122	0	0	.	.	.
tmk.123	0	0	.	.	.
tmk.124	0	0	.	.	.
tmk.125	0	0	.	.	.
tmk.126	0	0	.	.	.
tmk.127	0	0	.	.	.
tmk.128	0	0	.	.	.
tmk.129	0	0	.	.	.
tmk.13	0	0	.	.	.
tmk.130	0	0	.	.	.
tmk.131	0	0	.	.	.
tmk.132	0	0	.	.	.
tmk.134	0	0	.	.	.
tmk.135	0	0	.	.	.
tmk.138	0	0	.	.	.
tmk.139	0	0	.	.	.
tmk.14	0	0	.	.	.
tmk.140	0	0	.	.	.
tmk.141	0	0	.	.	.
tmk.142	0	0	.	.	.
tmk.143	0	0	.	.	.
tmk.144	0	0	.	.	.
tmk.145	0	0	.	.	.
tmk.146	0	0	.	.	.
tmk.147	0	0	.	.	.
tmk.148	0	0	.	.	.
tmk.149	0	0	.	.	.
tmk.15	0	0	.	.	.
tmk.150	0	0	.	.	.
tmk.151	0	0	.	.	.
tmk.152	0	0	.	.	.
tmk.153	0	0	.	.	.
tmk.154	0	0	.	.	.
tmk.155	0	0	.	.	.
tmk.156	0	0	.	.	.
tmk.157	0	0	.	.	.
tmk.158	0	0	.	.	.
tmk.159	0	0	.	.	.
tmk.16	0	0	.	.	.
tmk.160	0	0	.	.	.
tmk.161	0	0	.	.	.
tmk.162	0	0	.	.	.
tmk.163	0	0	.	.	.
tmk.164	0	0	.	.	.
tmk.165	0	0	.	.	.
tmk.166	0	0	.	.	.
tmk.167	0	0	.	.	.
tmk.168	0	0	.	.	.
tmk.169	0	0	.	.	.
tmk.17	0	0	.	.	.
tmk.170	0	0	.	.	.
tmk.171	0	0	.	.	.
tmk.172	0	0	.	.	.
tmk.173	0	0	.	.	.
tmk.174	0	0	.	.	.
tmk.177	0	0	.	.	.
tmk.178	0	0	.	.	.
tmk.18	0	0	.	.	.
tmk.19	0	0	.	.	.
tmk.190	0	0	.	.	.
tmk.191	0	0	.	.	.
tmk.192	0	0	.	.	.
tmk.193	0	0	.	.	.
tmk.194	0	0	.	.	.
tmk.195	0	0	.	.	.
tmk.196	0	0	.	.	.
tmk.197	0	0	.	.	.
tmk.198	0	0	.	.	.
tmk.199	0	0	.	.	.
tmk.2	0	0	.	.	.
tmk.20	0	0	.	.	.
tmk.200	0	0	.	.	.
tmk.201	0	0	.	.	.
tmk.204	0	0	.	.	.
tmk.205	0	0	.	.	.
tmk.206	0	0	.	.	.
tmk.207	0	0	.	.	.
tmk.208	0	0	.	.	.
tmk.209	0	0	.	.	.
tmk.21	0	0	.	.	.
tmk.210	0	0	.	.	.
tmk.211	0	0	.	.	.
tmk.212	0	0	.	.	.
tmk.213	0	0	.	.	.
tmk.214	0	0	.	.	.
tmk.215	0	0	.	.	.
tmk.216	0	0	.	.	.
tmk.217	0	0	.	.	.
tmk.22	0	0	.	.	.
tmk.23	0	0	.	.	.
tmk.24	0	0	.	.	.
tmk.25	0	0	.	.	.
tmk.26	0	0	.	.	.
tmk.27	0	0	.	.	.
tmk.28	0	0	.	.	.
tmk.29	0	0	.	.	.
tmk.3	0	0	.	.	.
tmk.30	0	0	.	.	.
tmk.31	0	0	.	.	.
tmk.32	0	0	.	.	.
tmk.33	0	0	.	.	.
tmk.34	0	0	.	.	.
tmk.35	0	0	.	.	.
tmk.36	0	0	.	.	.
tmk.37	0	0	.	.	.
tmk.38	0	0	.	.	.
tmk.39	0	0	.	.	.
tmk.4	0	0	.	.	.
tmk.40	0	0	.	.	.
tmk.41	0	0	.	.	.
tmk.42	0	0	.	.	.
tmk.43	0	0	.	.	.
tmk.45	0	0	.	.	.
tmk.47	0	0	.	.	.
tmk.48	0	0	.	.	.
tmk.49	0	0	.	.	.
tmk.5	0	0	.	.	.
tmk.50	0	0	.	.	.
tmk.51	0	0	.	.	.
tmk.52	0	0	.	.	.
tmk.53	0	0	.	.	.
tmk.54	0	0	.	.	.
tmk.55	0	0	.	.	.
tmk.56	0	0	.	.	.
tmk.57	0	0	.	.	.
tmk.58	0	0	.	.	.
tmk.59	0	0	.	.	.
tmk.6	0	0	.	.	.
tmk.60	0	0	.	.	.
tmk.61	0	0	.	.	.
tmk.62	0	0	.	.	.
tmk.63	0	0	.	.	.
tmk.64	0	0	.	.	.
tmk.65	0	0	.	.	.
tmk.66	0	0	.	.	.
tmk.67	0	0	.	.	.
tmk.68	0	0	.	.	.
tmk.69	0	0	.	.	.
tmk.7	0	0	.	.	.
tmk.70	0	0	.	.	.
tmk.71	0	0	.	.	.
tmk.72	0	0	.	.	.
tmk.73	0	0	.	.	.
tmk.74	0	0	.	.	.
tmk.76	0	0	.	.	.
tmk.78	0	0	.	.	.
tmk.79	0	0	.	.	.
tmk.8	0	0	.	.	.
tmk.81	0	0	.	.	.
tmk.83	0	0	.	.	.
tmk.84	0	0	.	.	.
tmk.85	0	0	.	.	.
tmk.86	0	0	.	.	.
tmk.87	0	0	.	.	.
tmk.9	0	0	.	.	.
tmk.90	0	0	.	.	.
tmk.91	0	0	.	.	.
tmk.92	0	0	.	.	.
tmk.93	0	0	.	.	.
tmk.94	0	0	.	.	.
tmk.95	0	0	.	.	.
tmk.96	0	0	.	.	.
tmk.97	0	0	.	.	.
tmk.98	0	0	.	.	.
tmk.99	0	0	.	.	.
trpE.1	0	0	.	.	.
trpE.10	0	0	.	.	.
trpE.100	0	0	.	.	.
trpE.101	0	0	.	.	.
trpE.102	0	0	.	.	.
trpE.103	0	0	.	.	.
trpE.104	0	0	.	.	.
trpE.105	0	0	.	.	.
trpE.106	0	0	.	.	.
trpE.107	0	0	.	.	.
trpE.108	0	0	.	.	.
trpE.109	0	0	.	.	.
trpE.11	0	0	.	.	.
trpE.110	0	0	.	.	.
trpE.111	0	0	.	.	.
trpE.112	0	0	.	.	.
trpE.113	0	0	.	.	.
trpE.114	0	0	.	.	.
trpE.115	0	0	.	.	.
trpE.116	0	0	.	.	.
trpE.117	0	0	.	.	.
trpE.118	0	0	.	.	.
trpE.119	0	0	.	.	.
trpE.120	0	0	.	.	.
trpE.121	0	0	.	.	.
trpE.122	0	0	.	.	.
trpE.123	0	0	.	.	.
trpE.124	0	0	.	.	.
trpE.127	0	0	.	.	.
trpE.128	0	0	.	.	.
trpE.129	0	0	.	.	.
trpE.13	0	0	.	.	.
trpE.130	0	0	.	.	.
trpE.131	0	0	.	.	.
trpE.132	0	0	.	.	.
trpE.133	0	0	.	.	.
trpE.134	0	0	.	.	.
trpE.135	0	0	.	.	.
trpE.136	0	0	.	.	.
trpE.137	0	0	.	.	.
trpE.138	0	0	.	.	.
trpE.139	0	0	.	.	.
trpE.14	0	0	.	.	.
trpE.140	0	0	.	.	.
trpE.141	0	0	.	.	.
trpE.142	0	0	.	.	.
trpE.143	0	0	.	.	.
trpE.144	0	0	.	.	.
trpE.145	0	0	.	.	.
trpE.146	0	0	.	.	.
trpE.147	0	0	.	.	.
trpE.148	0	0	.	.	.
trpE.149	0	0	.	.	.
trpE.15	0	0	.	.	.
trpE.150	0	0	.	.	.
trpE.151	0	0	.	.	.
trpE.152	0	0	.	.	.
trpE.153	0	0	.	.	.
trpE.154	0	0	.	.	.
trpE.155	0	0	.	.	.
trpE.156	0	0	.	.	.
trpE.157	0	0	.	.	.
trpE.158	0	0	.	.	.
trpE.159	0	0	.	.	.
trpE.16	0	0	.	.	.
trpE.160	0	0	.	.	.
trpE.161	0	0	.	.	.
trpE.162	0	0	.	.	.
trpE.163	0	0	.	.	.
trpE.164	0	0	.	.	.
trpE.165	0	0	.	.	.
trpE.166	0	0	.	.	.
trpE.167	0	0	.	.	.
trpE.168	0	0	.	.	.
trpE.169	0	0	.	.	.
trpE.17	0	0	.	.	.
trpE.170	0	0	.	.	.
trpE.174	0	0	.	.	.
trpE.175	0	0	.	.	.
trpE.176	0	0	.	.	.
trpE.177	0	0	.	.	.
trpE.178	0	0	.	.	.
trpE.179	0	0	.	.	.
trpE.18	0	0	.	.	.
trpE.185	0	0	.	.	.
trpE.186	0	0	.	.	.
trpE.187	0	0	.	.	.
trpE.188	0	0	.	.	.
trpE.189	0	0	.	.	.
trpE.19	0	0	.	.	.
trpE.190	0	0	.	.	.
trpE.191	0	0	.	.	.
trpE.192	0	0	.	.	.
trpE.193	0	0	.	.	.
trpE.194	0	0	.	.	.
trpE.196	0	0	.	.	.
trpE.197	0	0	.	.	.
trpE.198	0	0	.	.	.
trpE.199	0	0	.	.	.
trpE.2	0	0	.	.	.
trpE.20	0	0	.	.	.
trpE.200	0	0	.	.	.
trpE.201	0	0	.	.	.
trpE.202	0	0	.	.	.
trpE.203	0	0	.	.	.
trpE.204	0	0	.	.	.
trpE.205	0	0	.	.	.
trpE.206	0	0	.	.	.
trpE.207	0	0	.	.	.
trpE.208	0	0	.	.	.
trpE.209	0	0	.	.	.
trpE.21	0	0	.	.	.
trpE.210	0	0	.	.	.
trpE.211	0	0	.	.	.
trpE.212	0	0	.	.	.
trpE.213	0	0	.	.	.
trpE.214	0	0	.	.	.
trpE.215	0	0	.	.	.
trpE.22	0	0	.	.	.
trpE.23	0	0	.	.	.
trpE.24	0	0	.	.	.
trpE.25	0	0	.	.	.
trpE.26	0	0	.	.	.
trpE.27	0	0	.	.	.
trpE.28	0	0	.	.	.
trpE.29	0	0	.	.	.
trpE.3	0	0	.	.	.
trpE.30	0	0	.	.	.
trpE.31	0	0	.	.	.
trpE.32	0	0	.	.	.
trpE.33	0	0	.	.	.
trpE.34	0	0	.	.	.
trpE.35	0	0	.	.	.
trpE.36	0	0	.	.	.
trpE.37	0	0	.	.	.
trpE.38	0	0	.	.	.
trpE.39	0	0	.	.	.
trpE.4	0	0	.	.	.
trpE.40	0	0	.	.	.
trpE.41	0	0	.	.	.
trpE.42	0	0	.	.	.
trpE.43	0	0	.	.	.
trpE.44	0	0	.	.	.
trpE.45	0	0	.	.	.
trpE.46	0	0	.	.	.
trpE.47	0	0	.	.	.
trpE.48	0	0	.	.	.
trpE.49	0	0	.	.	.
trpE.5	0	0	.	.	.
trpE.50	0	0	.	.	.
trpE.51	0	0	.	.	.
trpE.52	0	0	.	.	.
trpE.53	0	0	.	.	.
trpE.54	0	0	.	.	.
trpE.55	0	0	.	.	.
trpE.56	0	0	.	.	.
trpE.57	0	0	.	.	.
trpE.58	0	0	.	.	.
trpE.59	0	0	.	.	.
trpE.6	0	0	.	.	.
trpE.60	0	0	.	.	.
trpE.61	0	0	.	.	.
trpE.62	0	0	.	.	.
trpE.63	0	0	.	.	.
trpE.64	0	0	.	.	.
trpE.65	0	0	.	.	.
trpE.66	0	0	.	.	.
trpE.67	0	0	.	.	.
trpE.68	0	0	.	.	.
trpE.69	0	0	.	.	.
trpE.7	0	0	.	.	.
trpE.70	0	0	.	.	.
trpE.71	0	0	.	.	.
trpE.72	0	0	.	.	.
trpE.73	0	0	.	.	.
trpE.74	0	0	.	.	.
trpE.75	0	0	.	.	.
trpE.76	0	0	.	.	.
trpE.77	0	0	.	.	.
trpE.79	0	0	.	.	.
trpE.8	0	0	.	.	.
trpE.80	0	0	.	.	.
trpE.81	0	0	.	.	.
trpE.82	0	0	.	.	.
trpE.83	0	0	.	.	.
trpE.84	0	0	.	.	.
trpE.85	0	0	.	.	.
trpE.87	0	0	.	.	.
trpE.88	0	0	.	.	.
trpE.89	0	0	.	.	.
trpE.9	0	0	.	.	.
trpE.90	0	0	.	.	.
trpE.91	0	0	.	.	.
trpE.92	0	0	.	.	.
trpE.93	0	0	.	.	.
trpE.94	0	0	.	.	.
trpE.95	0	0	.	.	.
trpE.96	0	0	.	.	.
trpE.97	0	0	.	.	.
trpE.98	0	0	.	.	.
trpE.99	0	0	.	.	.
