adk.1	adk.2	adk.3	adk.4	adk.5	adk.8
atpA.1	atpA.2	atpA.3	atpA.4	atpA.5	atpA.6	atpA.9
fbpA.1	fbpA.2	fbpA.3	fbpA.4	fbpA.5	fbpA.9
ftsZ.1	ftsZ.11	ftsZ.12	ftsZ.2	ftsZ.3	ftsZ.4	ftsZ.5	ftsZ.6	ftsZ.7	ftsZ.8
glyA.1	glyA.2	glyA.3	glyA.4	glyA.5	glyA.7
groEL.1	groEL.2	groEL.3	groEL.4	groEL.5	groEL.7
gyrB.1	gyrB.10	gyrB.11	gyrB.2	gyrB.3	gyrB.4	gyrB.5	gyrB.6	gyrB.7
