abcZ.1	abcZ.10	abcZ.11	abcZ.12	abcZ.13	abcZ.14	abcZ.15	abcZ.16	abcZ.17	abcZ.18	abcZ.19	abcZ.2	abcZ.20	abcZ.21	abcZ.3	abcZ.4	abcZ.5	abcZ.6	abcZ.7	abcZ.8	abcZ.9
adk.1	adk.10	adk.11	adk.2	adk.3	adk.4	adk.5	adk.6	adk.7	adk.8	adk.9
aroE.1	aroE.10	aroE.11	aroE.12	aroE.13	aroE.14	aroE.15	aroE.16	aroE.17	aroE.18	aroE.19	aroE.2	aroE.20	aroE.21	aroE.22	aroE.3	aroE.4	aroE.5	aroE.6	aroE.7	aroE.8	aroE.9
cpn60.1	cpn60.10	cpn60.11	cpn60.2	cpn60.3	cpn60.4	cpn60.5	cpn60.6	cpn60.7	cpn60.8	cpn60.9
gdh.1	gdh.10	gdh.11	gdh.12	gdh.13	gdh.14	gdh.15	gdh.16	gdh.17	gdh.18	gdh.19	gdh.2	gdh.20	gdh.3	gdh.4	gdh.5	gdh.6	gdh.7	gdh.8	gdh.9
recA.1	recA.10	recA.11	recA.12	recA.13	recA.14	recA.2	recA.3	recA.4	recA.5	recA.6	recA.7	recA.8	recA.9
