AAT1a.1	0	0	.	.	.
AAT1a.10	0	0	.	.	.
AAT1a.100	0	0	.	.	.
AAT1a.101	0	0	.	.	.
AAT1a.102	0	0	.	.	.
AAT1a.103	0	0	.	.	.
AAT1a.104	0	0	.	.	.
AAT1a.105	0	0	.	.	.
AAT1a.106	0	0	.	.	.
AAT1a.107	0	0	.	.	.
AAT1a.108	0	0	.	.	.
AAT1a.109	0	0	.	.	.
AAT1a.11	0	0	.	.	.
AAT1a.110	0	0	.	.	.
AAT1a.111	0	0	.	.	.
AAT1a.112	0	0	.	.	.
AAT1a.113	0	0	.	.	.
AAT1a.114	0	0	.	.	.
AAT1a.115	0	0	.	.	.
AAT1a.116	0	0	.	.	.
AAT1a.117	0	0	.	.	.
AAT1a.118	0	0	.	.	.
AAT1a.119	0	0	.	.	.
AAT1a.12	0	0	.	.	.
AAT1a.120	0	0	.	.	.
AAT1a.121	0	0	.	.	.
AAT1a.122	0	0	.	.	.
AAT1a.123	0	0	.	.	.
AAT1a.124	0	0	.	.	.
AAT1a.125	0	0	.	.	.
AAT1a.126	0	0	.	.	.
AAT1a.127	0	0	.	.	.
AAT1a.128	0	0	.	.	.
AAT1a.129	0	0	.	.	.
AAT1a.13	0	0	.	.	.
AAT1a.130	0	0	.	.	.
AAT1a.131	0	0	.	.	.
AAT1a.132	0	0	.	.	.
AAT1a.133	0	0	.	.	.
AAT1a.134	0	0	.	.	.
AAT1a.135	0	0	.	.	.
AAT1a.136	0	0	.	.	.
AAT1a.137	0	0	.	.	.
AAT1a.138	0	0	.	.	.
AAT1a.139	0	0	.	.	.
AAT1a.14	0	0	.	.	.
AAT1a.140	0	0	.	.	.
AAT1a.141	0	0	.	.	.
AAT1a.142	0	0	.	.	.
AAT1a.143	0	0	.	.	.
AAT1a.144	0	0	.	.	.
AAT1a.145	0	0	.	.	.
AAT1a.146	0	0	.	.	.
AAT1a.147	0	0	.	.	.
AAT1a.148	0	0	.	.	.
AAT1a.149	0	0	.	.	.
AAT1a.15	0	0	.	.	.
AAT1a.150	0	0	.	.	.
AAT1a.151	0	0	.	.	.
AAT1a.152	0	0	.	.	.
AAT1a.153	0	0	.	.	.
AAT1a.154	0	0	.	.	.
AAT1a.155	0	0	.	.	.
AAT1a.156	0	0	.	.	.
AAT1a.157	0	0	.	.	.
AAT1a.158	0	0	.	.	.
AAT1a.159	0	0	.	.	.
AAT1a.16	0	0	.	.	.
AAT1a.160	0	0	.	.	.
AAT1a.161	0	0	.	.	.
AAT1a.162	0	0	.	.	.
AAT1a.163	0	0	.	.	.
AAT1a.164	0	0	.	.	.
AAT1a.165	0	0	.	.	.
AAT1a.166	0	0	.	.	.
AAT1a.167	0	0	.	.	.
AAT1a.168	0	0	.	.	.
AAT1a.169	0	0	.	.	.
AAT1a.17	0	0	.	.	.
AAT1a.170	0	0	.	.	.
AAT1a.171	0	0	.	.	.
AAT1a.172	0	0	.	.	.
AAT1a.173	0	0	.	.	.
AAT1a.174	0	0	.	.	.
AAT1a.175	0	0	.	.	.
AAT1a.176	0	0	.	.	.
AAT1a.177	0	0	.	.	.
AAT1a.178	0	0	.	.	.
AAT1a.179	0	0	.	.	.
AAT1a.18	0	0	.	.	.
AAT1a.180	0	0	.	.	.
AAT1a.181	0	0	.	.	.
AAT1a.182	0	0	.	.	.
AAT1a.19	0	0	.	.	.
AAT1a.2	0	0	.	.	.
AAT1a.20	0	0	.	.	.
AAT1a.21	0	0	.	.	.
AAT1a.22	0	0	.	.	.
AAT1a.23	0	0	.	.	.
AAT1a.24	0	0	.	.	.
AAT1a.25	0	0	.	.	.
AAT1a.26	0	0	.	.	.
AAT1a.27	0	0	.	.	.
AAT1a.28	0	0	.	.	.
AAT1a.29	0	0	.	.	.
AAT1a.3	0	0	.	.	.
AAT1a.30	0	0	.	.	.
AAT1a.31	0	0	.	.	.
AAT1a.32	0	0	.	.	.
AAT1a.33	0	0	.	.	.
AAT1a.34	0	0	.	.	.
AAT1a.35	0	0	.	.	.
AAT1a.36	0	0	.	.	.
AAT1a.37	0	0	.	.	.
AAT1a.38	0	0	.	.	.
AAT1a.39	0	0	.	.	.
AAT1a.4	0	0	.	.	.
AAT1a.40	0	0	.	.	.
AAT1a.41	0	0	.	.	.
AAT1a.42	0	0	.	.	.
AAT1a.43	0	0	.	.	.
AAT1a.44	0	0	.	.	.
AAT1a.45	0	0	.	.	.
AAT1a.46	0	0	.	.	.
AAT1a.47	0	0	.	.	.
AAT1a.48	0	0	.	.	.
AAT1a.49	0	0	.	.	.
AAT1a.5	0	0	.	.	.
AAT1a.50	0	0	.	.	.
AAT1a.51	0	0	.	.	.
AAT1a.52	0	0	.	.	.
AAT1a.53	0	0	.	.	.
AAT1a.54	0	0	.	.	.
AAT1a.55	0	0	.	.	.
AAT1a.56	0	0	.	.	.
AAT1a.57	0	0	.	.	.
AAT1a.58	0	0	.	.	.
AAT1a.59	0	0	.	.	.
AAT1a.6	0	0	.	.	.
AAT1a.60	0	0	.	.	.
AAT1a.61	0	0	.	.	.
AAT1a.62	0	0	.	.	.
AAT1a.63	0	0	.	.	.
AAT1a.64	0	0	.	.	.
AAT1a.65	0	0	.	.	.
AAT1a.66	0	0	.	.	.
AAT1a.67	0	0	.	.	.
AAT1a.68	0	0	.	.	.
AAT1a.69	0	0	.	.	.
AAT1a.7	0	0	.	.	.
AAT1a.70	0	0	.	.	.
AAT1a.71	0	0	.	.	.
AAT1a.72	0	0	.	.	.
AAT1a.73	0	0	.	.	.
AAT1a.74	0	0	.	.	.
AAT1a.75	0	0	.	.	.
AAT1a.76	0	0	.	.	.
AAT1a.77	0	0	.	.	.
AAT1a.78	0	0	.	.	.
AAT1a.79	0	0	.	.	.
AAT1a.8	0	0	.	.	.
AAT1a.80	0	0	.	.	.
AAT1a.81	0	0	.	.	.
AAT1a.82	0	0	.	.	.
AAT1a.83	0	0	.	.	.
AAT1a.84	0	0	.	.	.
AAT1a.85	0	0	.	.	.
AAT1a.86	0	0	.	.	.
AAT1a.87	0	0	.	.	.
AAT1a.88	0	0	.	.	.
AAT1a.89	0	0	.	.	.
AAT1a.9	0	0	.	.	.
AAT1a.90	0	0	.	.	.
AAT1a.91	0	0	.	.	.
AAT1a.92	0	0	.	.	.
AAT1a.93	0	0	.	.	.
AAT1a.94	0	0	.	.	.
AAT1a.95	0	0	.	.	.
AAT1a.96	0	0	.	.	.
AAT1a.97	0	0	.	.	.
AAT1a.98	0	0	.	.	.
AAT1a.99	0	0	.	.	.
ACC1.1	0	0	.	.	.
ACC1.10	0	0	.	.	.
ACC1.100	0	0	.	.	.
ACC1.101	0	0	.	.	.
ACC1.102	0	0	.	.	.
ACC1.103	0	0	.	.	.
ACC1.104	0	0	.	.	.
ACC1.105	0	0	.	.	.
ACC1.106	0	0	.	.	.
ACC1.107	0	0	.	.	.
ACC1.108	0	0	.	.	.
ACC1.109	0	0	.	.	.
ACC1.11	0	0	.	.	.
ACC1.110	0	0	.	.	.
ACC1.111	0	0	.	.	.
ACC1.112	0	0	.	.	.
ACC1.113	0	0	.	.	.
ACC1.114	0	0	.	.	.
ACC1.115	0	0	.	.	.
ACC1.116	0	0	.	.	.
ACC1.12	0	0	.	.	.
ACC1.13	0	0	.	.	.
ACC1.14	0	0	.	.	.
ACC1.15	0	0	.	.	.
ACC1.16	0	0	.	.	.
ACC1.17	0	0	.	.	.
ACC1.18	0	0	.	.	.
ACC1.19	0	0	.	.	.
ACC1.2	0	0	.	.	.
ACC1.20	0	0	.	.	.
ACC1.21	0	0	.	.	.
ACC1.22	0	0	.	.	.
ACC1.23	0	0	.	.	.
ACC1.24	0	0	.	.	.
ACC1.25	0	0	.	.	.
ACC1.26	0	0	.	.	.
ACC1.27	0	0	.	.	.
ACC1.28	0	0	.	.	.
ACC1.29	0	0	.	.	.
ACC1.3	0	0	.	.	.
ACC1.30	0	0	.	.	.
ACC1.31	0	0	.	.	.
ACC1.32	0	0	.	.	.
ACC1.33	0	0	.	.	.
ACC1.34	0	0	.	.	.
ACC1.35	0	0	.	.	.
ACC1.36	0	0	.	.	.
ACC1.37	0	0	.	.	.
ACC1.38	0	0	.	.	.
ACC1.39	0	0	.	.	.
ACC1.4	0	0	.	.	.
ACC1.40	0	0	.	.	.
ACC1.41	0	0	.	.	.
ACC1.42	0	0	.	.	.
ACC1.43	0	0	.	.	.
ACC1.44	0	0	.	.	.
ACC1.45	0	0	.	.	.
ACC1.46	0	0	.	.	.
ACC1.47	0	0	.	.	.
ACC1.48	0	0	.	.	.
ACC1.49	0	0	.	.	.
ACC1.5	0	0	.	.	.
ACC1.50	0	0	.	.	.
ACC1.51	0	0	.	.	.
ACC1.52	0	0	.	.	.
ACC1.53	0	0	.	.	.
ACC1.54	0	0	.	.	.
ACC1.55	0	0	.	.	.
ACC1.56	0	0	.	.	.
ACC1.57	0	0	.	.	.
ACC1.58	0	0	.	.	.
ACC1.59	0	0	.	.	.
ACC1.6	0	0	.	.	.
ACC1.60	0	0	.	.	.
ACC1.61	0	0	.	.	.
ACC1.62	0	0	.	.	.
ACC1.63	0	0	.	.	.
ACC1.64	0	0	.	.	.
ACC1.65	0	0	.	.	.
ACC1.66	0	0	.	.	.
ACC1.67	0	0	.	.	.
ACC1.68	0	0	.	.	.
ACC1.69	0	0	.	.	.
ACC1.7	0	0	.	.	.
ACC1.70	0	0	.	.	.
ACC1.71	0	0	.	.	.
ACC1.72	0	0	.	.	.
ACC1.73	0	0	.	.	.
ACC1.74	0	0	.	.	.
ACC1.75	0	0	.	.	.
ACC1.76	0	0	.	.	.
ACC1.77	0	0	.	.	.
ACC1.78	0	0	.	.	.
ACC1.79	0	0	.	.	.
ACC1.8	0	0	.	.	.
ACC1.80	0	0	.	.	.
ACC1.81	0	0	.	.	.
ACC1.82	0	0	.	.	.
ACC1.83	0	0	.	.	.
ACC1.84	0	0	.	.	.
ACC1.85	0	0	.	.	.
ACC1.86	0	0	.	.	.
ACC1.87	0	0	.	.	.
ACC1.88	0	0	.	.	.
ACC1.89	0	0	.	.	.
ACC1.9	0	0	.	.	.
ACC1.90	0	0	.	.	.
ACC1.91	0	0	.	.	.
ACC1.92	0	0	.	.	.
ACC1.93	0	0	.	.	.
ACC1.94	0	0	.	.	.
ACC1.95	0	0	.	.	.
ACC1.96	0	0	.	.	.
ACC1.97	0	0	.	.	.
ACC1.98	0	0	.	.	.
ACC1.99	0	0	.	.	.
ADP1.1	0	0	.	.	.
ADP1.10	0	0	.	.	.
ADP1.100	0	0	.	.	.
ADP1.101	0	0	.	.	.
ADP1.102	0	0	.	.	.
ADP1.103	0	0	.	.	.
ADP1.104	0	0	.	.	.
ADP1.105	0	0	.	.	.
ADP1.106	0	0	.	.	.
ADP1.107	0	0	.	.	.
ADP1.108	0	0	.	.	.
ADP1.109	0	0	.	.	.
ADP1.11	0	0	.	.	.
ADP1.110	0	0	.	.	.
ADP1.111	0	0	.	.	.
ADP1.112	0	0	.	.	.
ADP1.113	0	0	.	.	.
ADP1.114	0	0	.	.	.
ADP1.115	0	0	.	.	.
ADP1.116	0	0	.	.	.
ADP1.117	0	0	.	.	.
ADP1.118	0	0	.	.	.
ADP1.119	0	0	.	.	.
ADP1.12	0	0	.	.	.
ADP1.120	0	0	.	.	.
ADP1.121	0	0	.	.	.
ADP1.122	0	0	.	.	.
ADP1.123	0	0	.	.	.
ADP1.124	0	0	.	.	.
ADP1.125	0	0	.	.	.
ADP1.126	0	0	.	.	.
ADP1.127	0	0	.	.	.
ADP1.128	0	0	.	.	.
ADP1.129	0	0	.	.	.
ADP1.13	0	0	.	.	.
ADP1.130	0	0	.	.	.
ADP1.131	0	0	.	.	.
ADP1.132	0	0	.	.	.
ADP1.133	0	0	.	.	.
ADP1.134	0	0	.	.	.
ADP1.135	0	0	.	.	.
ADP1.136	0	0	.	.	.
ADP1.137	0	0	.	.	.
ADP1.138	0	0	.	.	.
ADP1.139	0	0	.	.	.
ADP1.14	0	0	.	.	.
ADP1.140	0	0	.	.	.
ADP1.141	0	0	.	.	.
ADP1.142	0	0	.	.	.
ADP1.143	0	0	.	.	.
ADP1.144	0	0	.	.	.
ADP1.145	0	0	.	.	.
ADP1.146	0	0	.	.	.
ADP1.147	0	0	.	.	.
ADP1.148	0	0	.	.	.
ADP1.149	0	0	.	.	.
ADP1.15	0	0	.	.	.
ADP1.150	0	0	.	.	.
ADP1.151	0	0	.	.	.
ADP1.152	0	0	.	.	.
ADP1.153	0	0	.	.	.
ADP1.154	0	0	.	.	.
ADP1.155	0	0	.	.	.
ADP1.156	0	0	.	.	.
ADP1.157	0	0	.	.	.
ADP1.158	0	0	.	.	.
ADP1.159	0	0	.	.	.
ADP1.16	0	0	.	.	.
ADP1.160	0	0	.	.	.
ADP1.161	0	0	.	.	.
ADP1.162	0	0	.	.	.
ADP1.163	0	0	.	.	.
ADP1.164	0	0	.	.	.
ADP1.165	0	0	.	.	.
ADP1.166	0	0	.	.	.
ADP1.167	0	0	.	.	.
ADP1.168	0	0	.	.	.
ADP1.169	0	0	.	.	.
ADP1.17	0	0	.	.	.
ADP1.170	0	0	.	.	.
ADP1.171	0	0	.	.	.
ADP1.172	0	0	.	.	.
ADP1.173	0	0	.	.	.
ADP1.18	0	0	.	.	.
ADP1.19	0	0	.	.	.
ADP1.2	0	0	.	.	.
ADP1.20	0	0	.	.	.
ADP1.21	0	0	.	.	.
ADP1.22	0	0	.	.	.
ADP1.23	0	0	.	.	.
ADP1.24	0	0	.	.	.
ADP1.25	0	0	.	.	.
ADP1.26	0	0	.	.	.
ADP1.27	0	0	.	.	.
ADP1.28	0	0	.	.	.
ADP1.29	0	0	.	.	.
ADP1.3	0	0	.	.	.
ADP1.30	0	0	.	.	.
ADP1.31	0	0	.	.	.
ADP1.32	0	0	.	.	.
ADP1.33	0	0	.	.	.
ADP1.34	0	0	.	.	.
ADP1.35	0	0	.	.	.
ADP1.36	0	0	.	.	.
ADP1.37	0	0	.	.	.
ADP1.38	0	0	.	.	.
ADP1.39	0	0	.	.	.
ADP1.4	0	0	.	.	.
ADP1.40	0	0	.	.	.
ADP1.41	0	0	.	.	.
ADP1.42	0	0	.	.	.
ADP1.43	0	0	.	.	.
ADP1.44	0	0	.	.	.
ADP1.45	0	0	.	.	.
ADP1.46	0	0	.	.	.
ADP1.47	0	0	.	.	.
ADP1.48	0	0	.	.	.
ADP1.49	0	0	.	.	.
ADP1.5	0	0	.	.	.
ADP1.50	0	0	.	.	.
ADP1.51	0	0	.	.	.
ADP1.52	0	0	.	.	.
ADP1.53	0	0	.	.	.
ADP1.54	0	0	.	.	.
ADP1.55	0	0	.	.	.
ADP1.56	0	0	.	.	.
ADP1.57	0	0	.	.	.
ADP1.58	0	0	.	.	.
ADP1.59	0	0	.	.	.
ADP1.6	0	0	.	.	.
ADP1.60	0	0	.	.	.
ADP1.61	0	0	.	.	.
ADP1.62	0	0	.	.	.
ADP1.63	0	0	.	.	.
ADP1.64	0	0	.	.	.
ADP1.65	0	0	.	.	.
ADP1.66	0	0	.	.	.
ADP1.67	0	0	.	.	.
ADP1.68	0	0	.	.	.
ADP1.69	0	0	.	.	.
ADP1.7	0	0	.	.	.
ADP1.70	0	0	.	.	.
ADP1.71	0	0	.	.	.
ADP1.72	0	0	.	.	.
ADP1.73	0	0	.	.	.
ADP1.74	0	0	.	.	.
ADP1.75	0	0	.	.	.
ADP1.76	0	0	.	.	.
ADP1.77	0	0	.	.	.
ADP1.78	0	0	.	.	.
ADP1.79	0	0	.	.	.
ADP1.8	0	0	.	.	.
ADP1.80	0	0	.	.	.
ADP1.81	0	0	.	.	.
ADP1.82	0	0	.	.	.
ADP1.83	0	0	.	.	.
ADP1.84	0	0	.	.	.
ADP1.85	0	0	.	.	.
ADP1.86	0	0	.	.	.
ADP1.87	0	0	.	.	.
ADP1.88	0	0	.	.	.
ADP1.89	0	0	.	.	.
ADP1.9	0	0	.	.	.
ADP1.90	0	0	.	.	.
ADP1.91	0	0	.	.	.
ADP1.92	0	0	.	.	.
ADP1.93	0	0	.	.	.
ADP1.94	0	0	.	.	.
ADP1.95	0	0	.	.	.
ADP1.96	0	0	.	.	.
ADP1.97	0	0	.	.	.
ADP1.98	0	0	.	.	.
ADP1.99	0	0	.	.	.
MPIb.1	0	0	.	.	.
MPIb.10	0	0	.	.	.
MPIb.100	0	0	.	.	.
MPIb.101	0	0	.	.	.
MPIb.102	0	0	.	.	.
MPIb.103	0	0	.	.	.
MPIb.104	0	0	.	.	.
MPIb.105	0	0	.	.	.
MPIb.106	0	0	.	.	.
MPIb.107	0	0	.	.	.
MPIb.108	0	0	.	.	.
MPIb.109	0	0	.	.	.
MPIb.11	0	0	.	.	.
MPIb.110	0	0	.	.	.
MPIb.111	0	0	.	.	.
MPIb.112	0	0	.	.	.
MPIb.113	0	0	.	.	.
MPIb.114	0	0	.	.	.
MPIb.115	0	0	.	.	.
MPIb.116	0	0	.	.	.
MPIb.117	0	0	.	.	.
MPIb.118	0	0	.	.	.
MPIb.119	0	0	.	.	.
MPIb.12	0	0	.	.	.
MPIb.120	0	0	.	.	.
MPIb.121	0	0	.	.	.
MPIb.122	0	0	.	.	.
MPIb.123	0	0	.	.	.
MPIb.124	0	0	.	.	.
MPIb.125	0	0	.	.	.
MPIb.126	0	0	.	.	.
MPIb.127	0	0	.	.	.
MPIb.128	0	0	.	.	.
MPIb.129	0	0	.	.	.
MPIb.13	0	0	.	.	.
MPIb.130	0	0	.	.	.
MPIb.131	0	0	.	.	.
MPIb.132	0	0	.	.	.
MPIb.133	0	0	.	.	.
MPIb.134	0	0	.	.	.
MPIb.135	0	0	.	.	.
MPIb.136	0	0	.	.	.
MPIb.137	0	0	.	.	.
MPIb.138	0	0	.	.	.
MPIb.139	0	0	.	.	.
MPIb.14	0	0	.	.	.
MPIb.140	0	0	.	.	.
MPIb.141	0	0	.	.	.
MPIb.142	0	0	.	.	.
MPIb.143	0	0	.	.	.
MPIb.144	0	0	.	.	.
MPIb.145	0	0	.	.	.
MPIb.146	0	0	.	.	.
MPIb.147	0	0	.	.	.
MPIb.148	0	0	.	.	.
MPIb.149	0	0	.	.	.
MPIb.15	0	0	.	.	.
MPIb.150	0	0	.	.	.
MPIb.151	0	0	.	.	.
MPIb.152	0	0	.	.	.
MPIb.153	0	0	.	.	.
MPIb.154	0	0	.	.	.
MPIb.155	0	0	.	.	.
MPIb.156	0	0	.	.	.
MPIb.157	0	0	.	.	.
MPIb.158	0	0	.	.	.
MPIb.159	0	0	.	.	.
MPIb.16	0	0	.	.	.
MPIb.160	0	0	.	.	.
MPIb.161	0	0	.	.	.
MPIb.162	0	0	.	.	.
MPIb.163	0	0	.	.	.
MPIb.164	0	0	.	.	.
MPIb.165	0	0	.	.	.
MPIb.166	0	0	.	.	.
MPIb.167	0	0	.	.	.
MPIb.168	0	0	.	.	.
MPIb.169	0	0	.	.	.
MPIb.17	0	0	.	.	.
MPIb.170	0	0	.	.	.
MPIb.171	0	0	.	.	.
MPIb.172	0	0	.	.	.
MPIb.173	0	0	.	.	.
MPIb.174	0	0	.	.	.
MPIb.175	0	0	.	.	.
MPIb.18	0	0	.	.	.
MPIb.19	0	0	.	.	.
MPIb.2	0	0	.	.	.
MPIb.20	0	0	.	.	.
MPIb.21	0	0	.	.	.
MPIb.22	0	0	.	.	.
MPIb.23	0	0	.	.	.
MPIb.24	0	0	.	.	.
MPIb.25	0	0	.	.	.
MPIb.26	0	0	.	.	.
MPIb.27	0	0	.	.	.
MPIb.28	0	0	.	.	.
MPIb.29	0	0	.	.	.
MPIb.3	0	0	.	.	.
MPIb.30	0	0	.	.	.
MPIb.31	0	0	.	.	.
MPIb.32	0	0	.	.	.
MPIb.33	0	0	.	.	.
MPIb.34	0	0	.	.	.
MPIb.35	0	0	.	.	.
MPIb.36	0	0	.	.	.
MPIb.37	0	0	.	.	.
MPIb.38	0	0	.	.	.
MPIb.39	0	0	.	.	.
MPIb.4	0	0	.	.	.
MPIb.40	0	0	.	.	.
MPIb.41	0	0	.	.	.
MPIb.42	0	0	.	.	.
MPIb.43	0	0	.	.	.
MPIb.44	0	0	.	.	.
MPIb.45	0	0	.	.	.
MPIb.46	0	0	.	.	.
MPIb.47	0	0	.	.	.
MPIb.48	0	0	.	.	.
MPIb.49	0	0	.	.	.
MPIb.5	0	0	.	.	.
MPIb.50	0	0	.	.	.
MPIb.51	0	0	.	.	.
MPIb.52	0	0	.	.	.
MPIb.53	0	0	.	.	.
MPIb.54	0	0	.	.	.
MPIb.55	0	0	.	.	.
MPIb.56	0	0	.	.	.
MPIb.57	0	0	.	.	.
MPIb.58	0	0	.	.	.
MPIb.59	0	0	.	.	.
MPIb.6	0	0	.	.	.
MPIb.60	0	0	.	.	.
MPIb.61	0	0	.	.	.
MPIb.62	0	0	.	.	.
MPIb.63	0	0	.	.	.
MPIb.64	0	0	.	.	.
MPIb.65	0	0	.	.	.
MPIb.66	0	0	.	.	.
MPIb.67	0	0	.	.	.
MPIb.68	0	0	.	.	.
MPIb.69	0	0	.	.	.
MPIb.7	0	0	.	.	.
MPIb.70	0	0	.	.	.
MPIb.71	0	0	.	.	.
MPIb.72	0	0	.	.	.
MPIb.73	0	0	.	.	.
MPIb.74	0	0	.	.	.
MPIb.75	0	0	.	.	.
MPIb.76	0	0	.	.	.
MPIb.77	0	0	.	.	.
MPIb.78	0	0	.	.	.
MPIb.79	0	0	.	.	.
MPIb.8	0	0	.	.	.
MPIb.80	0	0	.	.	.
MPIb.81	0	0	.	.	.
MPIb.82	0	0	.	.	.
MPIb.83	0	0	.	.	.
MPIb.84	0	0	.	.	.
MPIb.85	0	0	.	.	.
MPIb.86	0	0	.	.	.
MPIb.87	0	0	.	.	.
MPIb.88	0	0	.	.	.
MPIb.89	0	0	.	.	.
MPIb.9	0	0	.	.	.
MPIb.90	0	0	.	.	.
MPIb.91	0	0	.	.	.
MPIb.92	0	0	.	.	.
MPIb.93	0	0	.	.	.
MPIb.94	0	0	.	.	.
MPIb.95	0	0	.	.	.
MPIb.96	0	0	.	.	.
MPIb.97	0	0	.	.	.
MPIb.98	0	0	.	.	.
MPIb.99	0	0	.	.	.
SYA1.1	0	0	.	.	.
SYA1.10	0	0	.	.	.
SYA1.100	0	0	.	.	.
SYA1.101	0	0	.	.	.
SYA1.102	0	0	.	.	.
SYA1.103	0	0	.	.	.
SYA1.104	0	0	.	.	.
SYA1.105	0	0	.	.	.
SYA1.106	0	0	.	.	.
SYA1.107	0	0	.	.	.
SYA1.108	0	0	.	.	.
SYA1.109	0	0	.	.	.
SYA1.11	0	0	.	.	.
SYA1.110	0	0	.	.	.
SYA1.111	0	0	.	.	.
SYA1.112	0	0	.	.	.
SYA1.113	0	0	.	.	.
SYA1.114	0	0	.	.	.
SYA1.115	0	0	.	.	.
SYA1.116	0	0	.	.	.
SYA1.117	0	0	.	.	.
SYA1.118	0	0	.	.	.
SYA1.119	0	0	.	.	.
SYA1.12	0	0	.	.	.
SYA1.120	0	0	.	.	.
SYA1.121	0	0	.	.	.
SYA1.122	0	0	.	.	.
SYA1.123	0	0	.	.	.
SYA1.124	0	0	.	.	.
SYA1.125	0	0	.	.	.
SYA1.126	0	0	.	.	.
SYA1.127	0	0	.	.	.
SYA1.128	0	0	.	.	.
SYA1.129	0	0	.	.	.
SYA1.13	0	0	.	.	.
SYA1.130	0	0	.	.	.
SYA1.131	0	0	.	.	.
SYA1.132	0	0	.	.	.
SYA1.133	0	0	.	.	.
SYA1.134	0	0	.	.	.
SYA1.135	0	0	.	.	.
SYA1.136	0	0	.	.	.
SYA1.137	0	0	.	.	.
SYA1.138	0	0	.	.	.
SYA1.139	0	0	.	.	.
SYA1.14	0	0	.	.	.
SYA1.140	0	0	.	.	.
SYA1.141	0	0	.	.	.
SYA1.142	0	0	.	.	.
SYA1.143	0	0	.	.	.
SYA1.144	0	0	.	.	.
SYA1.145	0	0	.	.	.
SYA1.146	0	0	.	.	.
SYA1.147	0	0	.	.	.
SYA1.148	0	0	.	.	.
SYA1.149	0	0	.	.	.
SYA1.15	0	0	.	.	.
SYA1.150	0	0	.	.	.
SYA1.151	0	0	.	.	.
SYA1.152	0	0	.	.	.
SYA1.153	0	0	.	.	.
SYA1.154	0	0	.	.	.
SYA1.155	0	0	.	.	.
SYA1.156	0	0	.	.	.
SYA1.157	0	0	.	.	.
SYA1.158	0	0	.	.	.
SYA1.159	0	0	.	.	.
SYA1.16	0	0	.	.	.
SYA1.160	0	0	.	.	.
SYA1.161	0	0	.	.	.
SYA1.162	0	0	.	.	.
SYA1.163	0	0	.	.	.
SYA1.164	0	0	.	.	.
SYA1.165	0	0	.	.	.
SYA1.166	0	0	.	.	.
SYA1.167	0	0	.	.	.
SYA1.168	0	0	.	.	.
SYA1.169	0	0	.	.	.
SYA1.17	0	0	.	.	.
SYA1.170	0	0	.	.	.
SYA1.171	0	0	.	.	.
SYA1.172	0	0	.	.	.
SYA1.173	0	0	.	.	.
SYA1.174	0	0	.	.	.
SYA1.175	0	0	.	.	.
SYA1.176	0	0	.	.	.
SYA1.177	0	0	.	.	.
SYA1.178	0	0	.	.	.
SYA1.179	0	0	.	.	.
SYA1.18	0	0	.	.	.
SYA1.180	0	0	.	.	.
SYA1.181	0	0	.	.	.
SYA1.182	0	0	.	.	.
SYA1.183	0	0	.	.	.
SYA1.184	0	0	.	.	.
SYA1.185	0	0	.	.	.
SYA1.186	0	0	.	.	.
SYA1.187	0	0	.	.	.
SYA1.188	0	0	.	.	.
SYA1.189	0	0	.	.	.
SYA1.19	0	0	.	.	.
SYA1.190	0	0	.	.	.
SYA1.191	0	0	.	.	.
SYA1.192	0	0	.	.	.
SYA1.193	0	0	.	.	.
SYA1.194	0	0	.	.	.
SYA1.195	0	0	.	.	.
SYA1.196	0	0	.	.	.
SYA1.197	0	0	.	.	.
SYA1.198	0	0	.	.	.
SYA1.199	0	0	.	.	.
SYA1.2	0	0	.	.	.
SYA1.20	0	0	.	.	.
SYA1.200	0	0	.	.	.
SYA1.201	0	0	.	.	.
SYA1.202	0	0	.	.	.
SYA1.203	0	0	.	.	.
SYA1.204	0	0	.	.	.
SYA1.205	0	0	.	.	.
SYA1.206	0	0	.	.	.
SYA1.207	0	0	.	.	.
SYA1.208	0	0	.	.	.
SYA1.209	0	0	.	.	.
SYA1.21	0	0	.	.	.
SYA1.210	0	0	.	.	.
SYA1.211	0	0	.	.	.
SYA1.212	0	0	.	.	.
SYA1.213	0	0	.	.	.
SYA1.214	0	0	.	.	.
SYA1.215	0	0	.	.	.
SYA1.216	0	0	.	.	.
SYA1.217	0	0	.	.	.
SYA1.218	0	0	.	.	.
SYA1.219	0	0	.	.	.
SYA1.22	0	0	.	.	.
SYA1.220	0	0	.	.	.
SYA1.221	0	0	.	.	.
SYA1.222	0	0	.	.	.
SYA1.223	0	0	.	.	.
SYA1.224	0	0	.	.	.
SYA1.225	0	0	.	.	.
SYA1.226	0	0	.	.	.
SYA1.227	0	0	.	.	.
SYA1.228	0	0	.	.	.
SYA1.229	0	0	.	.	.
SYA1.23	0	0	.	.	.
SYA1.230	0	0	.	.	.
SYA1.231	0	0	.	.	.
SYA1.232	0	0	.	.	.
SYA1.233	0	0	.	.	.
SYA1.234	0	0	.	.	.
SYA1.235	0	0	.	.	.
SYA1.236	0	0	.	.	.
SYA1.237	0	0	.	.	.
SYA1.238	0	0	.	.	.
SYA1.239	0	0	.	.	.
SYA1.24	0	0	.	.	.
SYA1.25	0	0	.	.	.
SYA1.26	0	0	.	.	.
SYA1.27	0	0	.	.	.
SYA1.28	0	0	.	.	.
SYA1.29	0	0	.	.	.
SYA1.3	0	0	.	.	.
SYA1.30	0	0	.	.	.
SYA1.31	0	0	.	.	.
SYA1.32	0	0	.	.	.
SYA1.33	0	0	.	.	.
SYA1.34	0	0	.	.	.
SYA1.35	0	0	.	.	.
SYA1.36	0	0	.	.	.
SYA1.37	0	0	.	.	.
SYA1.38	0	0	.	.	.
SYA1.39	0	0	.	.	.
SYA1.4	0	0	.	.	.
SYA1.40	0	0	.	.	.
SYA1.41	0	0	.	.	.
SYA1.42	0	0	.	.	.
SYA1.43	0	0	.	.	.
SYA1.44	0	0	.	.	.
SYA1.45	0	0	.	.	.
SYA1.46	0	0	.	.	.
SYA1.47	0	0	.	.	.
SYA1.48	0	0	.	.	.
SYA1.49	0	0	.	.	.
SYA1.5	0	0	.	.	.
SYA1.50	0	0	.	.	.
SYA1.51	0	0	.	.	.
SYA1.52	0	0	.	.	.
SYA1.53	0	0	.	.	.
SYA1.54	0	0	.	.	.
SYA1.55	0	0	.	.	.
SYA1.56	0	0	.	.	.
SYA1.57	0	0	.	.	.
SYA1.58	0	0	.	.	.
SYA1.59	0	0	.	.	.
SYA1.6	0	0	.	.	.
SYA1.60	0	0	.	.	.
SYA1.61	0	0	.	.	.
SYA1.62	0	0	.	.	.
SYA1.63	0	0	.	.	.
SYA1.64	0	0	.	.	.
SYA1.65	0	0	.	.	.
SYA1.66	0	0	.	.	.
SYA1.67	0	0	.	.	.
SYA1.68	0	0	.	.	.
SYA1.69	0	0	.	.	.
SYA1.7	0	0	.	.	.
SYA1.70	0	0	.	.	.
SYA1.71	0	0	.	.	.
SYA1.72	0	0	.	.	.
SYA1.73	0	0	.	.	.
SYA1.74	0	0	.	.	.
SYA1.75	0	0	.	.	.
SYA1.76	0	0	.	.	.
SYA1.77	0	0	.	.	.
SYA1.78	0	0	.	.	.
SYA1.79	0	0	.	.	.
SYA1.8	0	0	.	.	.
SYA1.80	0	0	.	.	.
SYA1.81	0	0	.	.	.
SYA1.82	0	0	.	.	.
SYA1.83	0	0	.	.	.
SYA1.84	0	0	.	.	.
SYA1.85	0	0	.	.	.
SYA1.86	0	0	.	.	.
SYA1.87	0	0	.	.	.
SYA1.88	0	0	.	.	.
SYA1.89	0	0	.	.	.
SYA1.9	0	0	.	.	.
SYA1.90	0	0	.	.	.
SYA1.91	0	0	.	.	.
SYA1.92	0	0	.	.	.
SYA1.93	0	0	.	.	.
SYA1.94	0	0	.	.	.
SYA1.95	0	0	.	.	.
SYA1.96	0	0	.	.	.
SYA1.97	0	0	.	.	.
SYA1.98	0	0	.	.	.
SYA1.99	0	0	.	.	.
VPS13.1	0	0	.	.	.
VPS13.10	0	0	.	.	.
VPS13.100	0	0	.	.	.
VPS13.101	0	0	.	.	.
VPS13.102	0	0	.	.	.
VPS13.103	0	0	.	.	.
VPS13.104	0	0	.	.	.
VPS13.105	0	0	.	.	.
VPS13.106	0	0	.	.	.
VPS13.107	0	0	.	.	.
VPS13.108	0	0	.	.	.
VPS13.109	0	0	.	.	.
VPS13.11	0	0	.	.	.
VPS13.110	0	0	.	.	.
VPS13.111	0	0	.	.	.
VPS13.112	0	0	.	.	.
VPS13.113	0	0	.	.	.
VPS13.114	0	0	.	.	.
VPS13.115	0	0	.	.	.
VPS13.116	0	0	.	.	.
VPS13.117	0	0	.	.	.
VPS13.118	0	0	.	.	.
VPS13.119	0	0	.	.	.
VPS13.12	0	0	.	.	.
VPS13.120	0	0	.	.	.
VPS13.121	0	0	.	.	.
VPS13.122	0	0	.	.	.
VPS13.123	0	0	.	.	.
VPS13.124	0	0	.	.	.
VPS13.125	0	0	.	.	.
VPS13.126	0	0	.	.	.
VPS13.127	0	0	.	.	.
VPS13.128	0	0	.	.	.
VPS13.129	0	0	.	.	.
VPS13.13	0	0	.	.	.
VPS13.130	0	0	.	.	.
VPS13.131	0	0	.	.	.
VPS13.132	0	0	.	.	.
VPS13.133	0	0	.	.	.
VPS13.134	0	0	.	.	.
VPS13.135	0	0	.	.	.
VPS13.136	0	0	.	.	.
VPS13.137	0	0	.	.	.
VPS13.138	0	0	.	.	.
VPS13.139	0	0	.	.	.
VPS13.14	0	0	.	.	.
VPS13.140	0	0	.	.	.
VPS13.141	0	0	.	.	.
VPS13.142	0	0	.	.	.
VPS13.143	0	0	.	.	.
VPS13.144	0	0	.	.	.
VPS13.145	0	0	.	.	.
VPS13.146	0	0	.	.	.
VPS13.147	0	0	.	.	.
VPS13.148	0	0	.	.	.
VPS13.149	0	0	.	.	.
VPS13.15	0	0	.	.	.
VPS13.150	0	0	.	.	.
VPS13.151	0	0	.	.	.
VPS13.152	0	0	.	.	.
VPS13.153	0	0	.	.	.
VPS13.154	0	0	.	.	.
VPS13.155	0	0	.	.	.
VPS13.156	0	0	.	.	.
VPS13.157	0	0	.	.	.
VPS13.158	0	0	.	.	.
VPS13.159	0	0	.	.	.
VPS13.16	0	0	.	.	.
VPS13.160	0	0	.	.	.
VPS13.161	0	0	.	.	.
VPS13.162	0	0	.	.	.
VPS13.163	0	0	.	.	.
VPS13.164	0	0	.	.	.
VPS13.165	0	0	.	.	.
VPS13.166	0	0	.	.	.
VPS13.167	0	0	.	.	.
VPS13.168	0	0	.	.	.
VPS13.169	0	0	.	.	.
VPS13.17	0	0	.	.	.
VPS13.170	0	0	.	.	.
VPS13.171	0	0	.	.	.
VPS13.172	0	0	.	.	.
VPS13.173	0	0	.	.	.
VPS13.174	0	0	.	.	.
VPS13.175	0	0	.	.	.
VPS13.176	0	0	.	.	.
VPS13.177	0	0	.	.	.
VPS13.178	0	0	.	.	.
VPS13.179	0	0	.	.	.
VPS13.18	0	0	.	.	.
VPS13.180	0	0	.	.	.
VPS13.181	0	0	.	.	.
VPS13.182	0	0	.	.	.
VPS13.183	0	0	.	.	.
VPS13.184	0	0	.	.	.
VPS13.185	0	0	.	.	.
VPS13.186	0	0	.	.	.
VPS13.187	0	0	.	.	.
VPS13.188	0	0	.	.	.
VPS13.189	0	0	.	.	.
VPS13.19	0	0	.	.	.
VPS13.190	0	0	.	.	.
VPS13.191	0	0	.	.	.
VPS13.192	0	0	.	.	.
VPS13.193	0	0	.	.	.
VPS13.194	0	0	.	.	.
VPS13.195	0	0	.	.	.
VPS13.196	0	0	.	.	.
VPS13.197	0	0	.	.	.
VPS13.198	0	0	.	.	.
VPS13.199	0	0	.	.	.
VPS13.2	0	0	.	.	.
VPS13.20	0	0	.	.	.
VPS13.200	0	0	.	.	.
VPS13.201	0	0	.	.	.
VPS13.202	0	0	.	.	.
VPS13.203	0	0	.	.	.
VPS13.204	0	0	.	.	.
VPS13.205	0	0	.	.	.
VPS13.206	0	0	.	.	.
VPS13.207	0	0	.	.	.
VPS13.208	0	0	.	.	.
VPS13.209	0	0	.	.	.
VPS13.21	0	0	.	.	.
VPS13.210	0	0	.	.	.
VPS13.211	0	0	.	.	.
VPS13.212	0	0	.	.	.
VPS13.213	0	0	.	.	.
VPS13.214	0	0	.	.	.
VPS13.215	0	0	.	.	.
VPS13.216	0	0	.	.	.
VPS13.217	0	0	.	.	.
VPS13.218	0	0	.	.	.
VPS13.219	0	0	.	.	.
VPS13.22	0	0	.	.	.
VPS13.220	0	0	.	.	.
VPS13.221	0	0	.	.	.
VPS13.222	0	0	.	.	.
VPS13.223	0	0	.	.	.
VPS13.224	0	0	.	.	.
VPS13.225	0	0	.	.	.
VPS13.226	0	0	.	.	.
VPS13.227	0	0	.	.	.
VPS13.228	0	0	.	.	.
VPS13.229	0	0	.	.	.
VPS13.23	0	0	.	.	.
VPS13.230	0	0	.	.	.
VPS13.231	0	0	.	.	.
VPS13.232	0	0	.	.	.
VPS13.233	0	0	.	.	.
VPS13.234	0	0	.	.	.
VPS13.235	0	0	.	.	.
VPS13.236	0	0	.	.	.
VPS13.237	0	0	.	.	.
VPS13.238	0	0	.	.	.
VPS13.239	0	0	.	.	.
VPS13.24	0	0	.	.	.
VPS13.240	0	0	.	.	.
VPS13.241	0	0	.	.	.
VPS13.242	0	0	.	.	.
VPS13.243	0	0	.	.	.
VPS13.244	0	0	.	.	.
VPS13.245	0	0	.	.	.
VPS13.246	0	0	.	.	.
VPS13.247	0	0	.	.	.
VPS13.248	0	0	.	.	.
VPS13.249	0	0	.	.	.
VPS13.25	0	0	.	.	.
VPS13.250	0	0	.	.	.
VPS13.251	0	0	.	.	.
VPS13.252	0	0	.	.	.
VPS13.253	0	0	.	.	.
VPS13.254	0	0	.	.	.
VPS13.255	0	0	.	.	.
VPS13.256	0	0	.	.	.
VPS13.257	0	0	.	.	.
VPS13.258	0	0	.	.	.
VPS13.259	0	0	.	.	.
VPS13.26	0	0	.	.	.
VPS13.260	0	0	.	.	.
VPS13.261	0	0	.	.	.
VPS13.262	0	0	.	.	.
VPS13.263	0	0	.	.	.
VPS13.264	0	0	.	.	.
VPS13.265	0	0	.	.	.
VPS13.266	0	0	.	.	.
VPS13.267	0	0	.	.	.
VPS13.268	0	0	.	.	.
VPS13.269	0	0	.	.	.
VPS13.27	0	0	.	.	.
VPS13.270	0	0	.	.	.
VPS13.271	0	0	.	.	.
VPS13.272	0	0	.	.	.
VPS13.273	0	0	.	.	.
VPS13.274	0	0	.	.	.
VPS13.275	0	0	.	.	.
VPS13.276	0	0	.	.	.
VPS13.277	0	0	.	.	.
VPS13.278	0	0	.	.	.
VPS13.279	0	0	.	.	.
VPS13.28	0	0	.	.	.
VPS13.280	0	0	.	.	.
VPS13.281	0	0	.	.	.
VPS13.282	0	0	.	.	.
VPS13.283	0	0	.	.	.
VPS13.284	0	0	.	.	.
VPS13.285	0	0	.	.	.
VPS13.286	0	0	.	.	.
VPS13.287	0	0	.	.	.
VPS13.288	0	0	.	.	.
VPS13.289	0	0	.	.	.
VPS13.29	0	0	.	.	.
VPS13.290	0	0	.	.	.
VPS13.291	0	0	.	.	.
VPS13.292	0	0	.	.	.
VPS13.293	0	0	.	.	.
VPS13.294	0	0	.	.	.
VPS13.295	0	0	.	.	.
VPS13.296	0	0	.	.	.
VPS13.297	0	0	.	.	.
VPS13.298	0	0	.	.	.
VPS13.299	0	0	.	.	.
VPS13.3	0	0	.	.	.
VPS13.30	0	0	.	.	.
VPS13.300	0	0	.	.	.
VPS13.301	0	0	.	.	.
VPS13.302	0	0	.	.	.
VPS13.303	0	0	.	.	.
VPS13.304	0	0	.	.	.
VPS13.305	0	0	.	.	.
VPS13.306	0	0	.	.	.
VPS13.307	0	0	.	.	.
VPS13.308	0	0	.	.	.
VPS13.309	0	0	.	.	.
VPS13.31	0	0	.	.	.
VPS13.32	0	0	.	.	.
VPS13.33	0	0	.	.	.
VPS13.34	0	0	.	.	.
VPS13.35	0	0	.	.	.
VPS13.36	0	0	.	.	.
VPS13.37	0	0	.	.	.
VPS13.38	0	0	.	.	.
VPS13.39	0	0	.	.	.
VPS13.4	0	0	.	.	.
VPS13.40	0	0	.	.	.
VPS13.41	0	0	.	.	.
VPS13.42	0	0	.	.	.
VPS13.43	0	0	.	.	.
VPS13.44	0	0	.	.	.
VPS13.45	0	0	.	.	.
VPS13.46	0	0	.	.	.
VPS13.47	0	0	.	.	.
VPS13.48	0	0	.	.	.
VPS13.49	0	0	.	.	.
VPS13.5	0	0	.	.	.
VPS13.50	0	0	.	.	.
VPS13.51	0	0	.	.	.
VPS13.52	0	0	.	.	.
VPS13.53	0	0	.	.	.
VPS13.54	0	0	.	.	.
VPS13.55	0	0	.	.	.
VPS13.56	0	0	.	.	.
VPS13.57	0	0	.	.	.
VPS13.58	0	0	.	.	.
VPS13.59	0	0	.	.	.
VPS13.6	0	0	.	.	.
VPS13.60	0	0	.	.	.
VPS13.61	0	0	.	.	.
VPS13.62	0	0	.	.	.
VPS13.63	0	0	.	.	.
VPS13.64	0	0	.	.	.
VPS13.65	0	0	.	.	.
VPS13.66	0	0	.	.	.
VPS13.67	0	0	.	.	.
VPS13.68	0	0	.	.	.
VPS13.69	0	0	.	.	.
VPS13.7	0	0	.	.	.
VPS13.70	0	0	.	.	.
VPS13.71	0	0	.	.	.
VPS13.72	0	0	.	.	.
VPS13.73	0	0	.	.	.
VPS13.74	0	0	.	.	.
VPS13.75	0	0	.	.	.
VPS13.76	0	0	.	.	.
VPS13.77	0	0	.	.	.
VPS13.78	0	0	.	.	.
VPS13.79	0	0	.	.	.
VPS13.8	0	0	.	.	.
VPS13.80	0	0	.	.	.
VPS13.81	0	0	.	.	.
VPS13.82	0	0	.	.	.
VPS13.83	0	0	.	.	.
VPS13.84	0	0	.	.	.
VPS13.85	0	0	.	.	.
VPS13.86	0	0	.	.	.
VPS13.87	0	0	.	.	.
VPS13.88	0	0	.	.	.
VPS13.89	0	0	.	.	.
VPS13.9	0	0	.	.	.
VPS13.90	0	0	.	.	.
VPS13.91	0	0	.	.	.
VPS13.92	0	0	.	.	.
VPS13.93	0	0	.	.	.
VPS13.94	0	0	.	.	.
VPS13.95	0	0	.	.	.
VPS13.96	0	0	.	.	.
VPS13.97	0	0	.	.	.
VPS13.98	0	0	.	.	.
VPS13.99	0	0	.	.	.
ZWF1b.1	0	0	.	.	.
ZWF1b.10	0	0	.	.	.
ZWF1b.100	0	0	.	.	.
ZWF1b.101	0	0	.	.	.
ZWF1b.102	0	0	.	.	.
ZWF1b.103	0	0	.	.	.
ZWF1b.104	0	0	.	.	.
ZWF1b.105	0	0	.	.	.
ZWF1b.106	0	0	.	.	.
ZWF1b.107	0	0	.	.	.
ZWF1b.108	0	0	.	.	.
ZWF1b.109	0	0	.	.	.
ZWF1b.11	0	0	.	.	.
ZWF1b.110	0	0	.	.	.
ZWF1b.111	0	0	.	.	.
ZWF1b.112	0	0	.	.	.
ZWF1b.113	0	0	.	.	.
ZWF1b.114	0	0	.	.	.
ZWF1b.115	0	0	.	.	.
ZWF1b.116	0	0	.	.	.
ZWF1b.117	0	0	.	.	.
ZWF1b.118	0	0	.	.	.
ZWF1b.119	0	0	.	.	.
ZWF1b.12	0	0	.	.	.
ZWF1b.120	0	0	.	.	.
ZWF1b.121	0	0	.	.	.
ZWF1b.122	0	0	.	.	.
ZWF1b.123	0	0	.	.	.
ZWF1b.124	0	0	.	.	.
ZWF1b.125	0	0	.	.	.
ZWF1b.126	0	0	.	.	.
ZWF1b.127	0	0	.	.	.
ZWF1b.128	0	0	.	.	.
ZWF1b.129	0	0	.	.	.
ZWF1b.13	0	0	.	.	.
ZWF1b.130	0	0	.	.	.
ZWF1b.131	0	0	.	.	.
ZWF1b.132	0	0	.	.	.
ZWF1b.133	0	0	.	.	.
ZWF1b.134	0	0	.	.	.
ZWF1b.135	0	0	.	.	.
ZWF1b.136	0	0	.	.	.
ZWF1b.137	0	0	.	.	.
ZWF1b.138	0	0	.	.	.
ZWF1b.139	0	0	.	.	.
ZWF1b.14	0	0	.	.	.
ZWF1b.140	0	0	.	.	.
ZWF1b.141	0	0	.	.	.
ZWF1b.142	0	0	.	.	.
ZWF1b.143	0	0	.	.	.
ZWF1b.144	0	0	.	.	.
ZWF1b.145	0	0	.	.	.
ZWF1b.146	0	0	.	.	.
ZWF1b.147	0	0	.	.	.
ZWF1b.148	0	0	.	.	.
ZWF1b.149	0	0	.	.	.
ZWF1b.15	0	0	.	.	.
ZWF1b.150	0	0	.	.	.
ZWF1b.151	0	0	.	.	.
ZWF1b.152	0	0	.	.	.
ZWF1b.153	0	0	.	.	.
ZWF1b.154	0	0	.	.	.
ZWF1b.155	0	0	.	.	.
ZWF1b.156	0	0	.	.	.
ZWF1b.157	0	0	.	.	.
ZWF1b.158	0	0	.	.	.
ZWF1b.159	0	0	.	.	.
ZWF1b.16	0	0	.	.	.
ZWF1b.160	0	0	.	.	.
ZWF1b.161	0	0	.	.	.
ZWF1b.162	0	0	.	.	.
ZWF1b.163	0	0	.	.	.
ZWF1b.164	0	0	.	.	.
ZWF1b.165	0	0	.	.	.
ZWF1b.166	0	0	.	.	.
ZWF1b.167	0	0	.	.	.
ZWF1b.168	0	0	.	.	.
ZWF1b.169	0	0	.	.	.
ZWF1b.17	0	0	.	.	.
ZWF1b.170	0	0	.	.	.
ZWF1b.171	0	0	.	.	.
ZWF1b.172	0	0	.	.	.
ZWF1b.173	0	0	.	.	.
ZWF1b.174	0	0	.	.	.
ZWF1b.175	0	0	.	.	.
ZWF1b.176	0	0	.	.	.
ZWF1b.177	0	0	.	.	.
ZWF1b.178	0	0	.	.	.
ZWF1b.179	0	0	.	.	.
ZWF1b.18	0	0	.	.	.
ZWF1b.180	0	0	.	.	.
ZWF1b.181	0	0	.	.	.
ZWF1b.182	0	0	.	.	.
ZWF1b.183	0	0	.	.	.
ZWF1b.184	0	0	.	.	.
ZWF1b.185	0	0	.	.	.
ZWF1b.186	0	0	.	.	.
ZWF1b.187	0	0	.	.	.
ZWF1b.188	0	0	.	.	.
ZWF1b.189	0	0	.	.	.
ZWF1b.19	0	0	.	.	.
ZWF1b.190	0	0	.	.	.
ZWF1b.191	0	0	.	.	.
ZWF1b.192	0	0	.	.	.
ZWF1b.193	0	0	.	.	.
ZWF1b.194	0	0	.	.	.
ZWF1b.195	0	0	.	.	.
ZWF1b.196	0	0	.	.	.
ZWF1b.197	0	0	.	.	.
ZWF1b.198	0	0	.	.	.
ZWF1b.199	0	0	.	.	.
ZWF1b.2	0	0	.	.	.
ZWF1b.20	0	0	.	.	.
ZWF1b.200	0	0	.	.	.
ZWF1b.201	0	0	.	.	.
ZWF1b.202	0	0	.	.	.
ZWF1b.203	0	0	.	.	.
ZWF1b.204	0	0	.	.	.
ZWF1b.205	0	0	.	.	.
ZWF1b.206	0	0	.	.	.
ZWF1b.207	0	0	.	.	.
ZWF1b.208	0	0	.	.	.
ZWF1b.209	0	0	.	.	.
ZWF1b.21	0	0	.	.	.
ZWF1b.210	0	0	.	.	.
ZWF1b.211	0	0	.	.	.
ZWF1b.212	0	0	.	.	.
ZWF1b.213	0	0	.	.	.
ZWF1b.214	0	0	.	.	.
ZWF1b.215	0	0	.	.	.
ZWF1b.216	0	0	.	.	.
ZWF1b.217	0	0	.	.	.
ZWF1b.218	0	0	.	.	.
ZWF1b.219	0	0	.	.	.
ZWF1b.22	0	0	.	.	.
ZWF1b.220	0	0	.	.	.
ZWF1b.221	0	0	.	.	.
ZWF1b.222	0	0	.	.	.
ZWF1b.223	0	0	.	.	.
ZWF1b.224	0	0	.	.	.
ZWF1b.225	0	0	.	.	.
ZWF1b.226	0	0	.	.	.
ZWF1b.227	0	0	.	.	.
ZWF1b.228	0	0	.	.	.
ZWF1b.229	0	0	.	.	.
ZWF1b.23	0	0	.	.	.
ZWF1b.230	0	0	.	.	.
ZWF1b.231	0	0	.	.	.
ZWF1b.232	0	0	.	.	.
ZWF1b.233	0	0	.	.	.
ZWF1b.234	0	0	.	.	.
ZWF1b.235	0	0	.	.	.
ZWF1b.236	0	0	.	.	.
ZWF1b.237	0	0	.	.	.
ZWF1b.238	0	0	.	.	.
ZWF1b.239	0	0	.	.	.
ZWF1b.24	0	0	.	.	.
ZWF1b.240	0	0	.	.	.
ZWF1b.241	0	0	.	.	.
ZWF1b.242	0	0	.	.	.
ZWF1b.243	0	0	.	.	.
ZWF1b.244	0	0	.	.	.
ZWF1b.245	0	0	.	.	.
ZWF1b.246	0	0	.	.	.
ZWF1b.247	0	0	.	.	.
ZWF1b.248	0	0	.	.	.
ZWF1b.249	0	0	.	.	.
ZWF1b.25	0	0	.	.	.
ZWF1b.250	0	0	.	.	.
ZWF1b.251	0	0	.	.	.
ZWF1b.252	0	0	.	.	.
ZWF1b.253	0	0	.	.	.
ZWF1b.254	0	0	.	.	.
ZWF1b.255	0	0	.	.	.
ZWF1b.256	0	0	.	.	.
ZWF1b.257	0	0	.	.	.
ZWF1b.258	0	0	.	.	.
ZWF1b.259	0	0	.	.	.
ZWF1b.26	0	0	.	.	.
ZWF1b.260	0	0	.	.	.
ZWF1b.261	0	0	.	.	.
ZWF1b.262	0	0	.	.	.
ZWF1b.263	0	0	.	.	.
ZWF1b.264	0	0	.	.	.
ZWF1b.265	0	0	.	.	.
ZWF1b.266	0	0	.	.	.
ZWF1b.267	0	0	.	.	.
ZWF1b.268	0	0	.	.	.
ZWF1b.269	0	0	.	.	.
ZWF1b.27	0	0	.	.	.
ZWF1b.270	0	0	.	.	.
ZWF1b.271	0	0	.	.	.
ZWF1b.272	0	0	.	.	.
ZWF1b.273	0	0	.	.	.
ZWF1b.274	0	0	.	.	.
ZWF1b.275	0	0	.	.	.
ZWF1b.276	0	0	.	.	.
ZWF1b.277	0	0	.	.	.
ZWF1b.278	0	0	.	.	.
ZWF1b.279	0	0	.	.	.
ZWF1b.28	0	0	.	.	.
ZWF1b.280	0	0	.	.	.
ZWF1b.281	0	0	.	.	.
ZWF1b.282	0	0	.	.	.
ZWF1b.283	0	0	.	.	.
ZWF1b.284	0	0	.	.	.
ZWF1b.285	0	0	.	.	.
ZWF1b.286	0	0	.	.	.
ZWF1b.287	0	0	.	.	.
ZWF1b.288	0	0	.	.	.
ZWF1b.289	0	0	.	.	.
ZWF1b.29	0	0	.	.	.
ZWF1b.290	0	0	.	.	.
ZWF1b.291	0	0	.	.	.
ZWF1b.292	0	0	.	.	.
ZWF1b.293	0	0	.	.	.
ZWF1b.294	0	0	.	.	.
ZWF1b.295	0	0	.	.	.
ZWF1b.296	0	0	.	.	.
ZWF1b.297	0	0	.	.	.
ZWF1b.3	0	0	.	.	.
ZWF1b.30	0	0	.	.	.
ZWF1b.31	0	0	.	.	.
ZWF1b.32	0	0	.	.	.
ZWF1b.33	0	0	.	.	.
ZWF1b.34	0	0	.	.	.
ZWF1b.35	0	0	.	.	.
ZWF1b.36	0	0	.	.	.
ZWF1b.37	0	0	.	.	.
ZWF1b.38	0	0	.	.	.
ZWF1b.39	0	0	.	.	.
ZWF1b.4	0	0	.	.	.
ZWF1b.40	0	0	.	.	.
ZWF1b.41	0	0	.	.	.
ZWF1b.42	0	0	.	.	.
ZWF1b.43	0	0	.	.	.
ZWF1b.44	0	0	.	.	.
ZWF1b.45	0	0	.	.	.
ZWF1b.46	0	0	.	.	.
ZWF1b.47	0	0	.	.	.
ZWF1b.48	0	0	.	.	.
ZWF1b.49	0	0	.	.	.
ZWF1b.5	0	0	.	.	.
ZWF1b.50	0	0	.	.	.
ZWF1b.51	0	0	.	.	.
ZWF1b.52	0	0	.	.	.
ZWF1b.53	0	0	.	.	.
ZWF1b.54	0	0	.	.	.
ZWF1b.55	0	0	.	.	.
ZWF1b.56	0	0	.	.	.
ZWF1b.57	0	0	.	.	.
ZWF1b.58	0	0	.	.	.
ZWF1b.59	0	0	.	.	.
ZWF1b.6	0	0	.	.	.
ZWF1b.60	0	0	.	.	.
ZWF1b.61	0	0	.	.	.
ZWF1b.62	0	0	.	.	.
ZWF1b.63	0	0	.	.	.
ZWF1b.64	0	0	.	.	.
ZWF1b.65	0	0	.	.	.
ZWF1b.66	0	0	.	.	.
ZWF1b.67	0	0	.	.	.
ZWF1b.68	0	0	.	.	.
ZWF1b.69	0	0	.	.	.
ZWF1b.7	0	0	.	.	.
ZWF1b.70	0	0	.	.	.
ZWF1b.71	0	0	.	.	.
ZWF1b.72	0	0	.	.	.
ZWF1b.73	0	0	.	.	.
ZWF1b.74	0	0	.	.	.
ZWF1b.75	0	0	.	.	.
ZWF1b.76	0	0	.	.	.
ZWF1b.77	0	0	.	.	.
ZWF1b.78	0	0	.	.	.
ZWF1b.79	0	0	.	.	.
ZWF1b.8	0	0	.	.	.
ZWF1b.80	0	0	.	.	.
ZWF1b.81	0	0	.	.	.
ZWF1b.82	0	0	.	.	.
ZWF1b.83	0	0	.	.	.
ZWF1b.84	0	0	.	.	.
ZWF1b.85	0	0	.	.	.
ZWF1b.86	0	0	.	.	.
ZWF1b.87	0	0	.	.	.
ZWF1b.88	0	0	.	.	.
ZWF1b.89	0	0	.	.	.
ZWF1b.9	0	0	.	.	.
ZWF1b.90	0	0	.	.	.
ZWF1b.91	0	0	.	.	.
ZWF1b.92	0	0	.	.	.
ZWF1b.93	0	0	.	.	.
ZWF1b.94	0	0	.	.	.
ZWF1b.95	0	0	.	.	.
ZWF1b.96	0	0	.	.	.
ZWF1b.97	0	0	.	.	.
ZWF1b.98	0	0	.	.	.
ZWF1b.99	0	0	.	.	.
