aroE.1	aroE.10	aroE.11	aroE.12	aroE.13	aroE.14	aroE.15	aroE.16	aroE.17	aroE.18	aroE.19	aroE.2	aroE.20	aroE.21	aroE.22	aroE.23	aroE.24	aroE.25	aroE.26	aroE.27	aroE.28	aroE.29	aroE.3	aroE.30	aroE.31	aroE.32	aroE.33	aroE.34	aroE.35	aroE.36	aroE.37	aroE.38	aroE.39	aroE.4	aroE.40	aroE.41	aroE.42	aroE.43	aroE.44	aroE.45	aroE.46	aroE.47	aroE.48	aroE.49	aroE.5	aroE.50	aroE.51	aroE.52	aroE.53	aroE.54	aroE.55	aroE.56	aroE.57	aroE.58	aroE.59	aroE.6	aroE.60	aroE.61	aroE.62	aroE.63	aroE.64	aroE.65	aroE.66	aroE.67	aroE.68	aroE.69	aroE.7	aroE.70	aroE.71	aroE.72	aroE.73	aroE.74	aroE.8	aroE.9
ddl.1	ddl.10	ddl.11	ddl.12	ddl.13	ddl.14	ddl.15	ddl.16	ddl.17	ddl.18	ddl.19	ddl.2	ddl.20	ddl.21	ddl.22	ddl.23	ddl.24	ddl.25	ddl.26	ddl.27	ddl.28	ddl.29	ddl.3	ddl.30	ddl.31	ddl.32	ddl.33	ddl.34	ddl.35	ddl.36	ddl.37	ddl.38	ddl.39	ddl.4	ddl.40	ddl.41	ddl.42	ddl.43	ddl.44	ddl.5	ddl.6	ddl.7	ddl.8	ddl.9
gdh.1	gdh.10	gdh.11	gdh.12	gdh.13	gdh.14	gdh.15	gdh.16	gdh.17	gdh.18	gdh.19	gdh.2	gdh.20	gdh.21	gdh.22	gdh.23	gdh.24	gdh.25	gdh.26	gdh.27	gdh.28	gdh.29	gdh.3	gdh.30	gdh.31	gdh.32	gdh.33	gdh.34	gdh.35	gdh.36	gdh.37	gdh.38	gdh.39	gdh.4	gdh.40	gdh.41	gdh.42	gdh.5	gdh.6	gdh.7	gdh.8	gdh.9
gki.1	gki.10	gki.11	gki.12	gki.13	gki.14	gki.15	gki.16	gki.17	gki.18	gki.19	gki.2	gki.20	gki.21	gki.22	gki.23	gki.24	gki.25	gki.26	gki.27	gki.28	gki.29	gki.3	gki.30	gki.31	gki.32	gki.33	gki.34	gki.35	gki.36	gki.37	gki.38	gki.39	gki.4	gki.5	gki.6	gki.7	gki.8	gki.9
hexB.1	hexB.10	hexB.11	hexB.12	hexB.13	hexB.14	hexB.15	hexB.16	hexB.17	hexB.18	hexB.19	hexB.2	hexB.20	hexB.21	hexB.22	hexB.23	hexB.24	hexB.25	hexB.26	hexB.27	hexB.28	hexB.29	hexB.3	hexB.30	hexB.31	hexB.32	hexB.33	hexB.34	hexB.35	hexB.36	hexB.37	hexB.38	hexB.39	hexB.4	hexB.40	hexB.41	hexB.5	hexB.6	hexB.7	hexB.8	hexB.9
recP.1	recP.10	recP.11	recP.12	recP.13	recP.14	recP.15	recP.16	recP.17	recP.18	recP.19	recP.2	recP.20	recP.21	recP.22	recP.23	recP.24	recP.25	recP.26	recP.27	recP.28	recP.29	recP.3	recP.30	recP.31	recP.32	recP.33	recP.34	recP.35	recP.4	recP.5	recP.6	recP.7	recP.8	recP.9
xpt.1	xpt.10	xpt.11	xpt.12	xpt.13	xpt.14	xpt.15	xpt.16	xpt.17	xpt.18	xpt.19	xpt.2	xpt.20	xpt.21	xpt.22	xpt.23	xpt.24	xpt.25	xpt.26	xpt.27	xpt.28	xpt.29	xpt.3	xpt.30	xpt.31	xpt.32	xpt.33	xpt.34	xpt.35	xpt.36	xpt.37	xpt.38	xpt.4	xpt.5	xpt.6	xpt.7	xpt.8	xpt.9
