aroE	aroE.1	aroE.10	aroE.11	aroE.12	aroE.13	aroE.14	aroE.15	aroE.16	aroE.17	aroE.18	aroE.19	aroE.2	aroE.20	aroE.21	aroE.22	aroE.23	aroE.24	aroE.25	aroE.26	aroE.27	aroE.28	aroE.29	aroE.3	aroE.4	aroE.5	aroE.6	aroE.7	aroE.8	aroE.9
glgB	glgB.1	glgB.10	glgB.11	glgB.12	glgB.13	glgB.14	glgB.15	glgB.16	glgB.17	glgB.18	glgB.19	glgB.2	glgB.20	glgB.21	glgB.22	glgB.3	glgB.4	glgB.5	glgB.6	glgB.7	glgB.8	glgB.9
nifS	nifS.1	nifS.10	nifS.11	nifS.12	nifS.13	nifS.14	nifS.15	nifS.16	nifS.17	nifS.18	nifS.19	nifS.2	nifS.20	nifS.21	nifS.22	nifS.23	nifS.24	nifS.25	nifS.26	nifS.27	nifS.28	nifS.29	nifS.3	nifS.30	nifS.31	nifS.32	nifS.33	nifS.34	nifS.4	nifS.5	nifS.6	nifS.7	nifS.8	nifS.9
p20	p20.1	p20.10	p20.11	p20.12	p20.13	p20.14	p20.15	p20.16	p20.17	p20.18	p20.19	p20.2	p20.20	p20.21	p20.22	p20.23	p20.24	p20.25	p20.26	p20.27	p20.28	p20.29	p20.3	p20.30	p20.31	p20.32	p20.33	p20.4	p20.5	p20.6	p20.7	p20.8	p20.9
tkt	tkt.1	tkt.10	tkt.11	tkt.12	tkt.13	tkt.14	tkt.15	tkt.16	tkt.17	tkt.18	tkt.19	tkt.2	tkt.20	tkt.21	tkt.22	tkt.23	tkt.24	tkt.3	tkt.4	tkt.5	tkt.6	tkt.7	tkt.8	tkt.9
trpD	trpD.1	trpD.10	trpD.11	trpD.12	trpD.13	trpD.14	trpD.15	trpD.16	trpD.17	trpD.18	trpD.19	trpD.2	trpD.20	trpD.21	trpD.22	trpD.23	trpD.24	trpD.25	trpD.26	trpD.27	trpD.28	trpD.3	trpD.4	trpD.5	trpD.6	trpD.7	trpD.8	trpD.9
uvrA	uvrA.1	uvrA.10	uvrA.11	uvrA.12	uvrA.13	uvrA.14	uvrA.15	uvrA.16	uvrA.17	uvrA.18	uvrA.19	uvrA.2	uvrA.20	uvrA.21	uvrA.22	uvrA.23	uvrA.24	uvrA.25	uvrA.26	uvrA.27	uvrA.28	uvrA.29	uvrA.3	uvrA.30	uvrA.31	uvrA.4	uvrA.5	uvrA.6	uvrA.7	uvrA.8	uvrA.9
