atpA.1	0	0	.	.	.
atpA.10	0	0	.	.	.
atpA.11	0	0	.	.	.
atpA.13	0	0	.	.	.
atpA.14	0	0	.	.	.
atpA.15	0	0	.	.	.
atpA.16	0	0	.	.	.
atpA.17	0	0	.	.	.
atpA.18	0	0	.	.	.
atpA.19	0	0	.	.	.
atpA.2	0	0	.	.	.
atpA.20	0	0	.	.	.
atpA.24	0	0	.	.	.
atpA.25	0	0	.	.	.
atpA.26	0	0	.	.	.
atpA.28	0	0	.	.	.
atpA.29	0	0	.	.	.
atpA.3	0	0	.	.	.
atpA.30	0	0	.	.	.
atpA.33	0	0	.	.	.
atpA.37	0	0	.	.	.
atpA.4	0	0	.	.	.
atpA.40	0	0	.	.	.
atpA.42	0	0	.	.	.
atpA.43	0	0	.	.	.
atpA.44	0	0	.	.	.
atpA.50	0	0	.	.	.
atpA.51	0	0	.	.	.
atpA.53	0	0	.	.	.
atpA.54	0	0	.	.	.
atpA.55	0	0	.	.	.
atpA.57	0	0	.	.	.
atpA.59	0	0	.	.	.
atpA.60	0	0	.	.	.
atpA.61	0	0	.	.	.
atpA.62	0	0	.	.	.
atpA.63	0	0	.	.	.
atpA.64	0	0	.	.	.
atpA.65	0	0	.	.	.
atpA.66	0	0	.	.	.
atpA.67	0	0	.	.	.
atpA.68	0	0	.	.	.
atpA.7	0	0	.	.	.
atpA.76	0	0	.	.	.
atpA.77	0	0	.	.	.
atpA.78	0	0	.	.	.
atpA.79	0	0	.	.	.
atpA.80	0	0	.	.	.
atpA.81	0	0	.	.	.
atpA.9	0	0	.	.	.
dnaN.1	0	0	.	.	.
dnaN.101	0	0	.	.	.
dnaN.11	0	0	.	.	.
dnaN.13	0	0	.	.	.
dnaN.15	0	0	.	.	.
dnaN.16	0	0	.	.	.
dnaN.17	0	0	.	.	.
dnaN.19	0	0	.	.	.
dnaN.2	0	0	.	.	.
dnaN.20	0	0	.	.	.
dnaN.22	0	0	.	.	.
dnaN.23	0	0	.	.	.
dnaN.24	0	0	.	.	.
dnaN.25	0	0	.	.	.
dnaN.26	0	0	.	.	.
dnaN.27	0	0	.	.	.
dnaN.28	0	0	.	.	.
dnaN.29	0	0	.	.	.
dnaN.3	0	0	.	.	.
dnaN.30	0	0	.	.	.
dnaN.31	0	0	.	.	.
dnaN.34	0	0	.	.	.
dnaN.35	0	0	.	.	.
dnaN.36	0	0	.	.	.
dnaN.37	0	0	.	.	.
dnaN.38	0	0	.	.	.
dnaN.39	0	0	.	.	.
dnaN.40	0	0	.	.	.
dnaN.41	0	0	.	.	.
dnaN.42	0	0	.	.	.
dnaN.44	0	0	.	.	.
dnaN.48	0	0	.	.	.
dnaN.49	0	0	.	.	.
dnaN.5	0	0	.	.	.
dnaN.50	0	0	.	.	.
dnaN.51	0	0	.	.	.
dnaN.52	0	0	.	.	.
dnaN.53	0	0	.	.	.
dnaN.57	0	0	.	.	.
dnaN.6	0	0	.	.	.
dnaN.65	0	0	.	.	.
dnaN.66	0	0	.	.	.
dnaN.68	0	0	.	.	.
dnaN.7	0	0	.	.	.
dnaN.70	0	0	.	.	.
dnaN.73	0	0	.	.	.
dnaN.76	0	0	.	.	.
dnaN.77	0	0	.	.	.
dnaN.78	0	0	.	.	.
dnaN.79	0	0	.	.	.
dnaN.80	0	0	.	.	.
dnaN.81	0	0	.	.	.
dnaN.82	0	0	.	.	.
dnaN.83	0	0	.	.	.
dnaN.84	0	0	.	.	.
dnaN.85	0	0	.	.	.
dnaN.86	0	0	.	.	.
dnaN.87	0	0	.	.	.
dnaN.88	0	0	.	.	.
dnaN.89	0	0	.	.	.
dnaN.90	0	0	.	.	.
dnaN.91	0	0	.	.	.
dnaN.92	0	0	.	.	.
fumC.1	0	0	.	.	.
fumC.10	0	0	.	.	.
fumC.101	0	0	.	.	.
fumC.102	0	0	.	.	.
fumC.103	0	0	.	.	.
fumC.11	0	0	.	.	.
fumC.12	0	0	.	.	.
fumC.13	0	0	.	.	.
fumC.15	0	0	.	.	.
fumC.17	0	0	.	.	.
fumC.18	0	0	.	.	.
fumC.19	0	0	.	.	.
fumC.2	0	0	.	.	.
fumC.20	0	0	.	.	.
fumC.22	0	0	.	.	.
fumC.24	0	0	.	.	.
fumC.25	0	0	.	.	.
fumC.28	0	0	.	.	.
fumC.29	0	0	.	.	.
fumC.3	0	0	.	.	.
fumC.32	0	0	.	.	.
fumC.37	0	0	.	.	.
fumC.38	0	0	.	.	.
fumC.4	0	0	.	.	.
fumC.42	0	0	.	.	.
fumC.44	0	0	.	.	.
fumC.45	0	0	.	.	.
fumC.48	0	0	.	.	.
fumC.5	0	0	.	.	.
fumC.50	0	0	.	.	.
fumC.51	0	0	.	.	.
fumC.52	0	0	.	.	.
fumC.53	0	0	.	.	.
fumC.54	0	0	.	.	.
fumC.55	0	0	.	.	.
fumC.56	0	0	.	.	.
fumC.57	0	0	.	.	.
fumC.6	0	0	.	.	.
fumC.63	0	0	.	.	.
fumC.64	0	0	.	.	.
fumC.65	0	0	.	.	.
fumC.66	0	0	.	.	.
fumC.68	0	0	.	.	.
fumC.69	0	0	.	.	.
fumC.7	0	0	.	.	.
fumC.70	0	0	.	.	.
fumC.71	0	0	.	.	.
fumC.72	0	0	.	.	.
fumC.73	0	0	.	.	.
fumC.74	0	0	.	.	.
fumC.75	0	0	.	.	.
fumC.76	0	0	.	.	.
fumC.77	0	0	.	.	.
fumC.78	0	0	.	.	.
fumC.79	0	0	.	.	.
fumC.8	0	0	.	.	.
fumC.80	0	0	.	.	.
fumC.81	0	0	.	.	.
fumC.82	0	0	.	.	.
fumC.83	0	0	.	.	.
fumC.84	0	0	.	.	.
fumC.85	0	0	.	.	.
fumC.86	0	0	.	.	.
fumC.87	0	0	.	.	.
glyA.1	0	0	.	.	.
glyA.11	0	0	.	.	.
glyA.113	0	0	.	.	.
glyA.114	0	0	.	.	.
glyA.115	0	0	.	.	.
glyA.116	0	0	.	.	.
glyA.12	0	0	.	.	.
glyA.13	0	0	.	.	.
glyA.14	0	0	.	.	.
glyA.15	0	0	.	.	.
glyA.16	0	0	.	.	.
glyA.18	0	0	.	.	.
glyA.19	0	0	.	.	.
glyA.2	0	0	.	.	.
glyA.20	0	0	.	.	.
glyA.24	0	0	.	.	.
glyA.26	0	0	.	.	.
glyA.3	0	0	.	.	.
glyA.31	0	0	.	.	.
glyA.32	0	0	.	.	.
glyA.33	0	0	.	.	.
glyA.34	0	0	.	.	.
glyA.36	0	0	.	.	.
glyA.37	0	0	.	.	.
glyA.38	0	0	.	.	.
glyA.39	0	0	.	.	.
glyA.40	0	0	.	.	.
glyA.5	0	0	.	.	.
glyA.52	0	0	.	.	.
glyA.54	0	0	.	.	.
glyA.56	0	0	.	.	.
glyA.57	0	0	.	.	.
glyA.58	0	0	.	.	.
glyA.6	0	0	.	.	.
glyA.61	0	0	.	.	.
glyA.62	0	0	.	.	.
glyA.64	0	0	.	.	.
glyA.65	0	0	.	.	.
glyA.66	0	0	.	.	.
glyA.69	0	0	.	.	.
glyA.7	0	0	.	.	.
glyA.71	0	0	.	.	.
glyA.75	0	0	.	.	.
glyA.77	0	0	.	.	.
glyA.78	0	0	.	.	.
glyA.79	0	0	.	.	.
glyA.8	0	0	.	.	.
glyA.80	0	0	.	.	.
glyA.81	0	0	.	.	.
glyA.82	0	0	.	.	.
glyA.83	0	0	.	.	.
glyA.84	0	0	.	.	.
glyA.85	0	0	.	.	.
glyA.86	0	0	.	.	.
glyA.87	0	0	.	.	.
glyA.88	0	0	.	.	.
glyA.89	0	0	.	.	.
glyA.9	0	0	.	.	.
glyA.90	0	0	.	.	.
glyA.91	0	0	.	.	.
glyA.92	0	0	.	.	.
glyA.93	0	0	.	.	.
glyA.94	0	0	.	.	.
glyA.95	0	0	.	.	.
glyA.96	0	0	.	.	.
glyA.97	0	0	.	.	.
glyA.98	0	0	.	.	.
mdh.1	0	0	.	.	.
mdh.13	0	0	.	.	.
mdh.15	0	0	.	.	.
mdh.16	0	0	.	.	.
mdh.17	0	0	.	.	.
mdh.18	0	0	.	.	.
mdh.2	0	0	.	.	.
mdh.21	0	0	.	.	.
mdh.25	0	0	.	.	.
mdh.3	0	0	.	.	.
mdh.30	0	0	.	.	.
mdh.32	0	0	.	.	.
mdh.37	0	0	.	.	.
mdh.38	0	0	.	.	.
mdh.39	0	0	.	.	.
mdh.4	0	0	.	.	.
mdh.41	0	0	.	.	.
mdh.42	0	0	.	.	.
mdh.47	0	0	.	.	.
mdh.5	0	0	.	.	.
mdh.50	0	0	.	.	.
mdh.51	0	0	.	.	.
mdh.52	0	0	.	.	.
mdh.53	0	0	.	.	.
mdh.54	0	0	.	.	.
mdh.55	0	0	.	.	.
mdh.56	0	0	.	.	.
mdh.57	0	0	.	.	.
mdh.58	0	0	.	.	.
mdh.59	0	0	.	.	.
mdh.60	0	0	.	.	.
mdh.62	0	0	.	.	.
mdh.63	0	0	.	.	.
mdh.64	0	0	.	.	.
mdh.65	0	0	.	.	.
mdh.66	0	0	.	.	.
mdh.67	0	0	.	.	.
mdh.68	0	0	.	.	.
mdh.69	0	0	.	.	.
mdh.7	0	0	.	.	.
mdh.8	0	0	.	.	.
mdh.9	0	0	.	.	.
pheS.1	0	0	.	.	.
pheS.10	0	0	.	.	.
pheS.101	0	0	.	.	.
pheS.102	0	0	.	.	.
pheS.103	0	0	.	.	.
pheS.104	0	0	.	.	.
pheS.105	0	0	.	.	.
pheS.106	0	0	.	.	.
pheS.107	0	0	.	.	.
pheS.108	0	0	.	.	.
pheS.109	0	0	.	.	.
pheS.11	0	0	.	.	.
pheS.110	0	0	.	.	.
pheS.111	0	0	.	.	.
pheS.112	0	0	.	.	.
pheS.113	0	0	.	.	.
pheS.114	0	0	.	.	.
pheS.115	0	0	.	.	.
pheS.116	0	0	.	.	.
pheS.117	0	0	.	.	.
pheS.118	0	0	.	.	.
pheS.119	0	0	.	.	.
pheS.12	0	0	.	.	.
pheS.120	0	0	.	.	.
pheS.121	0	0	.	.	.
pheS.122	0	0	.	.	.
pheS.123	0	0	.	.	.
pheS.13	0	0	.	.	.
pheS.138	0	0	.	.	.
pheS.139	0	0	.	.	.
pheS.14	0	0	.	.	.
pheS.140	0	0	.	.	.
pheS.141	0	0	.	.	.
pheS.142	0	0	.	.	.
pheS.143	0	0	.	.	.
pheS.144	0	0	.	.	.
pheS.145	0	0	.	.	.
pheS.146	0	0	.	.	.
pheS.147	0	0	.	.	.
pheS.148	0	0	.	.	.
pheS.149	0	0	.	.	.
pheS.15	0	0	.	.	.
pheS.152	0	0	.	.	.
pheS.153	0	0	.	.	.
pheS.154	0	0	.	.	.
pheS.155	0	0	.	.	.
pheS.156	0	0	.	.	.
pheS.17	0	0	.	.	.
pheS.2	0	0	.	.	.
pheS.21	0	0	.	.	.
pheS.22	0	0	.	.	.
pheS.23	0	0	.	.	.
pheS.27	0	0	.	.	.
pheS.29	0	0	.	.	.
pheS.3	0	0	.	.	.
pheS.30	0	0	.	.	.
pheS.31	0	0	.	.	.
pheS.33	0	0	.	.	.
pheS.34	0	0	.	.	.
pheS.35	0	0	.	.	.
pheS.36	0	0	.	.	.
pheS.38	0	0	.	.	.
pheS.39	0	0	.	.	.
pheS.40	0	0	.	.	.
pheS.41	0	0	.	.	.
pheS.42	0	0	.	.	.
pheS.43	0	0	.	.	.
pheS.44	0	0	.	.	.
pheS.45	0	0	.	.	.
pheS.47	0	0	.	.	.
pheS.49	0	0	.	.	.
pheS.5	0	0	.	.	.
pheS.50	0	0	.	.	.
pheS.52	0	0	.	.	.
pheS.53	0	0	.	.	.
pheS.55	0	0	.	.	.
pheS.56	0	0	.	.	.
pheS.57	0	0	.	.	.
pheS.58	0	0	.	.	.
pheS.6	0	0	.	.	.
pheS.60	0	0	.	.	.
pheS.62	0	0	.	.	.
pheS.63	0	0	.	.	.
pheS.7	0	0	.	.	.
pheS.71	0	0	.	.	.
pheS.73	0	0	.	.	.
pheS.75	0	0	.	.	.
pheS.76	0	0	.	.	.
pheS.77	0	0	.	.	.
pheS.78	0	0	.	.	.
pheS.79	0	0	.	.	.
pheS.8	0	0	.	.	.
pheS.81	0	0	.	.	.
pheS.82	0	0	.	.	.
pheS.83	0	0	.	.	.
pheS.84	0	0	.	.	.
pheS.85	0	0	.	.	.
pheS.86	0	0	.	.	.
pheS.89	0	0	.	.	.
pheS.9	0	0	.	.	.
pheS.90	0	0	.	.	.
pheS.93	0	0	.	.	.
pheS.95	0	0	.	.	.
pheS.98	0	0	.	.	.
pheS.99	0	0	.	.	.
sucA.1	0	0	.	.	.
sucA.10	0	0	.	.	.
sucA.100	0	0	.	.	.
sucA.101	0	0	.	.	.
sucA.102	0	0	.	.	.
sucA.103	0	0	.	.	.
sucA.104	0	0	.	.	.
sucA.105	0	0	.	.	.
sucA.106	0	0	.	.	.
sucA.107	0	0	.	.	.
sucA.108	0	0	.	.	.
sucA.109	0	0	.	.	.
sucA.11	0	0	.	.	.
sucA.110	0	0	.	.	.
sucA.111	0	0	.	.	.
sucA.112	0	0	.	.	.
sucA.113	0	0	.	.	.
sucA.114	0	0	.	.	.
sucA.115	0	0	.	.	.
sucA.116	0	0	.	.	.
sucA.130	0	0	.	.	.
sucA.131	0	0	.	.	.
sucA.132	0	0	.	.	.
sucA.133	0	0	.	.	.
sucA.134	0	0	.	.	.
sucA.136	0	0	.	.	.
sucA.137	0	0	.	.	.
sucA.15	0	0	.	.	.
sucA.17	0	0	.	.	.
sucA.18	0	0	.	.	.
sucA.2	0	0	.	.	.
sucA.20	0	0	.	.	.
sucA.23	0	0	.	.	.
sucA.24	0	0	.	.	.
sucA.26	0	0	.	.	.
sucA.27	0	0	.	.	.
sucA.3	0	0	.	.	.
sucA.30	0	0	.	.	.
sucA.31	0	0	.	.	.
sucA.36	0	0	.	.	.
sucA.37	0	0	.	.	.
sucA.38	0	0	.	.	.
sucA.39	0	0	.	.	.
sucA.4	0	0	.	.	.
sucA.40	0	0	.	.	.
sucA.41	0	0	.	.	.
sucA.43	0	0	.	.	.
sucA.44	0	0	.	.	.
sucA.45	0	0	.	.	.
sucA.46	0	0	.	.	.
sucA.47	0	0	.	.	.
sucA.48	0	0	.	.	.
sucA.49	0	0	.	.	.
sucA.5	0	0	.	.	.
sucA.54	0	0	.	.	.
sucA.55	0	0	.	.	.
sucA.59	0	0	.	.	.
sucA.6	0	0	.	.	.
sucA.63	0	0	.	.	.
sucA.66	0	0	.	.	.
sucA.68	0	0	.	.	.
sucA.7	0	0	.	.	.
sucA.73	0	0	.	.	.
sucA.75	0	0	.	.	.
sucA.77	0	0	.	.	.
sucA.8	0	0	.	.	.
sucA.82	0	0	.	.	.
sucA.83	0	0	.	.	.
sucA.88	0	0	.	.	.
sucA.89	0	0	.	.	.
sucA.9	0	0	.	.	.
sucA.90	0	0	.	.	.
sucA.91	0	0	.	.	.
sucA.92	0	0	.	.	.
sucA.94	0	0	.	.	.
sucA.95	0	0	.	.	.
sucA.96	0	0	.	.	.
sucA.97	0	0	.	.	.
sucA.98	0	0	.	.	.
sucA.99	0	0	.	.	.
