aroE.1	aroE.2	aroE.3	aroE.4	aroE.5	aroE.6	aroE.7	aroE.8	aroE.9
dat.1	dat.2	dat.3	dat.4	dat.5	dat.6	dat.7	dat.8	dat.9
ddl.1	ddl.10	ddl.2	ddl.3	ddl.4	ddl.5	ddl.6	ddl.7	ddl.8	ddl.9
gmk.1	gmk.2	gmk.3	gmk.4	gmk.5	gmk.6
ldh.1	ldh.10	ldh.11	ldh.2	ldh.3	ldh.4	ldh.5	ldh.6	ldh.7	ldh.8	ldh.9
recA.1	recA.2	recA.3	recA.4	recA.5	recA.6
yqiL.1	yqiL.10	yqiL.11	yqiL.12	yqiL.2	yqiL.3	yqiL.4	yqiL.5	yqiL.6	yqiL.7	yqiL.8	yqiL.9
