ack	ack.1	ack.10	ack.11	ack.12	ack.13	ack.14	ack.15	ack.16	ack.17	ack.18	ack.19	ack.2	ack.20	ack.21	ack.22	ack.23	ack.24	ack.25	ack.26	ack.27	ack.28	ack.29	ack.3	ack.30	ack.31	ack.32	ack.33	ack.34	ack.4	ack.5	ack.6	ack.7	ack.8	ack.9
cpn60	cpn60.1	cpn60.10	cpn60.11	cpn60.12	cpn60.13	cpn60.14	cpn60.15	cpn60.16	cpn60.17	cpn60.18	cpn60.19	cpn60.2	cpn60.20	cpn60.21	cpn60.22	cpn60.3	cpn60.4	cpn60.5	cpn60.6	cpn60.7	cpn60.8	cpn60.9
fdh	fdh.1	fdh.10	fdh.11	fdh.12	fdh.13	fdh.14	fdh.15	fdh.16	fdh.17	fdh.18	fdh.19	fdh.2	fdh.20	fdh.21	fdh.22	fdh.23	fdh.24	fdh.25	fdh.26	fdh.27	fdh.28	fdh.29	fdh.3	fdh.4	fdh.5	fdh.6	fdh.7	fdh.8	fdh.9
pta	pta.1	pta.10	pta.11	pta.12	pta.13	pta.14	pta.15	pta.16	pta.17	pta.18	pta.19	pta.2	pta.20	pta.21	pta.3	pta.4	pta.5	pta.6	pta.7	pta.8	pta.9
purA	purA.1	purA.10	purA.11	purA.12	purA.13	purA.14	purA.15	purA.16	purA.17	purA.18	purA.2	purA.3	purA.4	purA.5	purA.6	purA.7	purA.8	purA.9
sar	sar.1	sar.10	sar.11	sar.12	sar.13	sar.14	sar.15	sar.16	sar.17	sar.2	sar.3	sar.4	sar.5	sar.6	sar.7	sar.8	sar.9
tuf	tuf.1	tuf.10	tuf.11	tuf.12	tuf.13	tuf.14	tuf.2	tuf.3	tuf.4	tuf.5	tuf.6	tuf.7	tuf.8	tuf.9
