ftsQ	ftsQ.1	ftsQ.10	ftsQ.11	ftsQ.12	ftsQ.13	ftsQ.14	ftsQ.15	ftsQ.16	ftsQ.17	ftsQ.18	ftsQ.19	ftsQ.2	ftsQ.20	ftsQ.21	ftsQ.22	ftsQ.23	ftsQ.24	ftsQ.25	ftsQ.26	ftsQ.27	ftsQ.28	ftsQ.29	ftsQ.3	ftsQ.30	ftsQ.31	ftsQ.32	ftsQ.33	ftsQ.34	ftsQ.35	ftsQ.36	ftsQ.37	ftsQ.38	ftsQ.39	ftsQ.4	ftsQ.40	ftsQ.5	ftsQ.6	ftsQ.7	ftsQ.8	ftsQ.9
gpdxJ	gpdxJ.1	gpdxJ.10	gpdxJ.11	gpdxJ.12	gpdxJ.13	gpdxJ.14	gpdxJ.15	gpdxJ.16	gpdxJ.17	gpdxJ.18	gpdxJ.19	gpdxJ.2	gpdxJ.20	gpdxJ.21	gpdxJ.22	gpdxJ.23	gpdxJ.24	gpdxJ.25	gpdxJ.26	gpdxJ.27	gpdxJ.28	gpdxJ.29	gpdxJ.3	gpdxJ.30	gpdxJ.31	gpdxJ.32	gpdxJ.33	gpdxJ.34	gpdxJ.35	gpdxJ.36	gpdxJ.37	gpdxJ.4	gpdxJ.5	gpdxJ.6	gpdxJ.7	gpdxJ.8	gpdxJ.9
hagB	hagB.1	hagB.10	hagB.11	hagB.12	hagB.13	hagB.14	hagB.15	hagB.16	hagB.17	hagB.18	hagB.19	hagB.2	hagB.20	hagB.21	hagB.22	hagB.23	hagB.24	hagB.25	hagB.26	hagB.27	hagB.28	hagB.29	hagB.3	hagB.30	hagB.31	hagB.32	hagB.33	hagB.34	hagB.35	hagB.36	hagB.37	hagB.4	hagB.5	hagB.6	hagB.7	hagB.8	hagB.9
mcmA	mcmA.1	mcmA.10	mcmA.11	mcmA.12	mcmA.13	mcmA.14	mcmA.15	mcmA.16	mcmA.17	mcmA.18	mcmA.19	mcmA.2	mcmA.20	mcmA.21	mcmA.22	mcmA.23	mcmA.24	mcmA.25	mcmA.26	mcmA.27	mcmA.28	mcmA.29	mcmA.3	mcmA.30	mcmA.4	mcmA.5	mcmA.6	mcmA.7	mcmA.8	mcmA.9
pepO	pepO.1	pepO.10	pepO.11	pepO.12	pepO.13	pepO.14	pepO.15	pepO.16	pepO.17	pepO.18	pepO.19	pepO.2	pepO.20	pepO.21	pepO.22	pepO.23	pepO.24	pepO.25	pepO.26	pepO.27	pepO.28	pepO.29	pepO.3	pepO.30	pepO.31	pepO.32	pepO.33	pepO.34	pepO.35	pepO.36	pepO.37	pepO.4	pepO.5	pepO.6	pepO.7	pepO.8	pepO.9
pga	pga.1	pga.10	pga.11	pga.12	pga.13	pga.14	pga.15	pga.16	pga.17	pga.18	pga.19	pga.2	pga.20	pga.21	pga.22	pga.23	pga.24	pga.25	pga.26	pga.27	pga.3	pga.4	pga.5	pga.6	pga.7	pga.8	pga.9
recA	recA.1	recA.10	recA.11	recA.12	recA.13	recA.14	recA.2	recA.3	recA.4	recA.5	recA.6	recA.7	recA.8	recA.9
