glpF.1	glpF.2	glpF.3	glpF.4	glpF.5	glpF.6	glpF.7	glpF.8
sigF.1	sigF.2	sigF.3	sigF.4	sigF.5
glpT.1	glpT.2	glpT.3	glpT.4	glpT.5
Natrans.1	Natrans.2	Natrans.3	Natrans.4	Natrans.5	Natrans.6	Natrans.7
rpoB.1	rpoB.2	rpoB.3	rpoB.4	rpoB.5	rpoB.6	rpoB.7
ftsA.1	ftsA.2	ftsA.3	ftsA.4	ftsA.5
clpC.1	clpC.2	clpC.3	clpC.4	clpC.5	clpC.6
