Cln_aspA	Cln_aspA.1	Cln_aspA.10	Cln_aspA.11	Cln_aspA.12	Cln_aspA.13	Cln_aspA.14	Cln_aspA.15	Cln_aspA.16	Cln_aspA.17	Cln_aspA.18	Cln_aspA.19	Cln_aspA.2	Cln_aspA.20	Cln_aspA.21	Cln_aspA.22	Cln_aspA.23	Cln_aspA.24	Cln_aspA.25	Cln_aspA.26	Cln_aspA.27	Cln_aspA.28	Cln_aspA.29	Cln_aspA.3	Cln_aspA.30	Cln_aspA.31	Cln_aspA.32	Cln_aspA.33	Cln_aspA.34	Cln_aspA.35	Cln_aspA.36	Cln_aspA.37	Cln_aspA.38	Cln_aspA.39	Cln_aspA.4	Cln_aspA.40	Cln_aspA.41	Cln_aspA.42	Cln_aspA.43	Cln_aspA.44	Cln_aspA.45	Cln_aspA.46	Cln_aspA.47	Cln_aspA.48	Cln_aspA.49	Cln_aspA.5	Cln_aspA.50	Cln_aspA.51	Cln_aspA.52	Cln_aspA.53	Cln_aspA.54	Cln_aspA.55	Cln_aspA.56	Cln_aspA.57	Cln_aspA.58	Cln_aspA.59	Cln_aspA.6	Cln_aspA.60	Cln_aspA.61	Cln_aspA.62	Cln_aspA.63	Cln_aspA.64	Cln_aspA.65	Cln_aspA.66	Cln_aspA.67	Cln_aspA.68	Cln_aspA.69	Cln_aspA.7	Cln_aspA.70	Cln_aspA.71	Cln_aspA.72	Cln_aspA.73	Cln_aspA.74	Cln_aspA.75	Cln_aspA.76	Cln_aspA.77	Cln_aspA.78	Cln_aspA.79	Cln_aspA.8	Cln_aspA.80	Cln_aspA.81	Cln_aspA.82	Cln_aspA.9
Cln_atpA	Cln_atpA.1	Cln_atpA.10	Cln_atpA.11	Cln_atpA.12	Cln_atpA.13	Cln_atpA.14	Cln_atpA.15	Cln_atpA.16	Cln_atpA.17	Cln_atpA.18	Cln_atpA.19	Cln_atpA.2	Cln_atpA.20	Cln_atpA.21	Cln_atpA.22	Cln_atpA.23	Cln_atpA.24	Cln_atpA.25	Cln_atpA.26	Cln_atpA.27	Cln_atpA.28	Cln_atpA.29	Cln_atpA.3	Cln_atpA.30	Cln_atpA.31	Cln_atpA.32	Cln_atpA.33	Cln_atpA.34	Cln_atpA.35	Cln_atpA.36	Cln_atpA.37	Cln_atpA.38	Cln_atpA.39	Cln_atpA.4	Cln_atpA.40	Cln_atpA.41	Cln_atpA.42	Cln_atpA.43	Cln_atpA.44	Cln_atpA.45	Cln_atpA.46	Cln_atpA.47	Cln_atpA.48	Cln_atpA.49	Cln_atpA.5	Cln_atpA.50	Cln_atpA.51	Cln_atpA.52	Cln_atpA.53	Cln_atpA.54	Cln_atpA.55	Cln_atpA.56	Cln_atpA.57	Cln_atpA.58	Cln_atpA.59	Cln_atpA.6	Cln_atpA.60	Cln_atpA.61	Cln_atpA.62	Cln_atpA.63	Cln_atpA.64	Cln_atpA.7	Cln_atpA.8	Cln_atpA.9
Cln_glnA	Cln_glnA.1	Cln_glnA.10	Cln_glnA.11	Cln_glnA.12	Cln_glnA.13	Cln_glnA.14	Cln_glnA.15	Cln_glnA.16	Cln_glnA.17	Cln_glnA.18	Cln_glnA.19	Cln_glnA.2	Cln_glnA.20	Cln_glnA.21	Cln_glnA.22	Cln_glnA.23	Cln_glnA.24	Cln_glnA.25	Cln_glnA.26	Cln_glnA.27	Cln_glnA.28	Cln_glnA.29	Cln_glnA.3	Cln_glnA.30	Cln_glnA.31	Cln_glnA.32	Cln_glnA.33	Cln_glnA.34	Cln_glnA.35	Cln_glnA.36	Cln_glnA.37	Cln_glnA.38	Cln_glnA.39	Cln_glnA.4	Cln_glnA.40	Cln_glnA.41	Cln_glnA.42	Cln_glnA.43	Cln_glnA.44	Cln_glnA.45	Cln_glnA.46	Cln_glnA.47	Cln_glnA.48	Cln_glnA.49	Cln_glnA.5	Cln_glnA.50	Cln_glnA.51	Cln_glnA.52	Cln_glnA.53	Cln_glnA.54	Cln_glnA.55	Cln_glnA.56	Cln_glnA.57	Cln_glnA.58	Cln_glnA.59	Cln_glnA.6	Cln_glnA.60	Cln_glnA.61	Cln_glnA.62	Cln_glnA.63	Cln_glnA.64	Cln_glnA.65	Cln_glnA.66	Cln_glnA.67	Cln_glnA.68	Cln_glnA.69	Cln_glnA.7	Cln_glnA.70	Cln_glnA.71	Cln_glnA.72	Cln_glnA.73	Cln_glnA.74	Cln_glnA.75	Cln_glnA.76	Cln_glnA.77	Cln_glnA.78	Cln_glnA.79	Cln_glnA.8	Cln_glnA.80	Cln_glnA.9
Cln_gltA	Cln_gltA.1	Cln_gltA.10	Cln_gltA.11	Cln_gltA.12	Cln_gltA.13	Cln_gltA.14	Cln_gltA.15	Cln_gltA.16	Cln_gltA.17	Cln_gltA.18	Cln_gltA.19	Cln_gltA.2	Cln_gltA.20	Cln_gltA.21	Cln_gltA.22	Cln_gltA.23	Cln_gltA.24	Cln_gltA.25	Cln_gltA.26	Cln_gltA.27	Cln_gltA.28	Cln_gltA.29	Cln_gltA.3	Cln_gltA.30	Cln_gltA.31	Cln_gltA.32	Cln_gltA.33	Cln_gltA.34	Cln_gltA.35	Cln_gltA.36	Cln_gltA.37	Cln_gltA.38	Cln_gltA.39	Cln_gltA.4	Cln_gltA.40	Cln_gltA.41	Cln_gltA.42	Cln_gltA.43	Cln_gltA.44	Cln_gltA.45	Cln_gltA.46	Cln_gltA.47	Cln_gltA.48	Cln_gltA.49	Cln_gltA.5	Cln_gltA.50	Cln_gltA.51	Cln_gltA.52	Cln_gltA.53	Cln_gltA.54	Cln_gltA.55	Cln_gltA.56	Cln_gltA.57	Cln_gltA.58	Cln_gltA.59	Cln_gltA.6	Cln_gltA.60	Cln_gltA.61	Cln_gltA.62	Cln_gltA.63	Cln_gltA.64	Cln_gltA.65	Cln_gltA.66	Cln_gltA.67	Cln_gltA.68	Cln_gltA.69	Cln_gltA.7	Cln_gltA.8	Cln_gltA.9
Cln_glyA	Cln_glyA.1	Cln_glyA.10	Cln_glyA.11	Cln_glyA.12	Cln_glyA.13	Cln_glyA.14	Cln_glyA.15	Cln_glyA.16	Cln_glyA.17	Cln_glyA.18	Cln_glyA.19	Cln_glyA.2	Cln_glyA.20	Cln_glyA.21	Cln_glyA.22	Cln_glyA.23	Cln_glyA.24	Cln_glyA.25	Cln_glyA.26	Cln_glyA.27	Cln_glyA.28	Cln_glyA.29	Cln_glyA.3	Cln_glyA.30	Cln_glyA.31	Cln_glyA.32	Cln_glyA.33	Cln_glyA.34	Cln_glyA.35	Cln_glyA.36	Cln_glyA.37	Cln_glyA.38	Cln_glyA.39	Cln_glyA.4	Cln_glyA.40	Cln_glyA.41	Cln_glyA.42	Cln_glyA.43	Cln_glyA.44	Cln_glyA.45	Cln_glyA.46	Cln_glyA.47	Cln_glyA.48	Cln_glyA.49	Cln_glyA.5	Cln_glyA.50	Cln_glyA.51	Cln_glyA.52	Cln_glyA.53	Cln_glyA.54	Cln_glyA.55	Cln_glyA.56	Cln_glyA.57	Cln_glyA.58	Cln_glyA.59	Cln_glyA.6	Cln_glyA.60	Cln_glyA.61	Cln_glyA.62	Cln_glyA.63	Cln_glyA.64	Cln_glyA.65	Cln_glyA.66	Cln_glyA.67	Cln_glyA.68	Cln_glyA.69	Cln_glyA.7	Cln_glyA.70	Cln_glyA.71	Cln_glyA.72	Cln_glyA.73	Cln_glyA.74	Cln_glyA.75	Cln_glyA.76	Cln_glyA.77	Cln_glyA.78	Cln_glyA.79	Cln_glyA.8	Cln_glyA.80	Cln_glyA.81	Cln_glyA.82	Cln_glyA.83	Cln_glyA.84	Cln_glyA.9
Cln_pgm	Cln_pgm.1	Cln_pgm.10	Cln_pgm.11	Cln_pgm.12	Cln_pgm.13	Cln_pgm.14	Cln_pgm.15	Cln_pgm.16	Cln_pgm.17	Cln_pgm.18	Cln_pgm.19	Cln_pgm.2	Cln_pgm.20	Cln_pgm.21	Cln_pgm.22	Cln_pgm.23	Cln_pgm.24	Cln_pgm.25	Cln_pgm.26	Cln_pgm.27	Cln_pgm.28	Cln_pgm.29	Cln_pgm.3	Cln_pgm.30	Cln_pgm.31	Cln_pgm.32	Cln_pgm.33	Cln_pgm.34	Cln_pgm.35	Cln_pgm.36	Cln_pgm.37	Cln_pgm.38	Cln_pgm.39	Cln_pgm.4	Cln_pgm.40	Cln_pgm.41	Cln_pgm.42	Cln_pgm.43	Cln_pgm.44	Cln_pgm.45	Cln_pgm.46	Cln_pgm.47	Cln_pgm.48	Cln_pgm.49	Cln_pgm.5	Cln_pgm.50	Cln_pgm.51	Cln_pgm.52	Cln_pgm.53	Cln_pgm.54	Cln_pgm.55	Cln_pgm.56	Cln_pgm.57	Cln_pgm.58	Cln_pgm.59	Cln_pgm.6	Cln_pgm.60	Cln_pgm.61	Cln_pgm.62	Cln_pgm.63	Cln_pgm.64	Cln_pgm.65	Cln_pgm.66	Cln_pgm.67	Cln_pgm.68	Cln_pgm.69	Cln_pgm.7	Cln_pgm.70	Cln_pgm.71	Cln_pgm.72	Cln_pgm.73	Cln_pgm.74	Cln_pgm.75	Cln_pgm.76	Cln_pgm.77	Cln_pgm.78	Cln_pgm.79	Cln_pgm.8	Cln_pgm.80	Cln_pgm.81	Cln_pgm.9
Cln_tkt	Cln_tkt.1	Cln_tkt.10	Cln_tkt.11	Cln_tkt.12	Cln_tkt.13	Cln_tkt.14	Cln_tkt.15	Cln_tkt.16	Cln_tkt.17	Cln_tkt.18	Cln_tkt.19	Cln_tkt.2	Cln_tkt.20	Cln_tkt.21	Cln_tkt.22	Cln_tkt.23	Cln_tkt.24	Cln_tkt.25	Cln_tkt.26	Cln_tkt.27	Cln_tkt.28	Cln_tkt.29	Cln_tkt.3	Cln_tkt.30	Cln_tkt.31	Cln_tkt.32	Cln_tkt.33	Cln_tkt.34	Cln_tkt.35	Cln_tkt.36	Cln_tkt.37	Cln_tkt.38	Cln_tkt.39	Cln_tkt.4	Cln_tkt.40	Cln_tkt.41	Cln_tkt.42	Cln_tkt.43	Cln_tkt.44	Cln_tkt.45	Cln_tkt.46	Cln_tkt.47	Cln_tkt.48	Cln_tkt.49	Cln_tkt.5	Cln_tkt.50	Cln_tkt.51	Cln_tkt.52	Cln_tkt.53	Cln_tkt.54	Cln_tkt.55	Cln_tkt.56	Cln_tkt.57	Cln_tkt.58	Cln_tkt.59	Cln_tkt.6	Cln_tkt.60	Cln_tkt.61	Cln_tkt.62	Cln_tkt.63	Cln_tkt.64	Cln_tkt.65	Cln_tkt.66	Cln_tkt.67	Cln_tkt.68	Cln_tkt.69	Cln_tkt.7	Cln_tkt.70	Cln_tkt.71	Cln_tkt.72	Cln_tkt.73	Cln_tkt.74	Cln_tkt.75	Cln_tkt.76	Cln_tkt.77	Cln_tkt.78	Cln_tkt.79	Cln_tkt.8	Cln_tkt.80	Cln_tkt.81	Cln_tkt.82	Cln_tkt.83	Cln_tkt.84	Cln_tkt.85	Cln_tkt.86	Cln_tkt.87	Cln_tkt.88	Cln_tkt.89	Cln_tkt.9	Cln_tkt.90	Cln_tkt.91	Cln_tkt.92	Cln_tkt.93	Cln_tkt.94	Cln_tkt.95	Cln_tkt.96	Cln_tkt.97
