Che_aspA.1	Che_aspA.2	Che_aspA.3	Che_aspA.4	Che_aspA.5	Che_aspA.6	Che_aspA.7
Che_atpA.1	Che_atpA.2	Che_atpA.3	Che_atpA.4	Che_atpA.5	Che_atpA.6
Che_glnA.1	Che_glnA.2	Che_glnA.3	Che_glnA.4	Che_glnA.5	Che_glnA.6
Che_gltA.1	Che_gltA.2	Che_gltA.3	Che_gltA.4
Che_glyA.1	Che_glyA.2	Che_glyA.3	Che_glyA.4	Che_glyA.5	Che_glyA.6	Che_glyA.7	Che_glyA.8	Che_glyA.9
Che_pgm.1	Che_pgm.2	Che_pgm.3	Che_pgm.4	Che_pgm.5	Che_pgm.6
Che_tkt.1	Che_tkt.2
