Cco_aspA.1	0	0	.	.	.
Cco_aspA.10	0	0	.	.	.
Cco_aspA.100	0	0	.	.	.
Cco_aspA.101	0	0	.	.	.
Cco_aspA.102	0	0	.	.	.
Cco_aspA.103	0	0	.	.	.
Cco_aspA.104	0	0	.	.	.
Cco_aspA.105	0	0	.	.	.
Cco_aspA.106	0	0	.	.	.
Cco_aspA.107	0	0	.	.	.
Cco_aspA.108	0	0	.	.	.
Cco_aspA.109	0	0	.	.	.
Cco_aspA.11	0	0	.	.	.
Cco_aspA.110	0	0	.	.	.
Cco_aspA.12	0	0	.	.	.
Cco_aspA.13	0	0	.	.	.
Cco_aspA.14	0	0	.	.	.
Cco_aspA.15	0	0	.	.	.
Cco_aspA.16	0	0	.	.	.
Cco_aspA.17	0	0	.	.	.
Cco_aspA.18	0	0	.	.	.
Cco_aspA.19	0	0	.	.	.
Cco_aspA.2	0	0	.	.	.
Cco_aspA.20	0	0	.	.	.
Cco_aspA.21	0	0	.	.	.
Cco_aspA.22	0	0	.	.	.
Cco_aspA.23	0	0	.	.	.
Cco_aspA.24	0	0	.	.	.
Cco_aspA.25	0	0	.	.	.
Cco_aspA.26	0	0	.	.	.
Cco_aspA.27	0	0	.	.	.
Cco_aspA.28	0	0	.	.	.
Cco_aspA.29	0	0	.	.	.
Cco_aspA.3	0	0	.	.	.
Cco_aspA.30	0	0	.	.	.
Cco_aspA.31	0	0	.	.	.
Cco_aspA.32	0	0	.	.	.
Cco_aspA.33	0	0	.	.	.
Cco_aspA.34	0	0	.	.	.
Cco_aspA.35	0	0	.	.	.
Cco_aspA.36	0	0	.	.	.
Cco_aspA.37	0	0	.	.	.
Cco_aspA.38	0	0	.	.	.
Cco_aspA.39	0	0	.	.	.
Cco_aspA.4	0	0	.	.	.
Cco_aspA.40	0	0	.	.	.
Cco_aspA.41	0	0	.	.	.
Cco_aspA.42	0	0	.	.	.
Cco_aspA.43	0	0	.	.	.
Cco_aspA.44	0	0	.	.	.
Cco_aspA.45	0	0	.	.	.
Cco_aspA.46	0	0	.	.	.
Cco_aspA.47	0	0	.	.	.
Cco_aspA.48	0	0	.	.	.
Cco_aspA.49	0	0	.	.	.
Cco_aspA.5	0	0	.	.	.
Cco_aspA.50	0	0	.	.	.
Cco_aspA.51	0	0	.	.	.
Cco_aspA.52	0	0	.	.	.
Cco_aspA.53	0	0	.	.	.
Cco_aspA.54	0	0	.	.	.
Cco_aspA.55	0	0	.	.	.
Cco_aspA.56	0	0	.	.	.
Cco_aspA.57	0	0	.	.	.
Cco_aspA.58	0	0	.	.	.
Cco_aspA.59	0	0	.	.	.
Cco_aspA.6	0	0	.	.	.
Cco_aspA.60	0	0	.	.	.
Cco_aspA.61	0	0	.	.	.
Cco_aspA.62	0	0	.	.	.
Cco_aspA.63	0	0	.	.	.
Cco_aspA.64	0	0	.	.	.
Cco_aspA.65	0	0	.	.	.
Cco_aspA.66	0	0	.	.	.
Cco_aspA.67	0	0	.	.	.
Cco_aspA.68	0	0	.	.	.
Cco_aspA.69	0	0	.	.	.
Cco_aspA.7	0	0	.	.	.
Cco_aspA.70	0	0	.	.	.
Cco_aspA.71	0	0	.	.	.
Cco_aspA.72	0	0	.	.	.
Cco_aspA.73	0	0	.	.	.
Cco_aspA.74	0	0	.	.	.
Cco_aspA.75	0	0	.	.	.
Cco_aspA.76	0	0	.	.	.
Cco_aspA.77	0	0	.	.	.
Cco_aspA.78	0	0	.	.	.
Cco_aspA.79	0	0	.	.	.
Cco_aspA.8	0	0	.	.	.
Cco_aspA.80	0	0	.	.	.
Cco_aspA.81	0	0	.	.	.
Cco_aspA.82	0	0	.	.	.
Cco_aspA.83	0	0	.	.	.
Cco_aspA.84	0	0	.	.	.
Cco_aspA.85	0	0	.	.	.
Cco_aspA.86	0	0	.	.	.
Cco_aspA.87	0	0	.	.	.
Cco_aspA.88	0	0	.	.	.
Cco_aspA.89	0	0	.	.	.
Cco_aspA.9	0	0	.	.	.
Cco_aspA.90	0	0	.	.	.
Cco_aspA.91	0	0	.	.	.
Cco_aspA.92	0	0	.	.	.
Cco_aspA.93	0	0	.	.	.
Cco_aspA.94	0	0	.	.	.
Cco_aspA.95	0	0	.	.	.
Cco_aspA.96	0	0	.	.	.
Cco_aspA.97	0	0	.	.	.
Cco_aspA.98	0	0	.	.	.
Cco_aspA.99	0	0	.	.	.
Cco_atpA.1	0	0	.	.	.
Cco_atpA.10	0	0	.	.	.
Cco_atpA.11	0	0	.	.	.
Cco_atpA.12	0	0	.	.	.
Cco_atpA.13	0	0	.	.	.
Cco_atpA.14	0	0	.	.	.
Cco_atpA.15	0	0	.	.	.
Cco_atpA.16	0	0	.	.	.
Cco_atpA.17	0	0	.	.	.
Cco_atpA.18	0	0	.	.	.
Cco_atpA.19	0	0	.	.	.
Cco_atpA.2	0	0	.	.	.
Cco_atpA.20	0	0	.	.	.
Cco_atpA.21	0	0	.	.	.
Cco_atpA.22	0	0	.	.	.
Cco_atpA.23	0	0	.	.	.
Cco_atpA.24	0	0	.	.	.
Cco_atpA.25	0	0	.	.	.
Cco_atpA.26	0	0	.	.	.
Cco_atpA.27	0	0	.	.	.
Cco_atpA.28	0	0	.	.	.
Cco_atpA.29	0	0	.	.	.
Cco_atpA.3	0	0	.	.	.
Cco_atpA.30	0	0	.	.	.
Cco_atpA.31	0	0	.	.	.
Cco_atpA.32	0	0	.	.	.
Cco_atpA.33	0	0	.	.	.
Cco_atpA.34	0	0	.	.	.
Cco_atpA.35	0	0	.	.	.
Cco_atpA.36	0	0	.	.	.
Cco_atpA.37	0	0	.	.	.
Cco_atpA.38	0	0	.	.	.
Cco_atpA.39	0	0	.	.	.
Cco_atpA.4	0	0	.	.	.
Cco_atpA.40	0	0	.	.	.
Cco_atpA.41	0	0	.	.	.
Cco_atpA.42	0	0	.	.	.
Cco_atpA.43	0	0	.	.	.
Cco_atpA.44	0	0	.	.	.
Cco_atpA.45	0	0	.	.	.
Cco_atpA.46	0	0	.	.	.
Cco_atpA.47	0	0	.	.	.
Cco_atpA.48	0	0	.	.	.
Cco_atpA.49	0	0	.	.	.
Cco_atpA.5	0	0	.	.	.
Cco_atpA.50	0	0	.	.	.
Cco_atpA.51	0	0	.	.	.
Cco_atpA.52	0	0	.	.	.
Cco_atpA.53	0	0	.	.	.
Cco_atpA.54	0	0	.	.	.
Cco_atpA.55	0	0	.	.	.
Cco_atpA.56	0	0	.	.	.
Cco_atpA.57	0	0	.	.	.
Cco_atpA.58	0	0	.	.	.
Cco_atpA.59	0	0	.	.	.
Cco_atpA.6	0	0	.	.	.
Cco_atpA.60	0	0	.	.	.
Cco_atpA.61	0	0	.	.	.
Cco_atpA.62	0	0	.	.	.
Cco_atpA.63	0	0	.	.	.
Cco_atpA.64	0	0	.	.	.
Cco_atpA.65	0	0	.	.	.
Cco_atpA.66	0	0	.	.	.
Cco_atpA.67	0	0	.	.	.
Cco_atpA.68	0	0	.	.	.
Cco_atpA.69	0	0	.	.	.
Cco_atpA.7	0	0	.	.	.
Cco_atpA.70	0	0	.	.	.
Cco_atpA.71	0	0	.	.	.
Cco_atpA.72	0	0	.	.	.
Cco_atpA.73	0	0	.	.	.
Cco_atpA.74	0	0	.	.	.
Cco_atpA.75	0	0	.	.	.
Cco_atpA.76	0	0	.	.	.
Cco_atpA.77	0	0	.	.	.
Cco_atpA.78	0	0	.	.	.
Cco_atpA.79	0	0	.	.	.
Cco_atpA.8	0	0	.	.	.
Cco_atpA.80	0	0	.	.	.
Cco_atpA.81	0	0	.	.	.
Cco_atpA.82	0	0	.	.	.
Cco_atpA.83	0	0	.	.	.
Cco_atpA.84	0	0	.	.	.
Cco_atpA.85	0	0	.	.	.
Cco_atpA.86	0	0	.	.	.
Cco_atpA.87	0	0	.	.	.
Cco_atpA.88	0	0	.	.	.
Cco_atpA.89	0	0	.	.	.
Cco_atpA.9	0	0	.	.	.
Cco_atpA.90	0	0	.	.	.
Cco_atpA.91	0	0	.	.	.
Cco_atpA.92	0	0	.	.	.
Cco_atpA.93	0	0	.	.	.
Cco_atpA.94	0	0	.	.	.
Cco_atpA.95	0	0	.	.	.
Cco_atpA.96	0	0	.	.	.
Cco_atpA.97	0	0	.	.	.
Cco_atpA.98	0	0	.	.	.
Cco_atpA.99	0	0	.	.	.
Cco_glnA.1	0	0	.	.	.
Cco_glnA.10	0	0	.	.	.
Cco_glnA.100	0	0	.	.	.
Cco_glnA.101	0	0	.	.	.
Cco_glnA.102	0	0	.	.	.
Cco_glnA.103	0	0	.	.	.
Cco_glnA.104	0	0	.	.	.
Cco_glnA.105	0	0	.	.	.
Cco_glnA.106	0	0	.	.	.
Cco_glnA.107	0	0	.	.	.
Cco_glnA.108	0	0	.	.	.
Cco_glnA.109	0	0	.	.	.
Cco_glnA.11	0	0	.	.	.
Cco_glnA.12	0	0	.	.	.
Cco_glnA.13	0	0	.	.	.
Cco_glnA.14	0	0	.	.	.
Cco_glnA.15	0	0	.	.	.
Cco_glnA.16	0	0	.	.	.
Cco_glnA.17	0	0	.	.	.
Cco_glnA.18	0	0	.	.	.
Cco_glnA.19	0	0	.	.	.
Cco_glnA.2	0	0	.	.	.
Cco_glnA.20	0	0	.	.	.
Cco_glnA.21	0	0	.	.	.
Cco_glnA.22	0	0	.	.	.
Cco_glnA.23	0	0	.	.	.
Cco_glnA.24	0	0	.	.	.
Cco_glnA.25	0	0	.	.	.
Cco_glnA.26	0	0	.	.	.
Cco_glnA.27	0	0	.	.	.
Cco_glnA.28	0	0	.	.	.
Cco_glnA.29	0	0	.	.	.
Cco_glnA.3	0	0	.	.	.
Cco_glnA.30	0	0	.	.	.
Cco_glnA.31	0	0	.	.	.
Cco_glnA.32	0	0	.	.	.
Cco_glnA.33	0	0	.	.	.
Cco_glnA.34	0	0	.	.	.
Cco_glnA.35	0	0	.	.	.
Cco_glnA.36	0	0	.	.	.
Cco_glnA.37	0	0	.	.	.
Cco_glnA.38	0	0	.	.	.
Cco_glnA.39	0	0	.	.	.
Cco_glnA.4	0	0	.	.	.
Cco_glnA.40	0	0	.	.	.
Cco_glnA.41	0	0	.	.	.
Cco_glnA.42	0	0	.	.	.
Cco_glnA.43	0	0	.	.	.
Cco_glnA.44	0	0	.	.	.
Cco_glnA.45	0	0	.	.	.
Cco_glnA.46	0	0	.	.	.
Cco_glnA.47	0	0	.	.	.
Cco_glnA.48	0	0	.	.	.
Cco_glnA.49	0	0	.	.	.
Cco_glnA.5	0	0	.	.	.
Cco_glnA.50	0	0	.	.	.
Cco_glnA.51	0	0	.	.	.
Cco_glnA.52	0	0	.	.	.
Cco_glnA.53	0	0	.	.	.
Cco_glnA.54	0	0	.	.	.
Cco_glnA.55	0	0	.	.	.
Cco_glnA.56	0	0	.	.	.
Cco_glnA.57	0	0	.	.	.
Cco_glnA.58	0	0	.	.	.
Cco_glnA.59	0	0	.	.	.
Cco_glnA.6	0	0	.	.	.
Cco_glnA.60	0	0	.	.	.
Cco_glnA.61	0	0	.	.	.
Cco_glnA.62	0	0	.	.	.
Cco_glnA.63	0	0	.	.	.
Cco_glnA.64	0	0	.	.	.
Cco_glnA.65	0	0	.	.	.
Cco_glnA.66	0	0	.	.	.
Cco_glnA.67	0	0	.	.	.
Cco_glnA.68	0	0	.	.	.
Cco_glnA.69	0	0	.	.	.
Cco_glnA.7	0	0	.	.	.
Cco_glnA.70	0	0	.	.	.
Cco_glnA.71	0	0	.	.	.
Cco_glnA.72	0	0	.	.	.
Cco_glnA.73	0	0	.	.	.
Cco_glnA.74	0	0	.	.	.
Cco_glnA.75	0	0	.	.	.
Cco_glnA.76	0	0	.	.	.
Cco_glnA.77	0	0	.	.	.
Cco_glnA.78	0	0	.	.	.
Cco_glnA.79	0	0	.	.	.
Cco_glnA.8	0	0	.	.	.
Cco_glnA.80	0	0	.	.	.
Cco_glnA.81	0	0	.	.	.
Cco_glnA.82	0	0	.	.	.
Cco_glnA.83	0	0	.	.	.
Cco_glnA.84	0	0	.	.	.
Cco_glnA.85	0	0	.	.	.
Cco_glnA.86	0	0	.	.	.
Cco_glnA.87	0	0	.	.	.
Cco_glnA.88	0	0	.	.	.
Cco_glnA.89	0	0	.	.	.
Cco_glnA.9	0	0	.	.	.
Cco_glnA.90	0	0	.	.	.
Cco_glnA.91	0	0	.	.	.
Cco_glnA.92	0	0	.	.	.
Cco_glnA.93	0	0	.	.	.
Cco_glnA.94	0	0	.	.	.
Cco_glnA.95	0	0	.	.	.
Cco_glnA.96	0	0	.	.	.
Cco_glnA.97	0	0	.	.	.
Cco_glnA.98	0	0	.	.	.
Cco_glnA.99	0	0	.	.	.
Cco_gltA.1	0	0	.	.	.
Cco_gltA.10	0	0	.	.	.
Cco_gltA.100	0	0	.	.	.
Cco_gltA.101	0	0	.	.	.
Cco_gltA.102	0	0	.	.	.
Cco_gltA.103	0	0	.	.	.
Cco_gltA.104	0	0	.	.	.
Cco_gltA.11	0	0	.	.	.
Cco_gltA.12	0	0	.	.	.
Cco_gltA.13	0	0	.	.	.
Cco_gltA.14	0	0	.	.	.
Cco_gltA.15	0	0	.	.	.
Cco_gltA.16	0	0	.	.	.
Cco_gltA.17	0	0	.	.	.
Cco_gltA.18	0	0	.	.	.
Cco_gltA.19	0	0	.	.	.
Cco_gltA.2	0	0	.	.	.
Cco_gltA.20	0	0	.	.	.
Cco_gltA.21	0	0	.	.	.
Cco_gltA.22	0	0	.	.	.
Cco_gltA.23	0	0	.	.	.
Cco_gltA.24	0	0	.	.	.
Cco_gltA.25	0	0	.	.	.
Cco_gltA.26	0	0	.	.	.
Cco_gltA.27	0	0	.	.	.
Cco_gltA.28	0	0	.	.	.
Cco_gltA.29	0	0	.	.	.
Cco_gltA.3	0	0	.	.	.
Cco_gltA.30	0	0	.	.	.
Cco_gltA.31	0	0	.	.	.
Cco_gltA.32	0	0	.	.	.
Cco_gltA.33	0	0	.	.	.
Cco_gltA.34	0	0	.	.	.
Cco_gltA.35	0	0	.	.	.
Cco_gltA.36	0	0	.	.	.
Cco_gltA.37	0	0	.	.	.
Cco_gltA.38	0	0	.	.	.
Cco_gltA.39	0	0	.	.	.
Cco_gltA.4	0	0	.	.	.
Cco_gltA.40	0	0	.	.	.
Cco_gltA.41	0	0	.	.	.
Cco_gltA.42	0	0	.	.	.
Cco_gltA.43	0	0	.	.	.
Cco_gltA.44	0	0	.	.	.
Cco_gltA.45	0	0	.	.	.
Cco_gltA.46	0	0	.	.	.
Cco_gltA.47	0	0	.	.	.
Cco_gltA.48	0	0	.	.	.
Cco_gltA.49	0	0	.	.	.
Cco_gltA.5	0	0	.	.	.
Cco_gltA.50	0	0	.	.	.
Cco_gltA.51	0	0	.	.	.
Cco_gltA.52	0	0	.	.	.
Cco_gltA.53	0	0	.	.	.
Cco_gltA.54	0	0	.	.	.
Cco_gltA.55	0	0	.	.	.
Cco_gltA.56	0	0	.	.	.
Cco_gltA.57	0	0	.	.	.
Cco_gltA.58	0	0	.	.	.
Cco_gltA.59	0	0	.	.	.
Cco_gltA.6	0	0	.	.	.
Cco_gltA.60	0	0	.	.	.
Cco_gltA.61	0	0	.	.	.
Cco_gltA.62	0	0	.	.	.
Cco_gltA.63	0	0	.	.	.
Cco_gltA.64	0	0	.	.	.
Cco_gltA.65	0	0	.	.	.
Cco_gltA.66	0	0	.	.	.
Cco_gltA.67	0	0	.	.	.
Cco_gltA.68	0	0	.	.	.
Cco_gltA.69	0	0	.	.	.
Cco_gltA.7	0	0	.	.	.
Cco_gltA.70	0	0	.	.	.
Cco_gltA.71	0	0	.	.	.
Cco_gltA.72	0	0	.	.	.
Cco_gltA.73	0	0	.	.	.
Cco_gltA.74	0	0	.	.	.
Cco_gltA.75	0	0	.	.	.
Cco_gltA.76	0	0	.	.	.
Cco_gltA.77	0	0	.	.	.
Cco_gltA.78	0	0	.	.	.
Cco_gltA.79	0	0	.	.	.
Cco_gltA.8	0	0	.	.	.
Cco_gltA.80	0	0	.	.	.
Cco_gltA.81	0	0	.	.	.
Cco_gltA.82	0	0	.	.	.
Cco_gltA.83	0	0	.	.	.
Cco_gltA.84	0	0	.	.	.
Cco_gltA.85	0	0	.	.	.
Cco_gltA.86	0	0	.	.	.
Cco_gltA.87	0	0	.	.	.
Cco_gltA.88	0	0	.	.	.
Cco_gltA.89	0	0	.	.	.
Cco_gltA.9	0	0	.	.	.
Cco_gltA.90	0	0	.	.	.
Cco_gltA.91	0	0	.	.	.
Cco_gltA.92	0	0	.	.	.
Cco_gltA.93	0	0	.	.	.
Cco_gltA.94	0	0	.	.	.
Cco_gltA.95	0	0	.	.	.
Cco_gltA.96	0	0	.	.	.
Cco_gltA.97	0	0	.	.	.
Cco_gltA.98	0	0	.	.	.
Cco_gltA.99	0	0	.	.	.
Cco_glyA.1	0	0	.	.	.
Cco_glyA.10	0	0	.	.	.
Cco_glyA.100	0	0	.	.	.
Cco_glyA.101	0	0	.	.	.
Cco_glyA.102	0	0	.	.	.
Cco_glyA.103	0	0	.	.	.
Cco_glyA.104	0	0	.	.	.
Cco_glyA.105	0	0	.	.	.
Cco_glyA.106	0	0	.	.	.
Cco_glyA.107	0	0	.	.	.
Cco_glyA.108	0	0	.	.	.
Cco_glyA.109	0	0	.	.	.
Cco_glyA.11	0	0	.	.	.
Cco_glyA.110	0	0	.	.	.
Cco_glyA.12	0	0	.	.	.
Cco_glyA.13	0	0	.	.	.
Cco_glyA.14	0	0	.	.	.
Cco_glyA.15	0	0	.	.	.
Cco_glyA.16	0	0	.	.	.
Cco_glyA.17	0	0	.	.	.
Cco_glyA.18	0	0	.	.	.
Cco_glyA.19	0	0	.	.	.
Cco_glyA.2	0	0	.	.	.
Cco_glyA.20	0	0	.	.	.
Cco_glyA.21	0	0	.	.	.
Cco_glyA.22	0	0	.	.	.
Cco_glyA.23	0	0	.	.	.
Cco_glyA.24	0	0	.	.	.
Cco_glyA.25	0	0	.	.	.
Cco_glyA.26	0	0	.	.	.
Cco_glyA.27	0	0	.	.	.
Cco_glyA.28	0	0	.	.	.
Cco_glyA.29	0	0	.	.	.
Cco_glyA.3	0	0	.	.	.
Cco_glyA.30	0	0	.	.	.
Cco_glyA.31	0	0	.	.	.
Cco_glyA.32	0	0	.	.	.
Cco_glyA.33	0	0	.	.	.
Cco_glyA.34	0	0	.	.	.
Cco_glyA.35	0	0	.	.	.
Cco_glyA.36	0	0	.	.	.
Cco_glyA.37	0	0	.	.	.
Cco_glyA.38	0	0	.	.	.
Cco_glyA.39	0	0	.	.	.
Cco_glyA.4	0	0	.	.	.
Cco_glyA.40	0	0	.	.	.
Cco_glyA.41	0	0	.	.	.
Cco_glyA.42	0	0	.	.	.
Cco_glyA.43	0	0	.	.	.
Cco_glyA.44	0	0	.	.	.
Cco_glyA.45	0	0	.	.	.
Cco_glyA.46	0	0	.	.	.
Cco_glyA.47	0	0	.	.	.
Cco_glyA.48	0	0	.	.	.
Cco_glyA.49	0	0	.	.	.
Cco_glyA.5	0	0	.	.	.
Cco_glyA.50	0	0	.	.	.
Cco_glyA.51	0	0	.	.	.
Cco_glyA.52	0	0	.	.	.
Cco_glyA.53	0	0	.	.	.
Cco_glyA.54	0	0	.	.	.
Cco_glyA.55	0	0	.	.	.
Cco_glyA.56	0	0	.	.	.
Cco_glyA.57	0	0	.	.	.
Cco_glyA.58	0	0	.	.	.
Cco_glyA.59	0	0	.	.	.
Cco_glyA.6	0	0	.	.	.
Cco_glyA.60	0	0	.	.	.
Cco_glyA.61	0	0	.	.	.
Cco_glyA.62	0	0	.	.	.
Cco_glyA.63	0	0	.	.	.
Cco_glyA.64	0	0	.	.	.
Cco_glyA.65	0	0	.	.	.
Cco_glyA.66	0	0	.	.	.
Cco_glyA.67	0	0	.	.	.
Cco_glyA.68	0	0	.	.	.
Cco_glyA.69	0	0	.	.	.
Cco_glyA.7	0	0	.	.	.
Cco_glyA.70	0	0	.	.	.
Cco_glyA.71	0	0	.	.	.
Cco_glyA.72	0	0	.	.	.
Cco_glyA.73	0	0	.	.	.
Cco_glyA.74	0	0	.	.	.
Cco_glyA.75	0	0	.	.	.
Cco_glyA.76	0	0	.	.	.
Cco_glyA.77	0	0	.	.	.
Cco_glyA.78	0	0	.	.	.
Cco_glyA.79	0	0	.	.	.
Cco_glyA.8	0	0	.	.	.
Cco_glyA.80	0	0	.	.	.
Cco_glyA.81	0	0	.	.	.
Cco_glyA.82	0	0	.	.	.
Cco_glyA.83	0	0	.	.	.
Cco_glyA.84	0	0	.	.	.
Cco_glyA.85	0	0	.	.	.
Cco_glyA.86	0	0	.	.	.
Cco_glyA.87	0	0	.	.	.
Cco_glyA.88	0	0	.	.	.
Cco_glyA.89	0	0	.	.	.
Cco_glyA.9	0	0	.	.	.
Cco_glyA.90	0	0	.	.	.
Cco_glyA.91	0	0	.	.	.
Cco_glyA.92	0	0	.	.	.
Cco_glyA.93	0	0	.	.	.
Cco_glyA.94	0	0	.	.	.
Cco_glyA.95	0	0	.	.	.
Cco_glyA.96	0	0	.	.	.
Cco_glyA.97	0	0	.	.	.
Cco_glyA.98	0	0	.	.	.
Cco_glyA.99	0	0	.	.	.
Cco_ilvD.1	0	0	.	.	.
Cco_ilvD.10	0	0	.	.	.
Cco_ilvD.100	0	0	.	.	.
Cco_ilvD.101	0	0	.	.	.
Cco_ilvD.102	0	0	.	.	.
Cco_ilvD.103	0	0	.	.	.
Cco_ilvD.104	0	0	.	.	.
Cco_ilvD.105	0	0	.	.	.
Cco_ilvD.106	0	0	.	.	.
Cco_ilvD.107	0	0	.	.	.
Cco_ilvD.108	0	0	.	.	.
Cco_ilvD.109	0	0	.	.	.
Cco_ilvD.11	0	0	.	.	.
Cco_ilvD.110	0	0	.	.	.
Cco_ilvD.111	0	0	.	.	.
Cco_ilvD.112	0	0	.	.	.
Cco_ilvD.113	0	0	.	.	.
Cco_ilvD.12	0	0	.	.	.
Cco_ilvD.13	0	0	.	.	.
Cco_ilvD.14	0	0	.	.	.
Cco_ilvD.15	0	0	.	.	.
Cco_ilvD.16	0	0	.	.	.
Cco_ilvD.17	0	0	.	.	.
Cco_ilvD.18	0	0	.	.	.
Cco_ilvD.19	0	0	.	.	.
Cco_ilvD.2	0	0	.	.	.
Cco_ilvD.20	0	0	.	.	.
Cco_ilvD.21	0	0	.	.	.
Cco_ilvD.22	0	0	.	.	.
Cco_ilvD.23	0	0	.	.	.
Cco_ilvD.24	0	0	.	.	.
Cco_ilvD.25	0	0	.	.	.
Cco_ilvD.26	0	0	.	.	.
Cco_ilvD.27	0	0	.	.	.
Cco_ilvD.28	0	0	.	.	.
Cco_ilvD.29	0	0	.	.	.
Cco_ilvD.3	0	0	.	.	.
Cco_ilvD.30	0	0	.	.	.
Cco_ilvD.31	0	0	.	.	.
Cco_ilvD.32	0	0	.	.	.
Cco_ilvD.33	0	0	.	.	.
Cco_ilvD.34	0	0	.	.	.
Cco_ilvD.35	0	0	.	.	.
Cco_ilvD.36	0	0	.	.	.
Cco_ilvD.37	0	0	.	.	.
Cco_ilvD.38	0	0	.	.	.
Cco_ilvD.39	0	0	.	.	.
Cco_ilvD.4	0	0	.	.	.
Cco_ilvD.40	0	0	.	.	.
Cco_ilvD.41	0	0	.	.	.
Cco_ilvD.42	0	0	.	.	.
Cco_ilvD.43	0	0	.	.	.
Cco_ilvD.44	0	0	.	.	.
Cco_ilvD.45	0	0	.	.	.
Cco_ilvD.46	0	0	.	.	.
Cco_ilvD.47	0	0	.	.	.
Cco_ilvD.48	0	0	.	.	.
Cco_ilvD.49	0	0	.	.	.
Cco_ilvD.5	0	0	.	.	.
Cco_ilvD.50	0	0	.	.	.
Cco_ilvD.51	0	0	.	.	.
Cco_ilvD.52	0	0	.	.	.
Cco_ilvD.53	0	0	.	.	.
Cco_ilvD.54	0	0	.	.	.
Cco_ilvD.55	0	0	.	.	.
Cco_ilvD.56	0	0	.	.	.
Cco_ilvD.57	0	0	.	.	.
Cco_ilvD.58	0	0	.	.	.
Cco_ilvD.59	0	0	.	.	.
Cco_ilvD.6	0	0	.	.	.
Cco_ilvD.60	0	0	.	.	.
Cco_ilvD.61	0	0	.	.	.
Cco_ilvD.62	0	0	.	.	.
Cco_ilvD.63	0	0	.	.	.
Cco_ilvD.64	0	0	.	.	.
Cco_ilvD.65	0	0	.	.	.
Cco_ilvD.66	0	0	.	.	.
Cco_ilvD.67	0	0	.	.	.
Cco_ilvD.68	0	0	.	.	.
Cco_ilvD.69	0	0	.	.	.
Cco_ilvD.7	0	0	.	.	.
Cco_ilvD.70	0	0	.	.	.
Cco_ilvD.71	0	0	.	.	.
Cco_ilvD.72	0	0	.	.	.
Cco_ilvD.73	0	0	.	.	.
Cco_ilvD.74	0	0	.	.	.
Cco_ilvD.75	0	0	.	.	.
Cco_ilvD.76	0	0	.	.	.
Cco_ilvD.77	0	0	.	.	.
Cco_ilvD.78	0	0	.	.	.
Cco_ilvD.79	0	0	.	.	.
Cco_ilvD.8	0	0	.	.	.
Cco_ilvD.80	0	0	.	.	.
Cco_ilvD.81	0	0	.	.	.
Cco_ilvD.82	0	0	.	.	.
Cco_ilvD.83	0	0	.	.	.
Cco_ilvD.84	0	0	.	.	.
Cco_ilvD.85	0	0	.	.	.
Cco_ilvD.86	0	0	.	.	.
Cco_ilvD.87	0	0	.	.	.
Cco_ilvD.88	0	0	.	.	.
Cco_ilvD.89	0	0	.	.	.
Cco_ilvD.9	0	0	.	.	.
Cco_ilvD.90	0	0	.	.	.
Cco_ilvD.91	0	0	.	.	.
Cco_ilvD.92	0	0	.	.	.
Cco_ilvD.93	0	0	.	.	.
Cco_ilvD.94	0	0	.	.	.
Cco_ilvD.95	0	0	.	.	.
Cco_ilvD.96	0	0	.	.	.
Cco_ilvD.97	0	0	.	.	.
Cco_ilvD.98	0	0	.	.	.
Cco_ilvD.99	0	0	.	.	.
Cco_pgm.1	0	0	.	.	.
Cco_pgm.10	0	0	.	.	.
Cco_pgm.100	0	0	.	.	.
Cco_pgm.101	0	0	.	.	.
Cco_pgm.102	0	0	.	.	.
Cco_pgm.103	0	0	.	.	.
Cco_pgm.104	0	0	.	.	.
Cco_pgm.105	0	0	.	.	.
Cco_pgm.106	0	0	.	.	.
Cco_pgm.107	0	0	.	.	.
Cco_pgm.108	0	0	.	.	.
Cco_pgm.109	0	0	.	.	.
Cco_pgm.11	0	0	.	.	.
Cco_pgm.110	0	0	.	.	.
Cco_pgm.111	0	0	.	.	.
Cco_pgm.112	0	0	.	.	.
Cco_pgm.113	0	0	.	.	.
Cco_pgm.12	0	0	.	.	.
Cco_pgm.13	0	0	.	.	.
Cco_pgm.14	0	0	.	.	.
Cco_pgm.15	0	0	.	.	.
Cco_pgm.16	0	0	.	.	.
Cco_pgm.17	0	0	.	.	.
Cco_pgm.18	0	0	.	.	.
Cco_pgm.19	0	0	.	.	.
Cco_pgm.2	0	0	.	.	.
Cco_pgm.20	0	0	.	.	.
Cco_pgm.21	0	0	.	.	.
Cco_pgm.22	0	0	.	.	.
Cco_pgm.23	0	0	.	.	.
Cco_pgm.24	0	0	.	.	.
Cco_pgm.25	0	0	.	.	.
Cco_pgm.26	0	0	.	.	.
Cco_pgm.27	0	0	.	.	.
Cco_pgm.28	0	0	.	.	.
Cco_pgm.29	0	0	.	.	.
Cco_pgm.3	0	0	.	.	.
Cco_pgm.30	0	0	.	.	.
Cco_pgm.31	0	0	.	.	.
Cco_pgm.32	0	0	.	.	.
Cco_pgm.33	0	0	.	.	.
Cco_pgm.34	0	0	.	.	.
Cco_pgm.35	0	0	.	.	.
Cco_pgm.36	0	0	.	.	.
Cco_pgm.37	0	0	.	.	.
Cco_pgm.38	0	0	.	.	.
Cco_pgm.39	0	0	.	.	.
Cco_pgm.4	0	0	.	.	.
Cco_pgm.40	0	0	.	.	.
Cco_pgm.41	0	0	.	.	.
Cco_pgm.42	0	0	.	.	.
Cco_pgm.43	0	0	.	.	.
Cco_pgm.44	0	0	.	.	.
Cco_pgm.45	0	0	.	.	.
Cco_pgm.46	0	0	.	.	.
Cco_pgm.47	0	0	.	.	.
Cco_pgm.48	0	0	.	.	.
Cco_pgm.49	0	0	.	.	.
Cco_pgm.5	0	0	.	.	.
Cco_pgm.50	0	0	.	.	.
Cco_pgm.51	0	0	.	.	.
Cco_pgm.52	0	0	.	.	.
Cco_pgm.53	0	0	.	.	.
Cco_pgm.54	0	0	.	.	.
Cco_pgm.55	0	0	.	.	.
Cco_pgm.56	0	0	.	.	.
Cco_pgm.57	0	0	.	.	.
Cco_pgm.58	0	0	.	.	.
Cco_pgm.59	0	0	.	.	.
Cco_pgm.6	0	0	.	.	.
Cco_pgm.60	0	0	.	.	.
Cco_pgm.61	0	0	.	.	.
Cco_pgm.62	0	0	.	.	.
Cco_pgm.63	0	0	.	.	.
Cco_pgm.64	0	0	.	.	.
Cco_pgm.65	0	0	.	.	.
Cco_pgm.66	0	0	.	.	.
Cco_pgm.67	0	0	.	.	.
Cco_pgm.68	0	0	.	.	.
Cco_pgm.69	0	0	.	.	.
Cco_pgm.7	0	0	.	.	.
Cco_pgm.70	0	0	.	.	.
Cco_pgm.71	0	0	.	.	.
Cco_pgm.72	0	0	.	.	.
Cco_pgm.73	0	0	.	.	.
Cco_pgm.74	0	0	.	.	.
Cco_pgm.75	0	0	.	.	.
Cco_pgm.76	0	0	.	.	.
Cco_pgm.77	0	0	.	.	.
Cco_pgm.78	0	0	.	.	.
Cco_pgm.79	0	0	.	.	.
Cco_pgm.8	0	0	.	.	.
Cco_pgm.80	0	0	.	.	.
Cco_pgm.81	0	0	.	.	.
Cco_pgm.82	0	0	.	.	.
Cco_pgm.83	0	0	.	.	.
Cco_pgm.84	0	0	.	.	.
Cco_pgm.85	0	0	.	.	.
Cco_pgm.86	0	0	.	.	.
Cco_pgm.87	0	0	.	.	.
Cco_pgm.88	0	0	.	.	.
Cco_pgm.89	0	0	.	.	.
Cco_pgm.9	0	0	.	.	.
Cco_pgm.90	0	0	.	.	.
Cco_pgm.91	0	0	.	.	.
Cco_pgm.92	0	0	.	.	.
Cco_pgm.93	0	0	.	.	.
Cco_pgm.94	0	0	.	.	.
Cco_pgm.95	0	0	.	.	.
Cco_pgm.96	0	0	.	.	.
Cco_pgm.97	0	0	.	.	.
Cco_pgm.98	0	0	.	.	.
Cco_pgm.99	0	0	.	.	.
