adk.1	0	0	.	.	.
adk.10	0	0	.	.	.
adk.100	0	0	.	.	.
adk.101	0	0	.	.	.
adk.102	0	0	.	.	.
adk.103	0	0	.	.	.
adk.104	0	0	.	.	.
adk.105	0	0	.	.	.
adk.106	0	0	.	.	.
adk.107	0	0	.	.	.
adk.108	0	0	.	.	.
adk.109	0	0	.	.	.
adk.11	0	0	.	.	.
adk.110	0	0	.	.	.
adk.111	0	0	.	.	.
adk.112	0	0	.	.	.
adk.113	0	0	.	.	.
adk.114	0	0	.	.	.
adk.115	0	0	.	.	.
adk.116	0	0	.	.	.
adk.117	0	0	.	.	.
adk.118	0	0	.	.	.
adk.119	0	0	.	.	.
adk.12	0	0	.	.	.
adk.120	0	0	.	.	.
adk.121	0	0	.	.	.
adk.122	0	0	.	.	.
adk.123	0	0	.	.	.
adk.124	0	0	.	.	.
adk.125	0	0	.	.	.
adk.126	0	0	.	.	.
adk.127	0	0	.	.	.
adk.128	0	0	.	.	.
adk.129	0	0	.	.	.
adk.13	0	0	.	.	.
adk.130	0	0	.	.	.
adk.131	0	0	.	.	.
adk.132	0	0	.	.	.
adk.133	0	0	.	.	.
adk.134	0	0	.	.	.
adk.135	0	0	.	.	.
adk.136	0	0	.	.	.
adk.137	0	0	.	.	.
adk.138	0	0	.	.	.
adk.139	0	0	.	.	.
adk.14	0	0	.	.	.
adk.140	0	0	.	.	.
adk.141	0	0	.	.	.
adk.142	0	0	.	.	.
adk.143	0	0	.	.	.
adk.144	0	0	.	.	.
adk.145	0	0	.	.	.
adk.146	0	0	.	.	.
adk.147	0	0	.	.	.
adk.148	0	0	.	.	.
adk.149	0	0	.	.	.
adk.15	0	0	.	.	.
adk.150	0	0	.	.	.
adk.151	0	0	.	.	.
adk.152	0	0	.	.	.
adk.153	0	0	.	.	.
adk.154	0	0	.	.	.
adk.155	0	0	.	.	.
adk.156	0	0	.	.	.
adk.157	0	0	.	.	.
adk.158	0	0	.	.	.
adk.159	0	0	.	.	.
adk.16	0	0	.	.	.
adk.160	0	0	.	.	.
adk.161	0	0	.	.	.
adk.162	0	0	.	.	.
adk.163	0	0	.	.	.
adk.164	0	0	.	.	.
adk.165	0	0	.	.	.
adk.166	0	0	.	.	.
adk.167	0	0	.	.	.
adk.17	0	0	.	.	.
adk.18	0	0	.	.	.
adk.19	0	0	.	.	.
adk.2	0	0	.	.	.
adk.20	0	0	.	.	.
adk.21	0	0	.	.	.
adk.22	0	0	.	.	.
adk.23	0	0	.	.	.
adk.24	0	0	.	.	.
adk.25	0	0	.	.	.
adk.26	0	0	.	.	.
adk.27	0	0	.	.	.
adk.28	0	0	.	.	.
adk.29	0	0	.	.	.
adk.3	0	0	.	.	.
adk.30	0	0	.	.	.
adk.31	0	0	.	.	.
adk.32	0	0	.	.	.
adk.33	0	0	.	.	.
adk.34	0	0	.	.	.
adk.35	0	0	.	.	.
adk.36	0	0	.	.	.
adk.37	0	0	.	.	.
adk.38	0	0	.	.	.
adk.39	0	0	.	.	.
adk.4	0	0	.	.	.
adk.40	0	0	.	.	.
adk.41	0	0	.	.	.
adk.42	0	0	.	.	.
adk.43	0	0	.	.	.
adk.44	0	0	.	.	.
adk.45	0	0	.	.	.
adk.46	0	0	.	.	.
adk.47	0	0	.	.	.
adk.48	0	0	.	.	.
adk.49	0	0	.	.	.
adk.5	0	0	.	.	.
adk.50	0	0	.	.	.
adk.51	0	0	.	.	.
adk.52	0	0	.	.	.
adk.53	0	0	.	.	.
adk.54	0	0	.	.	.
adk.55	0	0	.	.	.
adk.56	0	0	.	.	.
adk.57	0	0	.	.	.
adk.58	0	0	.	.	.
adk.59	0	0	.	.	.
adk.6	0	0	.	.	.
adk.60	0	0	.	.	.
adk.61	0	0	.	.	.
adk.62	0	0	.	.	.
adk.63	0	0	.	.	.
adk.64	0	0	.	.	.
adk.65	0	0	.	.	.
adk.66	0	0	.	.	.
adk.67	0	0	.	.	.
adk.68	0	0	.	.	.
adk.69	0	0	.	.	.
adk.7	0	0	.	.	.
adk.70	0	0	.	.	.
adk.71	0	0	.	.	.
adk.72	0	0	.	.	.
adk.73	0	0	.	.	.
adk.74	0	0	.	.	.
adk.75	0	0	.	.	.
adk.76	0	0	.	.	.
adk.77	0	0	.	.	.
adk.78	0	0	.	.	.
adk.79	0	0	.	.	.
adk.8	0	0	.	.	.
adk.80	0	0	.	.	.
adk.81	0	0	.	.	.
adk.82	0	0	.	.	.
adk.83	0	0	.	.	.
adk.84	0	0	.	.	.
adk.85	0	0	.	.	.
adk.86	0	0	.	.	.
adk.87	0	0	.	.	.
adk.88	0	0	.	.	.
adk.89	0	0	.	.	.
adk.9	0	0	.	.	.
adk.90	0	0	.	.	.
adk.91	0	0	.	.	.
adk.92	0	0	.	.	.
adk.93	0	0	.	.	.
adk.94	0	0	.	.	.
adk.95	0	0	.	.	.
adk.96	0	0	.	.	.
adk.97	0	0	.	.	.
adk.98	0	0	.	.	.
adk.99	0	0	.	.	.
gyrB.1	0	0	.	.	.
gyrB.100	0	0	.	.	.
gyrB.101	0	0	.	.	.
gyrB.102	0	0	.	.	.
gyrB.103	0	0	.	.	.
gyrB.104	0	0	.	.	.
gyrB.105	0	0	.	.	.
gyrB.106	0	0	.	.	.
gyrB.107	0	0	.	.	.
gyrB.108	0	0	.	.	.
gyrB.109	0	0	.	.	.
gyrB.11	0	0	.	.	.
gyrB.110	0	0	.	.	.
gyrB.111	0	0	.	.	.
gyrB.112	0	0	.	.	.
gyrB.113	0	0	.	.	.
gyrB.114	0	0	.	.	.
gyrB.115	0	0	.	.	.
gyrB.116	0	0	.	.	.
gyrB.117	0	0	.	.	.
gyrB.118	0	0	.	.	.
gyrB.119	0	0	.	.	.
gyrB.12	0	0	.	.	.
gyrB.120	0	0	.	.	.
gyrB.121	0	0	.	.	.
gyrB.122	0	0	.	.	.
gyrB.123	0	0	.	.	.
gyrB.124	0	0	.	.	.
gyrB.125	0	0	.	.	.
gyrB.126	0	0	.	.	.
gyrB.127	0	0	.	.	.
gyrB.128	0	0	.	.	.
gyrB.129	0	0	.	.	.
gyrB.13	0	0	.	.	.
gyrB.130	0	0	.	.	.
gyrB.131	0	0	.	.	.
gyrB.132	0	0	.	.	.
gyrB.133	0	0	.	.	.
gyrB.134	0	0	.	.	.
gyrB.135	0	0	.	.	.
gyrB.136	0	0	.	.	.
gyrB.137	0	0	.	.	.
gyrB.138	0	0	.	.	.
gyrB.139	0	0	.	.	.
gyrB.14	0	0	.	.	.
gyrB.140	0	0	.	.	.
gyrB.141	0	0	.	.	.
gyrB.142	0	0	.	.	.
gyrB.143	0	0	.	.	.
gyrB.144	0	0	.	.	.
gyrB.145	0	0	.	.	.
gyrB.146	0	0	.	.	.
gyrB.147	0	0	.	.	.
gyrB.148	0	0	.	.	.
gyrB.149	0	0	.	.	.
gyrB.15	0	0	.	.	.
gyrB.150	0	0	.	.	.
gyrB.151	0	0	.	.	.
gyrB.152	0	0	.	.	.
gyrB.153	0	0	.	.	.
gyrB.154	0	0	.	.	.
gyrB.155	0	0	.	.	.
gyrB.156	0	0	.	.	.
gyrB.157	0	0	.	.	.
gyrB.158	0	0	.	.	.
gyrB.159	0	0	.	.	.
gyrB.16	0	0	.	.	.
gyrB.160	0	0	.	.	.
gyrB.161	0	0	.	.	.
gyrB.162	0	0	.	.	.
gyrB.163	0	0	.	.	.
gyrB.164	0	0	.	.	.
gyrB.165	0	0	.	.	.
gyrB.166	0	0	.	.	.
gyrB.167	0	0	.	.	.
gyrB.168	0	0	.	.	.
gyrB.169	0	0	.	.	.
gyrB.17	0	0	.	.	.
gyrB.170	0	0	.	.	.
gyrB.171	0	0	.	.	.
gyrB.172	0	0	.	.	.
gyrB.173	0	0	.	.	.
gyrB.174	0	0	.	.	.
gyrB.175	0	0	.	.	.
gyrB.176	0	0	.	.	.
gyrB.177	0	0	.	.	.
gyrB.178	0	0	.	.	.
gyrB.179	0	0	.	.	.
gyrB.18	0	0	.	.	.
gyrB.180	0	0	.	.	.
gyrB.181	0	0	.	.	.
gyrB.182	0	0	.	.	.
gyrB.183	0	0	.	.	.
gyrB.184	0	0	.	.	.
gyrB.185	0	0	.	.	.
gyrB.186	0	0	.	.	.
gyrB.187	0	0	.	.	.
gyrB.188	0	0	.	.	.
gyrB.189	0	0	.	.	.
gyrB.19	0	0	.	.	.
gyrB.190	0	0	.	.	.
gyrB.191	0	0	.	.	.
gyrB.192	0	0	.	.	.
gyrB.193	0	0	.	.	.
gyrB.194	0	0	.	.	.
gyrB.195	0	0	.	.	.
gyrB.196	0	0	.	.	.
gyrB.197	0	0	.	.	.
gyrB.198	0	0	.	.	.
gyrB.199	0	0	.	.	.
gyrB.2	0	0	.	.	.
gyrB.20	0	0	.	.	.
gyrB.200	0	0	.	.	.
gyrB.201	0	0	.	.	.
gyrB.202	0	0	.	.	.
gyrB.203	0	0	.	.	.
gyrB.204	0	0	.	.	.
gyrB.205	0	0	.	.	.
gyrB.21	0	0	.	.	.
gyrB.22	0	0	.	.	.
gyrB.23	0	0	.	.	.
gyrB.25	0	0	.	.	.
gyrB.26	0	0	.	.	.
gyrB.27	0	0	.	.	.
gyrB.28	0	0	.	.	.
gyrB.29	0	0	.	.	.
gyrB.30	0	0	.	.	.
gyrB.31	0	0	.	.	.
gyrB.32	0	0	.	.	.
gyrB.33	0	0	.	.	.
gyrB.34	0	0	.	.	.
gyrB.35	0	0	.	.	.
gyrB.36	0	0	.	.	.
gyrB.37	0	0	.	.	.
gyrB.38	0	0	.	.	.
gyrB.39	0	0	.	.	.
gyrB.4	0	0	.	.	.
gyrB.40	0	0	.	.	.
gyrB.41	0	0	.	.	.
gyrB.42	0	0	.	.	.
gyrB.43	0	0	.	.	.
gyrB.44	0	0	.	.	.
gyrB.46	0	0	.	.	.
gyrB.47	0	0	.	.	.
gyrB.48	0	0	.	.	.
gyrB.49	0	0	.	.	.
gyrB.5	0	0	.	.	.
gyrB.50	0	0	.	.	.
gyrB.51	0	0	.	.	.
gyrB.52	0	0	.	.	.
gyrB.53	0	0	.	.	.
gyrB.54	0	0	.	.	.
gyrB.55	0	0	.	.	.
gyrB.56	0	0	.	.	.
gyrB.57	0	0	.	.	.
gyrB.58	0	0	.	.	.
gyrB.59	0	0	.	.	.
gyrB.6	0	0	.	.	.
gyrB.60	0	0	.	.	.
gyrB.61	0	0	.	.	.
gyrB.62	0	0	.	.	.
gyrB.63	0	0	.	.	.
gyrB.64	0	0	.	.	.
gyrB.65	0	0	.	.	.
gyrB.66	0	0	.	.	.
gyrB.67	0	0	.	.	.
gyrB.68	0	0	.	.	.
gyrB.69	0	0	.	.	.
gyrB.7	0	0	.	.	.
gyrB.70	0	0	.	.	.
gyrB.71	0	0	.	.	.
gyrB.72	0	0	.	.	.
gyrB.73	0	0	.	.	.
gyrB.74	0	0	.	.	.
gyrB.75	0	0	.	.	.
gyrB.76	0	0	.	.	.
gyrB.77	0	0	.	.	.
gyrB.78	0	0	.	.	.
gyrB.79	0	0	.	.	.
gyrB.8	0	0	.	.	.
gyrB.80	0	0	.	.	.
gyrB.81	0	0	.	.	.
gyrB.82	0	0	.	.	.
gyrB.83	0	0	.	.	.
gyrB.84	0	0	.	.	.
gyrB.85	0	0	.	.	.
gyrB.86	0	0	.	.	.
gyrB.87	0	0	.	.	.
gyrB.88	0	0	.	.	.
gyrB.89	0	0	.	.	.
gyrB.9	0	0	.	.	.
gyrB.90	0	0	.	.	.
gyrB.91	0	0	.	.	.
gyrB.92	0	0	.	.	.
gyrB.93	0	0	.	.	.
gyrB.94	0	0	.	.	.
gyrB.95	0	0	.	.	.
gyrB.96	0	0	.	.	.
gyrB.97	0	0	.	.	.
gyrB.98	0	0	.	.	.
gyrB.99	0	0	.	.	.
mdh.1	0	0	.	.	.
mdh.10	0	0	.	.	.
mdh.100	0	0	.	.	.
mdh.101	0	0	.	.	.
mdh.102	0	0	.	.	.
mdh.103	0	0	.	.	.
mdh.104	0	0	.	.	.
mdh.105	0	0	.	.	.
mdh.106	0	0	.	.	.
mdh.107	0	0	.	.	.
mdh.108	0	0	.	.	.
mdh.109	0	0	.	.	.
mdh.11	0	0	.	.	.
mdh.110	0	0	.	.	.
mdh.111	0	0	.	.	.
mdh.112	0	0	.	.	.
mdh.113	0	0	.	.	.
mdh.114	0	0	.	.	.
mdh.115	0	0	.	.	.
mdh.116	0	0	.	.	.
mdh.117	0	0	.	.	.
mdh.118	0	0	.	.	.
mdh.119	0	0	.	.	.
mdh.12	0	0	.	.	.
mdh.120	0	0	.	.	.
mdh.121	0	0	.	.	.
mdh.122	0	0	.	.	.
mdh.123	0	0	.	.	.
mdh.124	0	0	.	.	.
mdh.125	0	0	.	.	.
mdh.126	0	0	.	.	.
mdh.127	0	0	.	.	.
mdh.128	0	0	.	.	.
mdh.129	0	0	.	.	.
mdh.13	0	0	.	.	.
mdh.130	0	0	.	.	.
mdh.131	0	0	.	.	.
mdh.132	0	0	.	.	.
mdh.133	0	0	.	.	.
mdh.134	0	0	.	.	.
mdh.135	0	0	.	.	.
mdh.136	0	0	.	.	.
mdh.137	0	0	.	.	.
mdh.138	0	0	.	.	.
mdh.139	0	0	.	.	.
mdh.14	0	0	.	.	.
mdh.140	0	0	.	.	.
mdh.141	0	0	.	.	.
mdh.142	0	0	.	.	.
mdh.143	0	0	.	.	.
mdh.144	0	0	.	.	.
mdh.145	0	0	.	.	.
mdh.146	0	0	.	.	.
mdh.147	0	0	.	.	.
mdh.148	0	0	.	.	.
mdh.149	0	0	.	.	.
mdh.15	0	0	.	.	.
mdh.150	0	0	.	.	.
mdh.151	0	0	.	.	.
mdh.152	0	0	.	.	.
mdh.153	0	0	.	.	.
mdh.154	0	0	.	.	.
mdh.155	0	0	.	.	.
mdh.156	0	0	.	.	.
mdh.157	0	0	.	.	.
mdh.158	0	0	.	.	.
mdh.159	0	0	.	.	.
mdh.16	0	0	.	.	.
mdh.160	0	0	.	.	.
mdh.161	0	0	.	.	.
mdh.162	0	0	.	.	.
mdh.163	0	0	.	.	.
mdh.164	0	0	.	.	.
mdh.165	0	0	.	.	.
mdh.166	0	0	.	.	.
mdh.167	0	0	.	.	.
mdh.168	0	0	.	.	.
mdh.169	0	0	.	.	.
mdh.17	0	0	.	.	.
mdh.170	0	0	.	.	.
mdh.171	0	0	.	.	.
mdh.172	0	0	.	.	.
mdh.173	0	0	.	.	.
mdh.174	0	0	.	.	.
mdh.175	0	0	.	.	.
mdh.176	0	0	.	.	.
mdh.177	0	0	.	.	.
mdh.178	0	0	.	.	.
mdh.179	0	0	.	.	.
mdh.18	0	0	.	.	.
mdh.180	0	0	.	.	.
mdh.181	0	0	.	.	.
mdh.182	0	0	.	.	.
mdh.183	0	0	.	.	.
mdh.184	0	0	.	.	.
mdh.185	0	0	.	.	.
mdh.186	0	0	.	.	.
mdh.187	0	0	.	.	.
mdh.188	0	0	.	.	.
mdh.189	0	0	.	.	.
mdh.19	0	0	.	.	.
mdh.190	0	0	.	.	.
mdh.191	0	0	.	.	.
mdh.192	0	0	.	.	.
mdh.193	0	0	.	.	.
mdh.194	0	0	.	.	.
mdh.195	0	0	.	.	.
mdh.196	0	0	.	.	.
mdh.197	0	0	.	.	.
mdh.198	0	0	.	.	.
mdh.199	0	0	.	.	.
mdh.2	0	0	.	.	.
mdh.20	0	0	.	.	.
mdh.200	0	0	.	.	.
mdh.201	0	0	.	.	.
mdh.202	0	0	.	.	.
mdh.203	0	0	.	.	.
mdh.204	0	0	.	.	.
mdh.205	0	0	.	.	.
mdh.206	0	0	.	.	.
mdh.207	0	0	.	.	.
mdh.208	0	0	.	.	.
mdh.209	0	0	.	.	.
mdh.21	0	0	.	.	.
mdh.210	0	0	.	.	.
mdh.211	0	0	.	.	.
mdh.212	0	0	.	.	.
mdh.213	0	0	.	.	.
mdh.214	0	0	.	.	.
mdh.215	0	0	.	.	.
mdh.216	0	0	.	.	.
mdh.217	0	0	.	.	.
mdh.218	0	0	.	.	.
mdh.219	0	0	.	.	.
mdh.22	0	0	.	.	.
mdh.23	0	0	.	.	.
mdh.24	0	0	.	.	.
mdh.25	0	0	.	.	.
mdh.26	0	0	.	.	.
mdh.27	0	0	.	.	.
mdh.28	0	0	.	.	.
mdh.29	0	0	.	.	.
mdh.3	0	0	.	.	.
mdh.30	0	0	.	.	.
mdh.31	0	0	.	.	.
mdh.32	0	0	.	.	.
mdh.33	0	0	.	.	.
mdh.34	0	0	.	.	.
mdh.35	0	0	.	.	.
mdh.36	0	0	.	.	.
mdh.37	0	0	.	.	.
mdh.38	0	0	.	.	.
mdh.39	0	0	.	.	.
mdh.4	0	0	.	.	.
mdh.40	0	0	.	.	.
mdh.41	0	0	.	.	.
mdh.42	0	0	.	.	.
mdh.43	0	0	.	.	.
mdh.44	0	0	.	.	.
mdh.45	0	0	.	.	.
mdh.46	0	0	.	.	.
mdh.47	0	0	.	.	.
mdh.48	0	0	.	.	.
mdh.49	0	0	.	.	.
mdh.5	0	0	.	.	.
mdh.50	0	0	.	.	.
mdh.51	0	0	.	.	.
mdh.52	0	0	.	.	.
mdh.53	0	0	.	.	.
mdh.54	0	0	.	.	.
mdh.55	0	0	.	.	.
mdh.56	0	0	.	.	.
mdh.57	0	0	.	.	.
mdh.58	0	0	.	.	.
mdh.59	0	0	.	.	.
mdh.6	0	0	.	.	.
mdh.60	0	0	.	.	.
mdh.61	0	0	.	.	.
mdh.62	0	0	.	.	.
mdh.63	0	0	.	.	.
mdh.64	0	0	.	.	.
mdh.65	0	0	.	.	.
mdh.66	0	0	.	.	.
mdh.67	0	0	.	.	.
mdh.68	0	0	.	.	.
mdh.69	0	0	.	.	.
mdh.7	0	0	.	.	.
mdh.70	0	0	.	.	.
mdh.71	0	0	.	.	.
mdh.72	0	0	.	.	.
mdh.73	0	0	.	.	.
mdh.74	0	0	.	.	.
mdh.75	0	0	.	.	.
mdh.76	0	0	.	.	.
mdh.77	0	0	.	.	.
mdh.78	0	0	.	.	.
mdh.79	0	0	.	.	.
mdh.8	0	0	.	.	.
mdh.80	0	0	.	.	.
mdh.81	0	0	.	.	.
mdh.82	0	0	.	.	.
mdh.83	0	0	.	.	.
mdh.84	0	0	.	.	.
mdh.85	0	0	.	.	.
mdh.86	0	0	.	.	.
mdh.87	0	0	.	.	.
mdh.88	0	0	.	.	.
mdh.89	0	0	.	.	.
mdh.9	0	0	.	.	.
mdh.90	0	0	.	.	.
mdh.91	0	0	.	.	.
mdh.92	0	0	.	.	.
mdh.93	0	0	.	.	.
mdh.94	0	0	.	.	.
mdh.95	0	0	.	.	.
mdh.96	0	0	.	.	.
mdh.97	0	0	.	.	.
mdh.98	0	0	.	.	.
mdh.99	0	0	.	.	.
metE.1	0	0	.	.	.
metE.10	0	0	.	.	.
metE.100	0	0	.	.	.
metE.101	0	0	.	.	.
metE.102	0	0	.	.	.
metE.103	0	0	.	.	.
metE.104	0	0	.	.	.
metE.105	0	0	.	.	.
metE.106	0	0	.	.	.
metE.107	0	0	.	.	.
metE.108	0	0	.	.	.
metE.109	0	0	.	.	.
metE.11	0	0	.	.	.
metE.110	0	0	.	.	.
metE.112	0	0	.	.	.
metE.113	0	0	.	.	.
metE.114	0	0	.	.	.
metE.115	0	0	.	.	.
metE.116	0	0	.	.	.
metE.117	0	0	.	.	.
metE.118	0	0	.	.	.
metE.119	0	0	.	.	.
metE.12	0	0	.	.	.
metE.120	0	0	.	.	.
metE.121	0	0	.	.	.
metE.122	0	0	.	.	.
metE.123	0	0	.	.	.
metE.124	0	0	.	.	.
metE.125	0	0	.	.	.
metE.126	0	0	.	.	.
metE.127	0	0	.	.	.
metE.128	0	0	.	.	.
metE.129	0	0	.	.	.
metE.13	0	0	.	.	.
metE.130	0	0	.	.	.
metE.131	0	0	.	.	.
metE.132	0	0	.	.	.
metE.133	0	0	.	.	.
metE.134	0	0	.	.	.
metE.135	0	0	.	.	.
metE.136	0	0	.	.	.
metE.137	0	0	.	.	.
metE.138	0	0	.	.	.
metE.139	0	0	.	.	.
metE.14	0	0	.	.	.
metE.140	0	0	.	.	.
metE.141	0	0	.	.	.
metE.142	0	0	.	.	.
metE.143	0	0	.	.	.
metE.144	0	0	.	.	.
metE.145	0	0	.	.	.
metE.146	0	0	.	.	.
metE.147	0	0	.	.	.
metE.148	0	0	.	.	.
metE.149	0	0	.	.	.
metE.15	0	0	.	.	.
metE.150	0	0	.	.	.
metE.151	0	0	.	.	.
metE.152	0	0	.	.	.
metE.153	0	0	.	.	.
metE.154	0	0	.	.	.
metE.155	0	0	.	.	.
metE.156	0	0	.	.	.
metE.157	0	0	.	.	.
metE.158	0	0	.	.	.
metE.159	0	0	.	.	.
metE.16	0	0	.	.	.
metE.160	0	0	.	.	.
metE.161	0	0	.	.	.
metE.162	0	0	.	.	.
metE.163	0	0	.	.	.
metE.164	0	0	.	.	.
metE.165	0	0	.	.	.
metE.166	0	0	.	.	.
metE.167	0	0	.	.	.
metE.168	0	0	.	.	.
metE.169	0	0	.	.	.
metE.17	0	0	.	.	.
metE.170	0	0	.	.	.
metE.171	0	0	.	.	.
metE.172	0	0	.	.	.
metE.173	0	0	.	.	.
metE.174	0	0	.	.	.
metE.175	0	0	.	.	.
metE.176	0	0	.	.	.
metE.177	0	0	.	.	.
metE.178	0	0	.	.	.
metE.179	0	0	.	.	.
metE.18	0	0	.	.	.
metE.180	0	0	.	.	.
metE.181	0	0	.	.	.
metE.182	0	0	.	.	.
metE.183	0	0	.	.	.
metE.184	0	0	.	.	.
metE.185	0	0	.	.	.
metE.186	0	0	.	.	.
metE.187	0	0	.	.	.
metE.188	0	0	.	.	.
metE.189	0	0	.	.	.
metE.19	0	0	.	.	.
metE.190	0	0	.	.	.
metE.191	0	0	.	.	.
metE.192	0	0	.	.	.
metE.193	0	0	.	.	.
metE.194	0	0	.	.	.
metE.195	0	0	.	.	.
metE.196	0	0	.	.	.
metE.197	0	0	.	.	.
metE.198	0	0	.	.	.
metE.199	0	0	.	.	.
metE.2	0	0	.	.	.
metE.20	0	0	.	.	.
metE.200	0	0	.	.	.
metE.201	0	0	.	.	.
metE.202	0	0	.	.	.
metE.203	0	0	.	.	.
metE.204	0	0	.	.	.
metE.205	0	0	.	.	.
metE.206	0	0	.	.	.
metE.207	0	0	.	.	.
metE.208	0	0	.	.	.
metE.209	0	0	.	.	.
metE.21	0	0	.	.	.
metE.210	0	0	.	.	.
metE.211	0	0	.	.	.
metE.212	0	0	.	.	.
metE.213	0	0	.	.	.
metE.214	0	0	.	.	.
metE.215	0	0	.	.	.
metE.216	0	0	.	.	.
metE.217	0	0	.	.	.
metE.218	0	0	.	.	.
metE.219	0	0	.	.	.
metE.22	0	0	.	.	.
metE.220	0	0	.	.	.
metE.221	0	0	.	.	.
metE.222	0	0	.	.	.
metE.223	0	0	.	.	.
metE.224	0	0	.	.	.
metE.225	0	0	.	.	.
metE.226	0	0	.	.	.
metE.227	0	0	.	.	.
metE.228	0	0	.	.	.
metE.229	0	0	.	.	.
metE.23	0	0	.	.	.
metE.230	0	0	.	.	.
metE.231	0	0	.	.	.
metE.232	0	0	.	.	.
metE.233	0	0	.	.	.
metE.234	0	0	.	.	.
metE.235	0	0	.	.	.
metE.236	0	0	.	.	.
metE.237	0	0	.	.	.
metE.238	0	0	.	.	.
metE.239	0	0	.	.	.
metE.24	0	0	.	.	.
metE.240	0	0	.	.	.
metE.241	0	0	.	.	.
metE.242	0	0	.	.	.
metE.243	0	0	.	.	.
metE.244	0	0	.	.	.
metE.245	0	0	.	.	.
metE.246	0	0	.	.	.
metE.247	0	0	.	.	.
metE.248	0	0	.	.	.
metE.249	0	0	.	.	.
metE.25	0	0	.	.	.
metE.250	0	0	.	.	.
metE.251	0	0	.	.	.
metE.252	0	0	.	.	.
metE.253	0	0	.	.	.
metE.254	0	0	.	.	.
metE.255	0	0	.	.	.
metE.256	0	0	.	.	.
metE.257	0	0	.	.	.
metE.258	0	0	.	.	.
metE.259	0	0	.	.	.
metE.26	0	0	.	.	.
metE.260	0	0	.	.	.
metE.261	0	0	.	.	.
metE.262	0	0	.	.	.
metE.263	0	0	.	.	.
metE.264	0	0	.	.	.
metE.265	0	0	.	.	.
metE.266	0	0	.	.	.
metE.267	0	0	.	.	.
metE.268	0	0	.	.	.
metE.269	0	0	.	.	.
metE.27	0	0	.	.	.
metE.270	0	0	.	.	.
metE.271	0	0	.	.	.
metE.272	0	0	.	.	.
metE.273	0	0	.	.	.
metE.274	0	0	.	.	.
metE.275	0	0	.	.	.
metE.276	0	0	.	.	.
metE.277	0	0	.	.	.
metE.278	0	0	.	.	.
metE.279	0	0	.	.	.
metE.28	0	0	.	.	.
metE.280	0	0	.	.	.
metE.281	0	0	.	.	.
metE.282	0	0	.	.	.
metE.283	0	0	.	.	.
metE.284	0	0	.	.	.
metE.285	0	0	.	.	.
metE.286	0	0	.	.	.
metE.287	0	0	.	.	.
metE.288	0	0	.	.	.
metE.289	0	0	.	.	.
metE.29	0	0	.	.	.
metE.290	0	0	.	.	.
metE.291	0	0	.	.	.
metE.292	0	0	.	.	.
metE.293	0	0	.	.	.
metE.294	0	0	.	.	.
metE.295	0	0	.	.	.
metE.296	0	0	.	.	.
metE.297	0	0	.	.	.
metE.298	0	0	.	.	.
metE.299	0	0	.	.	.
metE.3	0	0	.	.	.
metE.30	0	0	.	.	.
metE.300	0	0	.	.	.
metE.301	0	0	.	.	.
metE.302	0	0	.	.	.
metE.303	0	0	.	.	.
metE.304	0	0	.	.	.
metE.305	0	0	.	.	.
metE.306	0	0	.	.	.
metE.307	0	0	.	.	.
metE.308	0	0	.	.	.
metE.309	0	0	.	.	.
metE.31	0	0	.	.	.
metE.310	0	0	.	.	.
metE.311	0	0	.	.	.
metE.312	0	0	.	.	.
metE.313	0	0	.	.	.
metE.314	0	0	.	.	.
metE.315	0	0	.	.	.
metE.316	0	0	.	.	.
metE.317	0	0	.	.	.
metE.318	0	0	.	.	.
metE.319	0	0	.	.	.
metE.32	0	0	.	.	.
metE.320	0	0	.	.	.
metE.321	0	0	.	.	.
metE.322	0	0	.	.	.
metE.323	0	0	.	.	.
metE.324	0	0	.	.	.
metE.325	0	0	.	.	.
metE.326	0	0	.	.	.
metE.327	0	0	.	.	.
metE.328	0	0	.	.	.
metE.329	0	0	.	.	.
metE.33	0	0	.	.	.
metE.330	0	0	.	.	.
metE.331	0	0	.	.	.
metE.332	0	0	.	.	.
metE.333	0	0	.	.	.
metE.334	0	0	.	.	.
metE.335	0	0	.	.	.
metE.336	0	0	.	.	.
metE.337	0	0	.	.	.
metE.338	0	0	.	.	.
metE.339	0	0	.	.	.
metE.34	0	0	.	.	.
metE.340	0	0	.	.	.
metE.341	0	0	.	.	.
metE.342	0	0	.	.	.
metE.343	0	0	.	.	.
metE.344	0	0	.	.	.
metE.345	0	0	.	.	.
metE.346	0	0	.	.	.
metE.347	0	0	.	.	.
metE.348	0	0	.	.	.
metE.349	0	0	.	.	.
metE.35	0	0	.	.	.
metE.350	0	0	.	.	.
metE.351	0	0	.	.	.
metE.352	0	0	.	.	.
metE.353	0	0	.	.	.
metE.354	0	0	.	.	.
metE.355	0	0	.	.	.
metE.356	0	0	.	.	.
metE.357	0	0	.	.	.
metE.358	0	0	.	.	.
metE.359	0	0	.	.	.
metE.36	0	0	.	.	.
metE.360	0	0	.	.	.
metE.361	0	0	.	.	.
metE.362	0	0	.	.	.
metE.363	0	0	.	.	.
metE.364	0	0	.	.	.
metE.365	0	0	.	.	.
metE.366	0	0	.	.	.
metE.367	0	0	.	.	.
metE.368	0	0	.	.	.
metE.369	0	0	.	.	.
metE.37	0	0	.	.	.
metE.370	0	0	.	.	.
metE.371	0	0	.	.	.
metE.372	0	0	.	.	.
metE.373	0	0	.	.	.
metE.374	0	0	.	.	.
metE.375	0	0	.	.	.
metE.376	0	0	.	.	.
metE.377	0	0	.	.	.
metE.378	0	0	.	.	.
metE.379	0	0	.	.	.
metE.38	0	0	.	.	.
metE.380	0	0	.	.	.
metE.381	0	0	.	.	.
metE.382	0	0	.	.	.
metE.383	0	0	.	.	.
metE.384	0	0	.	.	.
metE.385	0	0	.	.	.
metE.386	0	0	.	.	.
metE.387	0	0	.	.	.
metE.388	0	0	.	.	.
metE.389	0	0	.	.	.
metE.39	0	0	.	.	.
metE.390	0	0	.	.	.
metE.391	0	0	.	.	.
metE.392	0	0	.	.	.
metE.393	0	0	.	.	.
metE.394	0	0	.	.	.
metE.395	0	0	.	.	.
metE.396	0	0	.	.	.
metE.397	0	0	.	.	.
metE.398	0	0	.	.	.
metE.399	0	0	.	.	.
metE.4	0	0	.	.	.
metE.40	0	0	.	.	.
metE.400	0	0	.	.	.
metE.401	0	0	.	.	.
metE.402	0	0	.	.	.
metE.403	0	0	.	.	.
metE.404	0	0	.	.	.
metE.405	0	0	.	.	.
metE.406	0	0	.	.	.
metE.407	0	0	.	.	.
metE.408	0	0	.	.	.
metE.409	0	0	.	.	.
metE.41	0	0	.	.	.
metE.410	0	0	.	.	.
metE.411	0	0	.	.	.
metE.412	0	0	.	.	.
metE.413	0	0	.	.	.
metE.414	0	0	.	.	.
metE.415	0	0	.	.	.
metE.416	0	0	.	.	.
metE.417	0	0	.	.	.
metE.418	0	0	.	.	.
metE.419	0	0	.	.	.
metE.42	0	0	.	.	.
metE.420	0	0	.	.	.
metE.421	0	0	.	.	.
metE.422	0	0	.	.	.
metE.423	0	0	.	.	.
metE.424	0	0	.	.	.
metE.425	0	0	.	.	.
metE.426	0	0	.	.	.
metE.427	0	0	.	.	.
metE.428	0	0	.	.	.
metE.429	0	0	.	.	.
metE.43	0	0	.	.	.
metE.430	0	0	.	.	.
metE.431	0	0	.	.	.
metE.432	0	0	.	.	.
metE.433	0	0	.	.	.
metE.434	0	0	.	.	.
metE.435	0	0	.	.	.
metE.436	0	0	.	.	.
metE.437	0	0	.	.	.
metE.438	0	0	.	.	.
metE.439	0	0	.	.	.
metE.44	0	0	.	.	.
metE.440	0	0	.	.	.
metE.441	0	0	.	.	.
metE.442	0	0	.	.	.
metE.443	0	0	.	.	.
metE.444	0	0	.	.	.
metE.445	0	0	.	.	.
metE.446	0	0	.	.	.
metE.447	0	0	.	.	.
metE.448	0	0	.	.	.
metE.449	0	0	.	.	.
metE.45	0	0	.	.	.
metE.450	0	0	.	.	.
metE.451	0	0	.	.	.
metE.452	0	0	.	.	.
metE.453	0	0	.	.	.
metE.454	0	0	.	.	.
metE.455	0	0	.	.	.
metE.456	0	0	.	.	.
metE.457	0	0	.	.	.
metE.458	0	0	.	.	.
metE.459	0	0	.	.	.
metE.46	0	0	.	.	.
metE.47	0	0	.	.	.
metE.48	0	0	.	.	.
metE.49	0	0	.	.	.
metE.5	0	0	.	.	.
metE.50	0	0	.	.	.
metE.51	0	0	.	.	.
metE.52	0	0	.	.	.
metE.53	0	0	.	.	.
metE.54	0	0	.	.	.
metE.55	0	0	.	.	.
metE.56	0	0	.	.	.
metE.57	0	0	.	.	.
metE.58	0	0	.	.	.
metE.59	0	0	.	.	.
metE.6	0	0	.	.	.
metE.60	0	0	.	.	.
metE.61	0	0	.	.	.
metE.62	0	0	.	.	.
metE.63	0	0	.	.	.
metE.64	0	0	.	.	.
metE.65	0	0	.	.	.
metE.66	0	0	.	.	.
metE.67	0	0	.	.	.
metE.68	0	0	.	.	.
metE.69	0	0	.	.	.
metE.7	0	0	.	.	.
metE.70	0	0	.	.	.
metE.71	0	0	.	.	.
metE.72	0	0	.	.	.
metE.73	0	0	.	.	.
metE.74	0	0	.	.	.
metE.75	0	0	.	.	.
metE.76	0	0	.	.	.
metE.77	0	0	.	.	.
metE.78	0	0	.	.	.
metE.79	0	0	.	.	.
metE.8	0	0	.	.	.
metE.80	0	0	.	.	.
metE.81	0	0	.	.	.
metE.82	0	0	.	.	.
metE.83	0	0	.	.	.
metE.84	0	0	.	.	.
metE.85	0	0	.	.	.
metE.86	0	0	.	.	.
metE.87	0	0	.	.	.
metE.88	0	0	.	.	.
metE.89	0	0	.	.	.
metE.9	0	0	.	.	.
metE.90	0	0	.	.	.
metE.91	0	0	.	.	.
metE.92	0	0	.	.	.
metE.93	0	0	.	.	.
metE.94	0	0	.	.	.
metE.95	0	0	.	.	.
metE.96	0	0	.	.	.
metE.97	0	0	.	.	.
metE.98	0	0	.	.	.
metE.99	0	0	.	.	.
pntA.1	0	0	.	.	.
pntA.10	0	0	.	.	.
pntA.100	0	0	.	.	.
pntA.101	0	0	.	.	.
pntA.102	0	0	.	.	.
pntA.103	0	0	.	.	.
pntA.104	0	0	.	.	.
pntA.105	0	0	.	.	.
pntA.106	0	0	.	.	.
pntA.107	0	0	.	.	.
pntA.108	0	0	.	.	.
pntA.109	0	0	.	.	.
pntA.11	0	0	.	.	.
pntA.110	0	0	.	.	.
pntA.111	0	0	.	.	.
pntA.112	0	0	.	.	.
pntA.113	0	0	.	.	.
pntA.114	0	0	.	.	.
pntA.115	0	0	.	.	.
pntA.116	0	0	.	.	.
pntA.117	0	0	.	.	.
pntA.118	0	0	.	.	.
pntA.119	0	0	.	.	.
pntA.12	0	0	.	.	.
pntA.120	0	0	.	.	.
pntA.121	0	0	.	.	.
pntA.122	0	0	.	.	.
pntA.123	0	0	.	.	.
pntA.124	0	0	.	.	.
pntA.125	0	0	.	.	.
pntA.126	0	0	.	.	.
pntA.127	0	0	.	.	.
pntA.128	0	0	.	.	.
pntA.129	0	0	.	.	.
pntA.13	0	0	.	.	.
pntA.130	0	0	.	.	.
pntA.131	0	0	.	.	.
pntA.132	0	0	.	.	.
pntA.133	0	0	.	.	.
pntA.134	0	0	.	.	.
pntA.135	0	0	.	.	.
pntA.136	0	0	.	.	.
pntA.137	0	0	.	.	.
pntA.138	0	0	.	.	.
pntA.139	0	0	.	.	.
pntA.14	0	0	.	.	.
pntA.140	0	0	.	.	.
pntA.141	0	0	.	.	.
pntA.142	0	0	.	.	.
pntA.143	0	0	.	.	.
pntA.144	0	0	.	.	.
pntA.145	0	0	.	.	.
pntA.146	0	0	.	.	.
pntA.147	0	0	.	.	.
pntA.148	0	0	.	.	.
pntA.149	0	0	.	.	.
pntA.15	0	0	.	.	.
pntA.150	0	0	.	.	.
pntA.151	0	0	.	.	.
pntA.152	0	0	.	.	.
pntA.153	0	0	.	.	.
pntA.154	0	0	.	.	.
pntA.155	0	0	.	.	.
pntA.156	0	0	.	.	.
pntA.157	0	0	.	.	.
pntA.158	0	0	.	.	.
pntA.159	0	0	.	.	.
pntA.16	0	0	.	.	.
pntA.160	0	0	.	.	.
pntA.161	0	0	.	.	.
pntA.162	0	0	.	.	.
pntA.163	0	0	.	.	.
pntA.164	0	0	.	.	.
pntA.165	0	0	.	.	.
pntA.166	0	0	.	.	.
pntA.167	0	0	.	.	.
pntA.168	0	0	.	.	.
pntA.169	0	0	.	.	.
pntA.17	0	0	.	.	.
pntA.170	0	0	.	.	.
pntA.171	0	0	.	.	.
pntA.172	0	0	.	.	.
pntA.173	0	0	.	.	.
pntA.174	0	0	.	.	.
pntA.175	0	0	.	.	.
pntA.176	0	0	.	.	.
pntA.177	0	0	.	.	.
pntA.178	0	0	.	.	.
pntA.179	0	0	.	.	.
pntA.18	0	0	.	.	.
pntA.180	0	0	.	.	.
pntA.181	0	0	.	.	.
pntA.182	0	0	.	.	.
pntA.183	0	0	.	.	.
pntA.184	0	0	.	.	.
pntA.185	0	0	.	.	.
pntA.186	0	0	.	.	.
pntA.187	0	0	.	.	.
pntA.188	0	0	.	.	.
pntA.189	0	0	.	.	.
pntA.19	0	0	.	.	.
pntA.190	0	0	.	.	.
pntA.191	0	0	.	.	.
pntA.192	0	0	.	.	.
pntA.193	0	0	.	.	.
pntA.194	0	0	.	.	.
pntA.195	0	0	.	.	.
pntA.196	0	0	.	.	.
pntA.197	0	0	.	.	.
pntA.198	0	0	.	.	.
pntA.199	0	0	.	.	.
pntA.2	0	0	.	.	.
pntA.20	0	0	.	.	.
pntA.200	0	0	.	.	.
pntA.201	0	0	.	.	.
pntA.202	0	0	.	.	.
pntA.203	0	0	.	.	.
pntA.204	0	0	.	.	.
pntA.205	0	0	.	.	.
pntA.206	0	0	.	.	.
pntA.207	0	0	.	.	.
pntA.208	0	0	.	.	.
pntA.209	0	0	.	.	.
pntA.21	0	0	.	.	.
pntA.210	0	0	.	.	.
pntA.211	0	0	.	.	.
pntA.212	0	0	.	.	.
pntA.213	0	0	.	.	.
pntA.214	0	0	.	.	.
pntA.215	0	0	.	.	.
pntA.216	0	0	.	.	.
pntA.217	0	0	.	.	.
pntA.218	0	0	.	.	.
pntA.219	0	0	.	.	.
pntA.22	0	0	.	.	.
pntA.220	0	0	.	.	.
pntA.221	0	0	.	.	.
pntA.222	0	0	.	.	.
pntA.223	0	0	.	.	.
pntA.224	0	0	.	.	.
pntA.225	0	0	.	.	.
pntA.226	0	0	.	.	.
pntA.227	0	0	.	.	.
pntA.228	0	0	.	.	.
pntA.229	0	0	.	.	.
pntA.23	0	0	.	.	.
pntA.230	0	0	.	.	.
pntA.231	0	0	.	.	.
pntA.232	0	0	.	.	.
pntA.233	0	0	.	.	.
pntA.234	0	0	.	.	.
pntA.235	0	0	.	.	.
pntA.236	0	0	.	.	.
pntA.237	0	0	.	.	.
pntA.238	0	0	.	.	.
pntA.239	0	0	.	.	.
pntA.24	0	0	.	.	.
pntA.240	0	0	.	.	.
pntA.241	0	0	.	.	.
pntA.25	0	0	.	.	.
pntA.26	0	0	.	.	.
pntA.27	0	0	.	.	.
pntA.28	0	0	.	.	.
pntA.29	0	0	.	.	.
pntA.3	0	0	.	.	.
pntA.30	0	0	.	.	.
pntA.31	0	0	.	.	.
pntA.32	0	0	.	.	.
pntA.33	0	0	.	.	.
pntA.34	0	0	.	.	.
pntA.35	0	0	.	.	.
pntA.36	0	0	.	.	.
pntA.37	0	0	.	.	.
pntA.38	0	0	.	.	.
pntA.39	0	0	.	.	.
pntA.4	0	0	.	.	.
pntA.40	0	0	.	.	.
pntA.41	0	0	.	.	.
pntA.42	0	0	.	.	.
pntA.43	0	0	.	.	.
pntA.44	0	0	.	.	.
pntA.45	0	0	.	.	.
pntA.46	0	0	.	.	.
pntA.47	0	0	.	.	.
pntA.48	0	0	.	.	.
pntA.49	0	0	.	.	.
pntA.5	0	0	.	.	.
pntA.50	0	0	.	.	.
pntA.51	0	0	.	.	.
pntA.52	0	0	.	.	.
pntA.53	0	0	.	.	.
pntA.54	0	0	.	.	.
pntA.55	0	0	.	.	.
pntA.56	0	0	.	.	.
pntA.57	0	0	.	.	.
pntA.58	0	0	.	.	.
pntA.59	0	0	.	.	.
pntA.6	0	0	.	.	.
pntA.60	0	0	.	.	.
pntA.61	0	0	.	.	.
pntA.62	0	0	.	.	.
pntA.63	0	0	.	.	.
pntA.64	0	0	.	.	.
pntA.65	0	0	.	.	.
pntA.66	0	0	.	.	.
pntA.67	0	0	.	.	.
pntA.68	0	0	.	.	.
pntA.69	0	0	.	.	.
pntA.7	0	0	.	.	.
pntA.70	0	0	.	.	.
pntA.71	0	0	.	.	.
pntA.72	0	0	.	.	.
pntA.73	0	0	.	.	.
pntA.74	0	0	.	.	.
pntA.75	0	0	.	.	.
pntA.76	0	0	.	.	.
pntA.77	0	0	.	.	.
pntA.78	0	0	.	.	.
pntA.79	0	0	.	.	.
pntA.8	0	0	.	.	.
pntA.80	0	0	.	.	.
pntA.81	0	0	.	.	.
pntA.82	0	0	.	.	.
pntA.83	0	0	.	.	.
pntA.84	0	0	.	.	.
pntA.85	0	0	.	.	.
pntA.86	0	0	.	.	.
pntA.87	0	0	.	.	.
pntA.88	0	0	.	.	.
pntA.89	0	0	.	.	.
pntA.9	0	0	.	.	.
pntA.90	0	0	.	.	.
pntA.91	0	0	.	.	.
pntA.92	0	0	.	.	.
pntA.93	0	0	.	.	.
pntA.94	0	0	.	.	.
pntA.95	0	0	.	.	.
pntA.96	0	0	.	.	.
pntA.97	0	0	.	.	.
pntA.98	0	0	.	.	.
pntA.99	0	0	.	.	.
purM.1	0	0	.	.	.
purM.10	0	0	.	.	.
purM.100	0	0	.	.	.
purM.101	0	0	.	.	.
purM.102	0	0	.	.	.
purM.103	0	0	.	.	.
purM.104	0	0	.	.	.
purM.105	0	0	.	.	.
purM.106	0	0	.	.	.
purM.107	0	0	.	.	.
purM.108	0	0	.	.	.
purM.109	0	0	.	.	.
purM.11	0	0	.	.	.
purM.110	0	0	.	.	.
purM.111	0	0	.	.	.
purM.112	0	0	.	.	.
purM.113	0	0	.	.	.
purM.114	0	0	.	.	.
purM.115	0	0	.	.	.
purM.116	0	0	.	.	.
purM.117	0	0	.	.	.
purM.118	0	0	.	.	.
purM.119	0	0	.	.	.
purM.12	0	0	.	.	.
purM.120	0	0	.	.	.
purM.121	0	0	.	.	.
purM.122	0	0	.	.	.
purM.123	0	0	.	.	.
purM.124	0	0	.	.	.
purM.125	0	0	.	.	.
purM.126	0	0	.	.	.
purM.127	0	0	.	.	.
purM.128	0	0	.	.	.
purM.129	0	0	.	.	.
purM.13	0	0	.	.	.
purM.130	0	0	.	.	.
purM.131	0	0	.	.	.
purM.132	0	0	.	.	.
purM.133	0	0	.	.	.
purM.134	0	0	.	.	.
purM.135	0	0	.	.	.
purM.136	0	0	.	.	.
purM.137	0	0	.	.	.
purM.138	0	0	.	.	.
purM.139	0	0	.	.	.
purM.14	0	0	.	.	.
purM.140	0	0	.	.	.
purM.141	0	0	.	.	.
purM.142	0	0	.	.	.
purM.143	0	0	.	.	.
purM.144	0	0	.	.	.
purM.145	0	0	.	.	.
purM.146	0	0	.	.	.
purM.147	0	0	.	.	.
purM.148	0	0	.	.	.
purM.149	0	0	.	.	.
purM.15	0	0	.	.	.
purM.150	0	0	.	.	.
purM.151	0	0	.	.	.
purM.152	0	0	.	.	.
purM.153	0	0	.	.	.
purM.154	0	0	.	.	.
purM.155	0	0	.	.	.
purM.156	0	0	.	.	.
purM.157	0	0	.	.	.
purM.158	0	0	.	.	.
purM.159	0	0	.	.	.
purM.16	0	0	.	.	.
purM.160	0	0	.	.	.
purM.161	0	0	.	.	.
purM.162	0	0	.	.	.
purM.163	0	0	.	.	.
purM.164	0	0	.	.	.
purM.165	0	0	.	.	.
purM.166	0	0	.	.	.
purM.167	0	0	.	.	.
purM.168	0	0	.	.	.
purM.169	0	0	.	.	.
purM.17	0	0	.	.	.
purM.170	0	0	.	.	.
purM.171	0	0	.	.	.
purM.18	0	0	.	.	.
purM.19	0	0	.	.	.
purM.2	0	0	.	.	.
purM.20	0	0	.	.	.
purM.21	0	0	.	.	.
purM.22	0	0	.	.	.
purM.23	0	0	.	.	.
purM.24	0	0	.	.	.
purM.25	0	0	.	.	.
purM.26	0	0	.	.	.
purM.27	0	0	.	.	.
purM.28	0	0	.	.	.
purM.29	0	0	.	.	.
purM.3	0	0	.	.	.
purM.30	0	0	.	.	.
purM.31	0	0	.	.	.
purM.32	0	0	.	.	.
purM.33	0	0	.	.	.
purM.34	0	0	.	.	.
purM.35	0	0	.	.	.
purM.36	0	0	.	.	.
purM.37	0	0	.	.	.
purM.38	0	0	.	.	.
purM.39	0	0	.	.	.
purM.4	0	0	.	.	.
purM.40	0	0	.	.	.
purM.41	0	0	.	.	.
purM.42	0	0	.	.	.
purM.43	0	0	.	.	.
purM.44	0	0	.	.	.
purM.45	0	0	.	.	.
purM.46	0	0	.	.	.
purM.47	0	0	.	.	.
purM.48	0	0	.	.	.
purM.49	0	0	.	.	.
purM.5	0	0	.	.	.
purM.50	0	0	.	.	.
purM.51	0	0	.	.	.
purM.52	0	0	.	.	.
purM.53	0	0	.	.	.
purM.54	0	0	.	.	.
purM.55	0	0	.	.	.
purM.56	0	0	.	.	.
purM.57	0	0	.	.	.
purM.58	0	0	.	.	.
purM.59	0	0	.	.	.
purM.6	0	0	.	.	.
purM.60	0	0	.	.	.
purM.61	0	0	.	.	.
purM.62	0	0	.	.	.
purM.63	0	0	.	.	.
purM.64	0	0	.	.	.
purM.65	0	0	.	.	.
purM.66	0	0	.	.	.
purM.67	0	0	.	.	.
purM.68	0	0	.	.	.
purM.69	0	0	.	.	.
purM.7	0	0	.	.	.
purM.70	0	0	.	.	.
purM.71	0	0	.	.	.
purM.72	0	0	.	.	.
purM.73	0	0	.	.	.
purM.74	0	0	.	.	.
purM.75	0	0	.	.	.
purM.76	0	0	.	.	.
purM.77	0	0	.	.	.
purM.78	0	0	.	.	.
purM.79	0	0	.	.	.
purM.8	0	0	.	.	.
purM.80	0	0	.	.	.
purM.81	0	0	.	.	.
purM.82	0	0	.	.	.
purM.83	0	0	.	.	.
purM.84	0	0	.	.	.
purM.85	0	0	.	.	.
purM.86	0	0	.	.	.
purM.87	0	0	.	.	.
purM.88	0	0	.	.	.
purM.89	0	0	.	.	.
purM.9	0	0	.	.	.
purM.90	0	0	.	.	.
purM.91	0	0	.	.	.
purM.92	0	0	.	.	.
purM.93	0	0	.	.	.
purM.94	0	0	.	.	.
purM.95	0	0	.	.	.
purM.96	0	0	.	.	.
purM.97	0	0	.	.	.
purM.98	0	0	.	.	.
purM.99	0	0	.	.	.
pyrC.1	0	0	.	.	.
pyrC.10	0	0	.	.	.
pyrC.100	0	0	.	.	.
pyrC.101	0	0	.	.	.
pyrC.102	0	0	.	.	.
pyrC.103	0	0	.	.	.
pyrC.104	0	0	.	.	.
pyrC.105	0	0	.	.	.
pyrC.106	0	0	.	.	.
pyrC.107	0	0	.	.	.
pyrC.108	0	0	.	.	.
pyrC.109	0	0	.	.	.
pyrC.11	0	0	.	.	.
pyrC.110	0	0	.	.	.
pyrC.111	0	0	.	.	.
pyrC.112	0	0	.	.	.
pyrC.113	0	0	.	.	.
pyrC.114	0	0	.	.	.
pyrC.115	0	0	.	.	.
pyrC.116	0	0	.	.	.
pyrC.117	0	0	.	.	.
pyrC.118	0	0	.	.	.
pyrC.119	0	0	.	.	.
pyrC.12	0	0	.	.	.
pyrC.120	0	0	.	.	.
pyrC.121	0	0	.	.	.
pyrC.122	0	0	.	.	.
pyrC.123	0	0	.	.	.
pyrC.124	0	0	.	.	.
pyrC.125	0	0	.	.	.
pyrC.126	0	0	.	.	.
pyrC.127	0	0	.	.	.
pyrC.128	0	0	.	.	.
pyrC.129	0	0	.	.	.
pyrC.13	0	0	.	.	.
pyrC.130	0	0	.	.	.
pyrC.131	0	0	.	.	.
pyrC.132	0	0	.	.	.
pyrC.133	0	0	.	.	.
pyrC.134	0	0	.	.	.
pyrC.135	0	0	.	.	.
pyrC.136	0	0	.	.	.
pyrC.137	0	0	.	.	.
pyrC.138	0	0	.	.	.
pyrC.139	0	0	.	.	.
pyrC.14	0	0	.	.	.
pyrC.140	0	0	.	.	.
pyrC.141	0	0	.	.	.
pyrC.142	0	0	.	.	.
pyrC.143	0	0	.	.	.
pyrC.144	0	0	.	.	.
pyrC.145	0	0	.	.	.
pyrC.146	0	0	.	.	.
pyrC.147	0	0	.	.	.
pyrC.148	0	0	.	.	.
pyrC.149	0	0	.	.	.
pyrC.15	0	0	.	.	.
pyrC.151	0	0	.	.	.
pyrC.152	0	0	.	.	.
pyrC.153	0	0	.	.	.
pyrC.154	0	0	.	.	.
pyrC.155	0	0	.	.	.
pyrC.156	0	0	.	.	.
pyrC.157	0	0	.	.	.
pyrC.158	0	0	.	.	.
pyrC.159	0	0	.	.	.
pyrC.16	0	0	.	.	.
pyrC.160	0	0	.	.	.
pyrC.161	0	0	.	.	.
pyrC.162	0	0	.	.	.
pyrC.163	0	0	.	.	.
pyrC.164	0	0	.	.	.
pyrC.165	0	0	.	.	.
pyrC.166	0	0	.	.	.
pyrC.167	0	0	.	.	.
pyrC.168	0	0	.	.	.
pyrC.169	0	0	.	.	.
pyrC.17	0	0	.	.	.
pyrC.170	0	0	.	.	.
pyrC.171	0	0	.	.	.
pyrC.172	0	0	.	.	.
pyrC.173	0	0	.	.	.
pyrC.174	0	0	.	.	.
pyrC.175	0	0	.	.	.
pyrC.176	0	0	.	.	.
pyrC.177	0	0	.	.	.
pyrC.178	0	0	.	.	.
pyrC.179	0	0	.	.	.
pyrC.18	0	0	.	.	.
pyrC.180	0	0	.	.	.
pyrC.181	0	0	.	.	.
pyrC.182	0	0	.	.	.
pyrC.183	0	0	.	.	.
pyrC.184	0	0	.	.	.
pyrC.185	0	0	.	.	.
pyrC.186	0	0	.	.	.
pyrC.187	0	0	.	.	.
pyrC.188	0	0	.	.	.
pyrC.189	0	0	.	.	.
pyrC.19	0	0	.	.	.
pyrC.190	0	0	.	.	.
pyrC.191	0	0	.	.	.
pyrC.192	0	0	.	.	.
pyrC.193	0	0	.	.	.
pyrC.194	0	0	.	.	.
pyrC.195	0	0	.	.	.
pyrC.196	0	0	.	.	.
pyrC.197	0	0	.	.	.
pyrC.198	0	0	.	.	.
pyrC.199	0	0	.	.	.
pyrC.2	0	0	.	.	.
pyrC.20	0	0	.	.	.
pyrC.200	0	0	.	.	.
pyrC.201	0	0	.	.	.
pyrC.202	0	0	.	.	.
pyrC.203	0	0	.	.	.
pyrC.204	0	0	.	.	.
pyrC.205	0	0	.	.	.
pyrC.206	0	0	.	.	.
pyrC.207	0	0	.	.	.
pyrC.208	0	0	.	.	.
pyrC.209	0	0	.	.	.
pyrC.21	0	0	.	.	.
pyrC.210	0	0	.	.	.
pyrC.211	0	0	.	.	.
pyrC.212	0	0	.	.	.
pyrC.213	0	0	.	.	.
pyrC.214	0	0	.	.	.
pyrC.215	0	0	.	.	.
pyrC.216	0	0	.	.	.
pyrC.217	0	0	.	.	.
pyrC.218	0	0	.	.	.
pyrC.219	0	0	.	.	.
pyrC.22	0	0	.	.	.
pyrC.220	0	0	.	.	.
pyrC.221	0	0	.	.	.
pyrC.222	0	0	.	.	.
pyrC.223	0	0	.	.	.
pyrC.224	0	0	.	.	.
pyrC.225	0	0	.	.	.
pyrC.226	0	0	.	.	.
pyrC.227	0	0	.	.	.
pyrC.228	0	0	.	.	.
pyrC.229	0	0	.	.	.
pyrC.23	0	0	.	.	.
pyrC.230	0	0	.	.	.
pyrC.231	0	0	.	.	.
pyrC.232	0	0	.	.	.
pyrC.233	0	0	.	.	.
pyrC.234	0	0	.	.	.
pyrC.235	0	0	.	.	.
pyrC.236	0	0	.	.	.
pyrC.237	0	0	.	.	.
pyrC.238	0	0	.	.	.
pyrC.239	0	0	.	.	.
pyrC.24	0	0	.	.	.
pyrC.240	0	0	.	.	.
pyrC.241	0	0	.	.	.
pyrC.242	0	0	.	.	.
pyrC.243	0	0	.	.	.
pyrC.244	0	0	.	.	.
pyrC.245	0	0	.	.	.
pyrC.246	0	0	.	.	.
pyrC.247	0	0	.	.	.
pyrC.248	0	0	.	.	.
pyrC.249	0	0	.	.	.
pyrC.25	0	0	.	.	.
pyrC.250	0	0	.	.	.
pyrC.251	0	0	.	.	.
pyrC.252	0	0	.	.	.
pyrC.253	0	0	.	.	.
pyrC.254	0	0	.	.	.
pyrC.255	0	0	.	.	.
pyrC.256	0	0	.	.	.
pyrC.257	0	0	.	.	.
pyrC.258	0	0	.	.	.
pyrC.259	0	0	.	.	.
pyrC.26	0	0	.	.	.
pyrC.260	0	0	.	.	.
pyrC.261	0	0	.	.	.
pyrC.262	0	0	.	.	.
pyrC.263	0	0	.	.	.
pyrC.264	0	0	.	.	.
pyrC.265	0	0	.	.	.
pyrC.266	0	0	.	.	.
pyrC.267	0	0	.	.	.
pyrC.268	0	0	.	.	.
pyrC.269	0	0	.	.	.
pyrC.27	0	0	.	.	.
pyrC.270	0	0	.	.	.
pyrC.271	0	0	.	.	.
pyrC.272	0	0	.	.	.
pyrC.273	0	0	.	.	.
pyrC.274	0	0	.	.	.
pyrC.275	0	0	.	.	.
pyrC.276	0	0	.	.	.
pyrC.277	0	0	.	.	.
pyrC.278	0	0	.	.	.
pyrC.279	0	0	.	.	.
pyrC.28	0	0	.	.	.
pyrC.280	0	0	.	.	.
pyrC.281	0	0	.	.	.
pyrC.282	0	0	.	.	.
pyrC.283	0	0	.	.	.
pyrC.284	0	0	.	.	.
pyrC.285	0	0	.	.	.
pyrC.286	0	0	.	.	.
pyrC.287	0	0	.	.	.
pyrC.288	0	0	.	.	.
pyrC.289	0	0	.	.	.
pyrC.29	0	0	.	.	.
pyrC.290	0	0	.	.	.
pyrC.291	0	0	.	.	.
pyrC.292	0	0	.	.	.
pyrC.293	0	0	.	.	.
pyrC.294	0	0	.	.	.
pyrC.295	0	0	.	.	.
pyrC.296	0	0	.	.	.
pyrC.297	0	0	.	.	.
pyrC.298	0	0	.	.	.
pyrC.299	0	0	.	.	.
pyrC.3	0	0	.	.	.
pyrC.30	0	0	.	.	.
pyrC.300	0	0	.	.	.
pyrC.301	0	0	.	.	.
pyrC.302	0	0	.	.	.
pyrC.303	0	0	.	.	.
pyrC.304	0	0	.	.	.
pyrC.305	0	0	.	.	.
pyrC.306	0	0	.	.	.
pyrC.307	0	0	.	.	.
pyrC.308	0	0	.	.	.
pyrC.309	0	0	.	.	.
pyrC.31	0	0	.	.	.
pyrC.310	0	0	.	.	.
pyrC.311	0	0	.	.	.
pyrC.312	0	0	.	.	.
pyrC.313	0	0	.	.	.
pyrC.314	0	0	.	.	.
pyrC.315	0	0	.	.	.
pyrC.316	0	0	.	.	.
pyrC.317	0	0	.	.	.
pyrC.318	0	0	.	.	.
pyrC.319	0	0	.	.	.
pyrC.32	0	0	.	.	.
pyrC.320	0	0	.	.	.
pyrC.321	0	0	.	.	.
pyrC.322	0	0	.	.	.
pyrC.323	0	0	.	.	.
pyrC.324	0	0	.	.	.
pyrC.325	0	0	.	.	.
pyrC.326	0	0	.	.	.
pyrC.327	0	0	.	.	.
pyrC.328	0	0	.	.	.
pyrC.329	0	0	.	.	.
pyrC.33	0	0	.	.	.
pyrC.330	0	0	.	.	.
pyrC.331	0	0	.	.	.
pyrC.332	0	0	.	.	.
pyrC.333	0	0	.	.	.
pyrC.334	0	0	.	.	.
pyrC.335	0	0	.	.	.
pyrC.336	0	0	.	.	.
pyrC.337	0	0	.	.	.
pyrC.338	0	0	.	.	.
pyrC.339	0	0	.	.	.
pyrC.34	0	0	.	.	.
pyrC.340	0	0	.	.	.
pyrC.341	0	0	.	.	.
pyrC.342	0	0	.	.	.
pyrC.343	0	0	.	.	.
pyrC.344	0	0	.	.	.
pyrC.345	0	0	.	.	.
pyrC.346	0	0	.	.	.
pyrC.347	0	0	.	.	.
pyrC.348	0	0	.	.	.
pyrC.349	0	0	.	.	.
pyrC.35	0	0	.	.	.
pyrC.350	0	0	.	.	.
pyrC.351	0	0	.	.	.
pyrC.352	0	0	.	.	.
pyrC.36	0	0	.	.	.
pyrC.37	0	0	.	.	.
pyrC.38	0	0	.	.	.
pyrC.39	0	0	.	.	.
pyrC.4	0	0	.	.	.
pyrC.40	0	0	.	.	.
pyrC.41	0	0	.	.	.
pyrC.42	0	0	.	.	.
pyrC.43	0	0	.	.	.
pyrC.44	0	0	.	.	.
pyrC.45	0	0	.	.	.
pyrC.46	0	0	.	.	.
pyrC.47	0	0	.	.	.
pyrC.48	0	0	.	.	.
pyrC.5	0	0	.	.	.
pyrC.50	0	0	.	.	.
pyrC.51	0	0	.	.	.
pyrC.52	0	0	.	.	.
pyrC.53	0	0	.	.	.
pyrC.54	0	0	.	.	.
pyrC.55	0	0	.	.	.
pyrC.56	0	0	.	.	.
pyrC.57	0	0	.	.	.
pyrC.58	0	0	.	.	.
pyrC.59	0	0	.	.	.
pyrC.6	0	0	.	.	.
pyrC.60	0	0	.	.	.
pyrC.61	0	0	.	.	.
pyrC.62	0	0	.	.	.
pyrC.63	0	0	.	.	.
pyrC.64	0	0	.	.	.
pyrC.65	0	0	.	.	.
pyrC.66	0	0	.	.	.
pyrC.67	0	0	.	.	.
pyrC.68	0	0	.	.	.
pyrC.69	0	0	.	.	.
pyrC.7	0	0	.	.	.
pyrC.70	0	0	.	.	.
pyrC.71	0	0	.	.	.
pyrC.72	0	0	.	.	.
pyrC.73	0	0	.	.	.
pyrC.74	0	0	.	.	.
pyrC.75	0	0	.	.	.
pyrC.76	0	0	.	.	.
pyrC.77	0	0	.	.	.
pyrC.78	0	0	.	.	.
pyrC.79	0	0	.	.	.
pyrC.8	0	0	.	.	.
pyrC.80	0	0	.	.	.
pyrC.81	0	0	.	.	.
pyrC.82	0	0	.	.	.
pyrC.83	0	0	.	.	.
pyrC.84	0	0	.	.	.
pyrC.85	0	0	.	.	.
pyrC.86	0	0	.	.	.
pyrC.87	0	0	.	.	.
pyrC.88	0	0	.	.	.
pyrC.89	0	0	.	.	.
pyrC.9	0	0	.	.	.
pyrC.90	0	0	.	.	.
pyrC.91	0	0	.	.	.
pyrC.92	0	0	.	.	.
pyrC.93	0	0	.	.	.
pyrC.94	0	0	.	.	.
pyrC.95	0	0	.	.	.
pyrC.96	0	0	.	.	.
pyrC.97	0	0	.	.	.
pyrC.98	0	0	.	.	.
pyrC.99	0	0	.	.	.
