23S_rRNA.1	23S_rRNA.2	23S_rRNA.3	23S_rRNA.4	23S_rRNA.5	23S_rRNA.6	23S_rRNA.7
ppa.1	ppa.2	ppa.3	ppa.4	ppa.5	ppa.7
aspA.1	aspA.2	aspA.3	aspA.4	aspA.5	aspA.6	aspA.7
aroE.1	aroE.2	aroE.3	aroE.4	aroE.5	aroE.6	aroE.7
atpA.1	atpA.2	atpA.3	atpA.4	atpA.5	atpA.6	atpA.7
tkt.1	tkt.2	tkt.3	tkt.4	tkt.5
cdtB.1	cdtB.2	cdtB.3
