adk	adk.1	adk.2	adk.3	adk.4	adk.5	adk.6	adk.7	adk.8	adk.9
atpD	atpD.1	atpD.10	atpD.2	atpD.3	atpD.4	atpD.5	atpD.6	atpD.7	atpD.8	atpD.9
dnaJ	dnaJ.1	dnaJ.10	dnaJ.2	dnaJ.3	dnaJ.4	dnaJ.5	dnaJ.6	dnaJ.7	dnaJ.8	dnaJ.9
gapA	gapA.1	gapA.10	gapA.11	gapA.2	gapA.3	gapA.4	gapA.5	gapA.6	gapA.7	gapA.8	gapA.9
glnA	glnA.1	glnA.2	glnA.3	glnA.4	glnA.5	glnA.6	glnA.7	glnA.8	glnA.9
hsp60	hsp60.1	hsp60.10	hsp60.11	hsp60.12	hsp60.2	hsp60.3	hsp60.4	hsp60.5	hsp60.6	hsp60.7	hsp60.8	hsp60.9
phoR	phoR.1	phoR.10	phoR.11	phoR.12	phoR.13	phoR.14	phoR.2	phoR.3	phoR.4	phoR.5	phoR.6	phoR.7	phoR.8	phoR.9
pyrG	pyrG.1	pyrG.10	pyrG.11	pyrG.12	pyrG.13	pyrG.14	pyrG.15	pyrG.16	pyrG.2	pyrG.3	pyrG.4	pyrG.5	pyrG.6	pyrG.7	pyrG.8	pyrG.9
rpoA	rpoA.1	rpoA.2	rpoA.3	rpoA.4	rpoA.5	rpoA.6
tuf	tuf.1	tuf.2	tuf.3	tuf.4	tuf.5	tuf.6	tuf.7	tuf.8	tuf.9
