Bpi_adh.1	0	0	.	.	.
Bpi_adh.10	0	0	.	.	.
Bpi_adh.14	0	0	.	.	.
Bpi_adh.15	0	0	.	.	.
Bpi_adh.17	0	0	.	.	.
Bpi_adh.18	0	0	.	.	.
Bpi_adh.2	0	0	.	.	.
Bpi_adh.21	0	0	.	.	.
Bpi_adh.24	0	0	.	.	.
Bpi_adh.25	0	0	.	.	.
Bpi_adh.27	0	0	.	.	.
Bpi_adh.28	0	0	.	.	.
Bpi_adh.29	0	0	.	.	.
Bpi_adh.3	0	0	.	.	.
Bpi_adh.30	0	0	.	.	.
Bpi_adh.32	0	0	.	.	.
Bpi_adh.34	0	0	.	.	.
Bpi_adh.35	0	0	.	.	.
Bpi_adh.36	0	0	.	.	.
Bpi_adh.38	0	0	.	.	.
Bpi_adh.39	0	0	.	.	.
Bpi_adh.4	0	0	.	.	.
Bpi_adh.43	0	0	.	.	.
Bpi_adh.44	0	0	.	.	.
Bpi_adh.46	0	0	.	.	.
Bpi_adh.48	0	0	.	.	.
Bpi_adh.49	0	0	.	.	.
Bpi_adh.5	0	0	.	.	.
Bpi_adh.50	0	0	.	.	.
Bpi_adh.51	0	0	.	.	.
Bpi_adh.52	0	0	.	.	.
Bpi_adh.53	0	0	.	.	.
Bpi_adh.54	0	0	.	.	.
Bpi_adh.55	0	0	.	.	.
Bpi_adh.56	0	0	.	.	.
Bpi_adh.57	0	0	.	.	.
Bpi_adh.58	0	0	.	.	.
Bpi_adh.59	0	0	.	.	.
Bpi_adh.6	0	0	.	.	.
Bpi_adh.8	0	0	.	.	.
Bpi_adh.9	0	0	.	.	.
Bpi_alp.1	0	0	.	.	.
Bpi_alp.10	0	0	.	.	.
Bpi_alp.100	0	0	.	.	.
Bpi_alp.101	0	0	.	.	.
Bpi_alp.102	0	0	.	.	.
Bpi_alp.103	0	0	.	.	.
Bpi_alp.104	0	0	.	.	.
Bpi_alp.105	0	0	.	.	.
Bpi_alp.106	0	0	.	.	.
Bpi_alp.107	0	0	.	.	.
Bpi_alp.108	0	0	.	.	.
Bpi_alp.109	0	0	.	.	.
Bpi_alp.11	0	0	.	.	.
Bpi_alp.110	0	0	.	.	.
Bpi_alp.111	0	0	.	.	.
Bpi_alp.112	0	0	.	.	.
Bpi_alp.113	0	0	.	.	.
Bpi_alp.114	0	0	.	.	.
Bpi_alp.115	0	0	.	.	.
Bpi_alp.116	0	0	.	.	.
Bpi_alp.117	0	0	.	.	.
Bpi_alp.118	0	0	.	.	.
Bpi_alp.119	0	0	.	.	.
Bpi_alp.120	0	0	.	.	.
Bpi_alp.121	0	0	.	.	.
Bpi_alp.122	0	0	.	.	.
Bpi_alp.123	0	0	.	.	.
Bpi_alp.124	0	0	.	.	.
Bpi_alp.125	0	0	.	.	.
Bpi_alp.126	0	0	.	.	.
Bpi_alp.127	0	0	.	.	.
Bpi_alp.128	0	0	.	.	.
Bpi_alp.129	0	0	.	.	.
Bpi_alp.130	0	0	.	.	.
Bpi_alp.16	0	0	.	.	.
Bpi_alp.17	0	0	.	.	.
Bpi_alp.19	0	0	.	.	.
Bpi_alp.2	0	0	.	.	.
Bpi_alp.20	0	0	.	.	.
Bpi_alp.21	0	0	.	.	.
Bpi_alp.22	0	0	.	.	.
Bpi_alp.23	0	0	.	.	.
Bpi_alp.27	0	0	.	.	.
Bpi_alp.28	0	0	.	.	.
Bpi_alp.29	0	0	.	.	.
Bpi_alp.3	0	0	.	.	.
Bpi_alp.30	0	0	.	.	.
Bpi_alp.31	0	0	.	.	.
Bpi_alp.32	0	0	.	.	.
Bpi_alp.33	0	0	.	.	.
Bpi_alp.34	0	0	.	.	.
Bpi_alp.35	0	0	.	.	.
Bpi_alp.37	0	0	.	.	.
Bpi_alp.40	0	0	.	.	.
Bpi_alp.42	0	0	.	.	.
Bpi_alp.45	0	0	.	.	.
Bpi_alp.47	0	0	.	.	.
Bpi_alp.50	0	0	.	.	.
Bpi_alp.51	0	0	.	.	.
Bpi_alp.53	0	0	.	.	.
Bpi_alp.55	0	0	.	.	.
Bpi_alp.56	0	0	.	.	.
Bpi_alp.57	0	0	.	.	.
Bpi_alp.58	0	0	.	.	.
Bpi_alp.60	0	0	.	.	.
Bpi_alp.61	0	0	.	.	.
Bpi_alp.62	0	0	.	.	.
Bpi_alp.63	0	0	.	.	.
Bpi_alp.64	0	0	.	.	.
Bpi_alp.66	0	0	.	.	.
Bpi_alp.67	0	0	.	.	.
Bpi_alp.68	0	0	.	.	.
Bpi_alp.69	0	0	.	.	.
Bpi_alp.7	0	0	.	.	.
Bpi_alp.70	0	0	.	.	.
Bpi_alp.71	0	0	.	.	.
Bpi_alp.72	0	0	.	.	.
Bpi_alp.73	0	0	.	.	.
Bpi_alp.75	0	0	.	.	.
Bpi_alp.76	0	0	.	.	.
Bpi_alp.77	0	0	.	.	.
Bpi_alp.8	0	0	.	.	.
Bpi_alp.83	0	0	.	.	.
Bpi_alp.84	0	0	.	.	.
Bpi_alp.87	0	0	.	.	.
Bpi_alp.88	0	0	.	.	.
Bpi_alp.89	0	0	.	.	.
Bpi_alp.9	0	0	.	.	.
Bpi_alp.90	0	0	.	.	.
Bpi_alp.91	0	0	.	.	.
Bpi_alp.92	0	0	.	.	.
Bpi_alp.93	0	0	.	.	.
Bpi_alp.94	0	0	.	.	.
Bpi_alp.95	0	0	.	.	.
Bpi_alp.96	0	0	.	.	.
Bpi_alp.97	0	0	.	.	.
Bpi_alp.98	0	0	.	.	.
Bpi_alp.99	0	0	.	.	.
Bpi_est.1	0	0	.	.	.
Bpi_est.10	0	0	.	.	.
Bpi_est.100	0	0	.	.	.
Bpi_est.101	0	0	.	.	.
Bpi_est.102	0	0	.	.	.
Bpi_est.103	0	0	.	.	.
Bpi_est.104	0	0	.	.	.
Bpi_est.105	0	0	.	.	.
Bpi_est.106	0	0	.	.	.
Bpi_est.107	0	0	.	.	.
Bpi_est.108	0	0	.	.	.
Bpi_est.109	0	0	.	.	.
Bpi_est.11	0	0	.	.	.
Bpi_est.110	0	0	.	.	.
Bpi_est.111	0	0	.	.	.
Bpi_est.112	0	0	.	.	.
Bpi_est.113	0	0	.	.	.
Bpi_est.114	0	0	.	.	.
Bpi_est.115	0	0	.	.	.
Bpi_est.116	0	0	.	.	.
Bpi_est.117	0	0	.	.	.
Bpi_est.118	0	0	.	.	.
Bpi_est.119	0	0	.	.	.
Bpi_est.12	0	0	.	.	.
Bpi_est.120	0	0	.	.	.
Bpi_est.121	0	0	.	.	.
Bpi_est.122	0	0	.	.	.
Bpi_est.123	0	0	.	.	.
Bpi_est.124	0	0	.	.	.
Bpi_est.125	0	0	.	.	.
Bpi_est.126	0	0	.	.	.
Bpi_est.127	0	0	.	.	.
Bpi_est.128	0	0	.	.	.
Bpi_est.129	0	0	.	.	.
Bpi_est.130	0	0	.	.	.
Bpi_est.131	0	0	.	.	.
Bpi_est.132	0	0	.	.	.
Bpi_est.133	0	0	.	.	.
Bpi_est.134	0	0	.	.	.
Bpi_est.135	0	0	.	.	.
Bpi_est.136	0	0	.	.	.
Bpi_est.18	0	0	.	.	.
Bpi_est.19	0	0	.	.	.
Bpi_est.2	0	0	.	.	.
Bpi_est.21	0	0	.	.	.
Bpi_est.22	0	0	.	.	.
Bpi_est.28	0	0	.	.	.
Bpi_est.29	0	0	.	.	.
Bpi_est.3	0	0	.	.	.
Bpi_est.30	0	0	.	.	.
Bpi_est.32	0	0	.	.	.
Bpi_est.33	0	0	.	.	.
Bpi_est.34	0	0	.	.	.
Bpi_est.35	0	0	.	.	.
Bpi_est.36	0	0	.	.	.
Bpi_est.39	0	0	.	.	.
Bpi_est.4	0	0	.	.	.
Bpi_est.42	0	0	.	.	.
Bpi_est.44	0	0	.	.	.
Bpi_est.46	0	0	.	.	.
Bpi_est.49	0	0	.	.	.
Bpi_est.52	0	0	.	.	.
Bpi_est.54	0	0	.	.	.
Bpi_est.60	0	0	.	.	.
Bpi_est.61	0	0	.	.	.
Bpi_est.64	0	0	.	.	.
Bpi_est.67	0	0	.	.	.
Bpi_est.68	0	0	.	.	.
Bpi_est.69	0	0	.	.	.
Bpi_est.7	0	0	.	.	.
Bpi_est.70	0	0	.	.	.
Bpi_est.71	0	0	.	.	.
Bpi_est.72	0	0	.	.	.
Bpi_est.73	0	0	.	.	.
Bpi_est.79	0	0	.	.	.
Bpi_est.81	0	0	.	.	.
Bpi_est.82	0	0	.	.	.
Bpi_est.83	0	0	.	.	.
Bpi_est.84	0	0	.	.	.
Bpi_est.89	0	0	.	.	.
Bpi_est.9	0	0	.	.	.
Bpi_est.90	0	0	.	.	.
Bpi_est.93	0	0	.	.	.
Bpi_est.94	0	0	.	.	.
Bpi_est.95	0	0	.	.	.
Bpi_est.96	0	0	.	.	.
Bpi_est.97	0	0	.	.	.
Bpi_est.98	0	0	.	.	.
Bpi_est.99	0	0	.	.	.
Bpi_gdh.1	0	0	.	.	.
Bpi_gdh.11	0	0	.	.	.
Bpi_gdh.12	0	0	.	.	.
Bpi_gdh.14	0	0	.	.	.
Bpi_gdh.15	0	0	.	.	.
Bpi_gdh.16	0	0	.	.	.
Bpi_gdh.18	0	0	.	.	.
Bpi_gdh.2	0	0	.	.	.
Bpi_gdh.21	0	0	.	.	.
Bpi_gdh.22	0	0	.	.	.
Bpi_gdh.23	0	0	.	.	.
Bpi_gdh.24	0	0	.	.	.
Bpi_gdh.25	0	0	.	.	.
Bpi_gdh.26	0	0	.	.	.
Bpi_gdh.27	0	0	.	.	.
Bpi_gdh.28	0	0	.	.	.
Bpi_gdh.29	0	0	.	.	.
Bpi_gdh.3	0	0	.	.	.
Bpi_gdh.31	0	0	.	.	.
Bpi_gdh.32	0	0	.	.	.
Bpi_gdh.34	0	0	.	.	.
Bpi_gdh.35	0	0	.	.	.
Bpi_gdh.36	0	0	.	.	.
Bpi_gdh.37	0	0	.	.	.
Bpi_gdh.38	0	0	.	.	.
Bpi_gdh.39	0	0	.	.	.
Bpi_gdh.40	0	0	.	.	.
Bpi_gdh.41	0	0	.	.	.
Bpi_gdh.42	0	0	.	.	.
Bpi_gdh.43	0	0	.	.	.
Bpi_gdh.44	0	0	.	.	.
Bpi_gdh.45	0	0	.	.	.
Bpi_gdh.49	0	0	.	.	.
Bpi_gdh.50	0	0	.	.	.
Bpi_gdh.51	0	0	.	.	.
Bpi_gdh.52	0	0	.	.	.
Bpi_gdh.53	0	0	.	.	.
Bpi_gdh.58	0	0	.	.	.
Bpi_gdh.6	0	0	.	.	.
Bpi_gdh.60	0	0	.	.	.
Bpi_gdh.62	0	0	.	.	.
Bpi_gdh.63	0	0	.	.	.
Bpi_gdh.64	0	0	.	.	.
Bpi_gdh.65	0	0	.	.	.
Bpi_gdh.66	0	0	.	.	.
Bpi_gdh.67	0	0	.	.	.
Bpi_gdh.68	0	0	.	.	.
Bpi_gdh.69	0	0	.	.	.
Bpi_gdh.7	0	0	.	.	.
Bpi_gdh.70	0	0	.	.	.
Bpi_gdh.71	0	0	.	.	.
Bpi_gdh.72	0	0	.	.	.
Bpi_gdh.73	0	0	.	.	.
Bpi_gdh.74	0	0	.	.	.
Bpi_gdh.75	0	0	.	.	.
Bpi_gdh.76	0	0	.	.	.
Bpi_gdh.77	0	0	.	.	.
Bpi_gdh.78	0	0	.	.	.
Bpi_gdh.79	0	0	.	.	.
Bpi_gdh.8	0	0	.	.	.
Bpi_gdh.80	0	0	.	.	.
Bpi_gdh.81	0	0	.	.	.
Bpi_gdh.82	0	0	.	.	.
Bpi_gdh.83	0	0	.	.	.
Bpi_gdh.84	0	0	.	.	.
Bpi_gdh.9	0	0	.	.	.
Bpi_glpK.1	0	0	.	.	.
Bpi_glpK.100	0	0	.	.	.
Bpi_glpK.101	0	0	.	.	.
Bpi_glpK.102	0	0	.	.	.
Bpi_glpK.103	0	0	.	.	.
Bpi_glpK.104	0	0	.	.	.
Bpi_glpK.105	0	0	.	.	.
Bpi_glpK.106	0	0	.	.	.
Bpi_glpK.107	0	0	.	.	.
Bpi_glpK.108	0	0	.	.	.
Bpi_glpK.12	0	0	.	.	.
Bpi_glpK.13	0	0	.	.	.
Bpi_glpK.14	0	0	.	.	.
Bpi_glpK.15	0	0	.	.	.
Bpi_glpK.16	0	0	.	.	.
Bpi_glpK.17	0	0	.	.	.
Bpi_glpK.18	0	0	.	.	.
Bpi_glpK.19	0	0	.	.	.
Bpi_glpK.2	0	0	.	.	.
Bpi_glpK.23	0	0	.	.	.
Bpi_glpK.24	0	0	.	.	.
Bpi_glpK.25	0	0	.	.	.
Bpi_glpK.27	0	0	.	.	.
Bpi_glpK.28	0	0	.	.	.
Bpi_glpK.29	0	0	.	.	.
Bpi_glpK.3	0	0	.	.	.
Bpi_glpK.30	0	0	.	.	.
Bpi_glpK.31	0	0	.	.	.
Bpi_glpK.34	0	0	.	.	.
Bpi_glpK.36	0	0	.	.	.
Bpi_glpK.38	0	0	.	.	.
Bpi_glpK.40	0	0	.	.	.
Bpi_glpK.41	0	0	.	.	.
Bpi_glpK.44	0	0	.	.	.
Bpi_glpK.45	0	0	.	.	.
Bpi_glpK.5	0	0	.	.	.
Bpi_glpK.50	0	0	.	.	.
Bpi_glpK.52	0	0	.	.	.
Bpi_glpK.53	0	0	.	.	.
Bpi_glpK.54	0	0	.	.	.
Bpi_glpK.56	0	0	.	.	.
Bpi_glpK.58	0	0	.	.	.
Bpi_glpK.59	0	0	.	.	.
Bpi_glpK.6	0	0	.	.	.
Bpi_glpK.64	0	0	.	.	.
Bpi_glpK.65	0	0	.	.	.
Bpi_glpK.66	0	0	.	.	.
Bpi_glpK.68	0	0	.	.	.
Bpi_glpK.7	0	0	.	.	.
Bpi_glpK.72	0	0	.	.	.
Bpi_glpK.74	0	0	.	.	.
Bpi_glpK.76	0	0	.	.	.
Bpi_glpK.77	0	0	.	.	.
Bpi_glpK.78	0	0	.	.	.
Bpi_glpK.79	0	0	.	.	.
Bpi_glpK.8	0	0	.	.	.
Bpi_glpK.80	0	0	.	.	.
Bpi_glpK.81	0	0	.	.	.
Bpi_glpK.82	0	0	.	.	.
Bpi_glpK.83	0	0	.	.	.
Bpi_glpK.84	0	0	.	.	.
Bpi_glpK.85	0	0	.	.	.
Bpi_glpK.86	0	0	.	.	.
Bpi_glpK.87	0	0	.	.	.
Bpi_glpK.88	0	0	.	.	.
Bpi_glpK.89	0	0	.	.	.
Bpi_glpK.90	0	0	.	.	.
Bpi_glpK.91	0	0	.	.	.
Bpi_glpK.92	0	0	.	.	.
Bpi_glpK.93	0	0	.	.	.
Bpi_glpK.94	0	0	.	.	.
Bpi_glpK.95	0	0	.	.	.
Bpi_glpK.96	0	0	.	.	.
Bpi_glpK.97	0	0	.	.	.
Bpi_glpK.98	0	0	.	.	.
Bpi_glpK.99	0	0	.	.	.
Bpi_pgm.1	0	0	.	.	.
Bpi_pgm.100	0	0	.	.	.
Bpi_pgm.101	0	0	.	.	.
Bpi_pgm.102	0	0	.	.	.
Bpi_pgm.105	0	0	.	.	.
Bpi_pgm.106	0	0	.	.	.
Bpi_pgm.109	0	0	.	.	.
Bpi_pgm.11	0	0	.	.	.
Bpi_pgm.110	0	0	.	.	.
Bpi_pgm.111	0	0	.	.	.
Bpi_pgm.112	0	0	.	.	.
Bpi_pgm.113	0	0	.	.	.
Bpi_pgm.114	0	0	.	.	.
Bpi_pgm.115	0	0	.	.	.
Bpi_pgm.116	0	0	.	.	.
Bpi_pgm.117	0	0	.	.	.
Bpi_pgm.118	0	0	.	.	.
Bpi_pgm.119	0	0	.	.	.
Bpi_pgm.12	0	0	.	.	.
Bpi_pgm.120	0	0	.	.	.
Bpi_pgm.121	0	0	.	.	.
Bpi_pgm.122	0	0	.	.	.
Bpi_pgm.123	0	0	.	.	.
Bpi_pgm.124	0	0	.	.	.
Bpi_pgm.125	0	0	.	.	.
Bpi_pgm.126	0	0	.	.	.
Bpi_pgm.127	0	0	.	.	.
Bpi_pgm.128	0	0	.	.	.
Bpi_pgm.129	0	0	.	.	.
Bpi_pgm.130	0	0	.	.	.
Bpi_pgm.131	0	0	.	.	.
Bpi_pgm.132	0	0	.	.	.
Bpi_pgm.133	0	0	.	.	.
Bpi_pgm.134	0	0	.	.	.
Bpi_pgm.135	0	0	.	.	.
Bpi_pgm.136	0	0	.	.	.
Bpi_pgm.137	0	0	.	.	.
Bpi_pgm.138	0	0	.	.	.
Bpi_pgm.139	0	0	.	.	.
Bpi_pgm.140	0	0	.	.	.
Bpi_pgm.141	0	0	.	.	.
Bpi_pgm.142	0	0	.	.	.
Bpi_pgm.143	0	0	.	.	.
Bpi_pgm.144	0	0	.	.	.
Bpi_pgm.145	0	0	.	.	.
Bpi_pgm.146	0	0	.	.	.
Bpi_pgm.147	0	0	.	.	.
Bpi_pgm.148	0	0	.	.	.
Bpi_pgm.149	0	0	.	.	.
Bpi_pgm.150	0	0	.	.	.
Bpi_pgm.151	0	0	.	.	.
Bpi_pgm.152	0	0	.	.	.
Bpi_pgm.18	0	0	.	.	.
Bpi_pgm.2	0	0	.	.	.
Bpi_pgm.21	0	0	.	.	.
Bpi_pgm.23	0	0	.	.	.
Bpi_pgm.25	0	0	.	.	.
Bpi_pgm.26	0	0	.	.	.
Bpi_pgm.35	0	0	.	.	.
Bpi_pgm.36	0	0	.	.	.
Bpi_pgm.37	0	0	.	.	.
Bpi_pgm.39	0	0	.	.	.
Bpi_pgm.40	0	0	.	.	.
Bpi_pgm.41	0	0	.	.	.
Bpi_pgm.42	0	0	.	.	.
Bpi_pgm.43	0	0	.	.	.
Bpi_pgm.45	0	0	.	.	.
Bpi_pgm.46	0	0	.	.	.
Bpi_pgm.49	0	0	.	.	.
Bpi_pgm.50	0	0	.	.	.
Bpi_pgm.52	0	0	.	.	.
Bpi_pgm.55	0	0	.	.	.
Bpi_pgm.56	0	0	.	.	.
Bpi_pgm.57	0	0	.	.	.
Bpi_pgm.60	0	0	.	.	.
Bpi_pgm.64	0	0	.	.	.
Bpi_pgm.66	0	0	.	.	.
Bpi_pgm.69	0	0	.	.	.
Bpi_pgm.71	0	0	.	.	.
Bpi_pgm.76	0	0	.	.	.
Bpi_pgm.80	0	0	.	.	.
Bpi_pgm.82	0	0	.	.	.
Bpi_pgm.83	0	0	.	.	.
Bpi_pgm.84	0	0	.	.	.
Bpi_pgm.85	0	0	.	.	.
Bpi_pgm.86	0	0	.	.	.
Bpi_pgm.88	0	0	.	.	.
Bpi_pgm.9	0	0	.	.	.
Bpi_pgm.92	0	0	.	.	.
Bpi_pgm.93	0	0	.	.	.
Bpi_pgm.96	0	0	.	.	.
Bpi_pgm.97	0	0	.	.	.
Bpi_pgm.98	0	0	.	.	.
Bpi_pgm.99	0	0	.	.	.
Bpi_thi.1	0	0	.	.	.
Bpi_thi.10	0	0	.	.	.
Bpi_thi.100	0	0	.	.	.
Bpi_thi.101	0	0	.	.	.
Bpi_thi.102	0	0	.	.	.
Bpi_thi.103	0	0	.	.	.
Bpi_thi.104	0	0	.	.	.
Bpi_thi.105	0	0	.	.	.
Bpi_thi.106	0	0	.	.	.
Bpi_thi.107	0	0	.	.	.
Bpi_thi.108	0	0	.	.	.
Bpi_thi.109	0	0	.	.	.
Bpi_thi.110	0	0	.	.	.
Bpi_thi.111	0	0	.	.	.
Bpi_thi.112	0	0	.	.	.
Bpi_thi.113	0	0	.	.	.
Bpi_thi.114	0	0	.	.	.
Bpi_thi.115	0	0	.	.	.
Bpi_thi.116	0	0	.	.	.
Bpi_thi.117	0	0	.	.	.
Bpi_thi.118	0	0	.	.	.
Bpi_thi.119	0	0	.	.	.
Bpi_thi.120	0	0	.	.	.
Bpi_thi.121	0	0	.	.	.
Bpi_thi.122	0	0	.	.	.
Bpi_thi.123	0	0	.	.	.
Bpi_thi.124	0	0	.	.	.
Bpi_thi.125	0	0	.	.	.
Bpi_thi.126	0	0	.	.	.
Bpi_thi.127	0	0	.	.	.
Bpi_thi.128	0	0	.	.	.
Bpi_thi.129	0	0	.	.	.
Bpi_thi.13	0	0	.	.	.
Bpi_thi.130	0	0	.	.	.
Bpi_thi.131	0	0	.	.	.
Bpi_thi.132	0	0	.	.	.
Bpi_thi.133	0	0	.	.	.
Bpi_thi.134	0	0	.	.	.
Bpi_thi.135	0	0	.	.	.
Bpi_thi.136	0	0	.	.	.
Bpi_thi.137	0	0	.	.	.
Bpi_thi.138	0	0	.	.	.
Bpi_thi.139	0	0	.	.	.
Bpi_thi.140	0	0	.	.	.
Bpi_thi.141	0	0	.	.	.
Bpi_thi.142	0	0	.	.	.
Bpi_thi.15	0	0	.	.	.
Bpi_thi.16	0	0	.	.	.
Bpi_thi.18	0	0	.	.	.
Bpi_thi.19	0	0	.	.	.
Bpi_thi.2	0	0	.	.	.
Bpi_thi.21	0	0	.	.	.
Bpi_thi.25	0	0	.	.	.
Bpi_thi.26	0	0	.	.	.
Bpi_thi.29	0	0	.	.	.
Bpi_thi.3	0	0	.	.	.
Bpi_thi.30	0	0	.	.	.
Bpi_thi.31	0	0	.	.	.
Bpi_thi.32	0	0	.	.	.
Bpi_thi.35	0	0	.	.	.
Bpi_thi.38	0	0	.	.	.
Bpi_thi.4	0	0	.	.	.
Bpi_thi.40	0	0	.	.	.
Bpi_thi.42	0	0	.	.	.
Bpi_thi.44	0	0	.	.	.
Bpi_thi.45	0	0	.	.	.
Bpi_thi.47	0	0	.	.	.
Bpi_thi.48	0	0	.	.	.
Bpi_thi.49	0	0	.	.	.
Bpi_thi.5	0	0	.	.	.
Bpi_thi.51	0	0	.	.	.
Bpi_thi.53	0	0	.	.	.
Bpi_thi.56	0	0	.	.	.
Bpi_thi.60	0	0	.	.	.
Bpi_thi.61	0	0	.	.	.
Bpi_thi.62	0	0	.	.	.
Bpi_thi.63	0	0	.	.	.
Bpi_thi.68	0	0	.	.	.
Bpi_thi.7	0	0	.	.	.
Bpi_thi.71	0	0	.	.	.
Bpi_thi.72	0	0	.	.	.
Bpi_thi.74	0	0	.	.	.
Bpi_thi.75	0	0	.	.	.
Bpi_thi.77	0	0	.	.	.
Bpi_thi.8	0	0	.	.	.
Bpi_thi.83	0	0	.	.	.
Bpi_thi.84	0	0	.	.	.
Bpi_thi.87	0	0	.	.	.
Bpi_thi.88	0	0	.	.	.
Bpi_thi.89	0	0	.	.	.
Bpi_thi.90	0	0	.	.	.
Bpi_thi.91	0	0	.	.	.
Bpi_thi.92	0	0	.	.	.
Bpi_thi.93	0	0	.	.	.
Bpi_thi.94	0	0	.	.	.
Bpi_thi.95	0	0	.	.	.
Bpi_thi.96	0	0	.	.	.
Bpi_thi.97	0	0	.	.	.
Bpi_thi.98	0	0	.	.	.
Bpi_thi.99	0	0	.	.	.
