asd.1	0	0	.	.	.
asd.10	0	0	.	.	.
asd.11	0	0	.	.	.
asd.12	0	0	.	.	.
asd.13	0	0	.	.	.
asd.14	0	0	.	.	.
asd.15	0	0	.	.	.
asd.16	0	0	.	.	.
asd.17	0	0	.	.	.
asd.18	0	0	.	.	.
asd.19	0	0	.	.	.
asd.2	0	0	.	.	.
asd.20	0	0	.	.	.
asd.3	0	0	.	.	.
asd.4	0	0	.	.	.
asd.5	0	0	.	.	.
asd.6	0	0	.	.	.
asd.7	0	0	.	.	.
asd.8	0	0	.	.	.
asd.9	0	0	.	.	.
edd.1	0	0	.	.	.
edd.10	0	0	.	.	.
edd.11	0	0	.	.	.
edd.12	0	0	.	.	.
edd.13	0	0	.	.	.
edd.14	0	0	.	.	.
edd.15	0	0	.	.	.
edd.16	0	0	.	.	.
edd.17	0	0	.	.	.
edd.18	0	0	.	.	.
edd.19	0	0	.	.	.
edd.2	0	0	.	.	.
edd.20	0	0	.	.	.
edd.21	0	0	.	.	.
edd.22	0	0	.	.	.
edd.23	0	0	.	.	.
edd.24	0	0	.	.	.
edd.25	0	0	.	.	.
edd.26	0	0	.	.	.
edd.27	0	0	.	.	.
edd.28	0	0	.	.	.
edd.29	0	0	.	.	.
edd.3	0	0	.	.	.
edd.30	0	0	.	.	.
edd.31	0	0	.	.	.
edd.32	0	0	.	.	.
edd.33	0	0	.	.	.
edd.4	0	0	.	.	.
edd.5	0	0	.	.	.
edd.6	0	0	.	.	.
edd.7	0	0	.	.	.
edd.8	0	0	.	.	.
edd.9	0	0	.	.	.
gap.1	0	0	.	.	.
gap.10	0	0	.	.	.
gap.2	0	0	.	.	.
gap.3	0	0	.	.	.
gap.4	0	0	.	.	.
gap.5	0	0	.	.	.
gap.6	0	0	.	.	.
gap.7	0	0	.	.	.
gap.8	0	0	.	.	.
gap.9	0	0	.	.	.
glnD.1	0	0	.	.	.
glnD.10	0	0	.	.	.
glnD.11	0	0	.	.	.
glnD.2	0	0	.	.	.
glnD.3	0	0	.	.	.
glnD.4	0	0	.	.	.
glnD.5	0	0	.	.	.
glnD.6	0	0	.	.	.
glnD.7	0	0	.	.	.
glnD.8	0	0	.	.	.
glnD.9	0	0	.	.	.
gnd.1	0	0	.	.	.
gnd.10	0	0	.	.	.
gnd.11	0	0	.	.	.
gnd.12	0	0	.	.	.
gnd.13	0	0	.	.	.
gnd.14	0	0	.	.	.
gnd.15	0	0	.	.	.
gnd.16	0	0	.	.	.
gnd.17	0	0	.	.	.
gnd.18	0	0	.	.	.
gnd.19	0	0	.	.	.
gnd.2	0	0	.	.	.
gnd.20	0	0	.	.	.
gnd.21	0	0	.	.	.
gnd.22	0	0	.	.	.
gnd.23	0	0	.	.	.
gnd.24	0	0	.	.	.
gnd.3	0	0	.	.	.
gnd.4	0	0	.	.	.
gnd.5	0	0	.	.	.
gnd.6	0	0	.	.	.
gnd.7	0	0	.	.	.
gnd.8	0	0	.	.	.
gnd.9	0	0	.	.	.
nuoE1.1	0	0	.	.	.
nuoE1.10	0	0	.	.	.
nuoE1.11	0	0	.	.	.
nuoE1.12	0	0	.	.	.
nuoE1.13	0	0	.	.	.
nuoE1.2	0	0	.	.	.
nuoE1.3	0	0	.	.	.
nuoE1.4	0	0	.	.	.
nuoE1.5	0	0	.	.	.
nuoE1.6	0	0	.	.	.
nuoE1.7	0	0	.	.	.
nuoE1.8	0	0	.	.	.
nuoE1.9	0	0	.	.	.
ordL2.1	0	0	.	.	.
ordL2.10	0	0	.	.	.
ordL2.11	0	0	.	.	.
ordL2.12	0	0	.	.	.
ordL2.13	0	0	.	.	.
ordL2.14	0	0	.	.	.
ordL2.15	0	0	.	.	.
ordL2.16	0	0	.	.	.
ordL2.2	0	0	.	.	.
ordL2.3	0	0	.	.	.
ordL2.4	0	0	.	.	.
ordL2.5	0	0	.	.	.
ordL2.6	0	0	.	.	.
ordL2.7	0	0	.	.	.
ordL2.8	0	0	.	.	.
ordL2.9	0	0	.	.	.
recA.1	0	0	.	.	.
recA.10	0	0	.	.	.
recA.11	0	0	.	.	.
recA.12	0	0	.	.	.
recA.13	0	0	.	.	.
recA.14	0	0	.	.	.
recA.15	0	0	.	.	.
recA.16	0	0	.	.	.
recA.17	0	0	.	.	.
recA.18	0	0	.	.	.
recA.2	0	0	.	.	.
recA.3	0	0	.	.	.
recA.4	0	0	.	.	.
recA.5	0	0	.	.	.
recA.6	0	0	.	.	.
recA.7	0	0	.	.	.
recA.8	0	0	.	.	.
recA.9	0	0	.	.	.
sucA.1	0	0	.	.	.
sucA.10	0	0	.	.	.
sucA.11	0	0	.	.	.
sucA.12	0	0	.	.	.
sucA.13	0	0	.	.	.
sucA.14	0	0	.	.	.
sucA.15	0	0	.	.	.
sucA.16	0	0	.	.	.
sucA.17	0	0	.	.	.
sucA.18	0	0	.	.	.
sucA.2	0	0	.	.	.
sucA.3	0	0	.	.	.
sucA.4	0	0	.	.	.
sucA.5	0	0	.	.	.
sucA.6	0	0	.	.	.
sucA.7	0	0	.	.	.
sucA.8	0	0	.	.	.
sucA.9	0	0	.	.	.
zwf.1	0	0	.	.	.
zwf.10	0	0	.	.	.
zwf.11	0	0	.	.	.
zwf.12	0	0	.	.	.
zwf.13	0	0	.	.	.
zwf.14	0	0	.	.	.
zwf.15	0	0	.	.	.
zwf.16	0	0	.	.	.
zwf.17	0	0	.	.	.
zwf.18	0	0	.	.	.
zwf.2	0	0	.	.	.
zwf.3	0	0	.	.	.
zwf.4	0	0	.	.	.
zwf.5	0	0	.	.	.
zwf.6	0	0	.	.	.
zwf.7	0	0	.	.	.
zwf.8	0	0	.	.	.
zwf.9	0	0	.	.	.
