ppa.1	0	0	.	.	.
ppa.2	0	0	.	.	.
pgm.1	0	0	.	.	.
pgm.2	0	0	.	.	.
pgm.3	0	0	.	.	.
pgm.4	0	0	.	.	.
pgm.5	0	0	.	.	.
pgm.6	0	0	.	.	.
pgm.7	0	0	.	.	.
pgm.8	0	0	.	.	.
pgm.9	0	0	.	.	.
gyrB.1	0	0	.	.	.
gyrB.2	0	0	.	.	.
gyrB.3	0	0	.	.	.
gmk.1	0	0	.	.	.
gmk.2	0	0	.	.	.
gmk.3	0	0	.	.	.
glyA.1	0	0	.	.	.
glyA.2	0	0	.	.	.
glyA.3	0	0	.	.	.
glyA.4	0	0	.	.	.
glyA.5	0	0	.	.	.
glyA.6	0	0	.	.	.
glyA.7	0	0	.	.	.
atpA.1	0	0	.	.	.
atpA.2	0	0	.	.	.
atpA.3	0	0	.	.	.
atpA.4	0	0	.	.	.
arcC.1	0	0	.	.	.
arcC.2	0	0	.	.	.
arcC.3	0	0	.	.	.
arcC.4	0	0	.	.	.
arcC.5	0	0	.	.	.
arcC.6	0	0	.	.	.
adk.1	0	0	.	.	.
adk.2	0	0	.	.	.
adk.3	0	0	.	.	.
adk.4	0	0	.	.	.
adk.5	0	0	.	.	.
adk.6	0	0	.	.	.
adk.7	0	0	.	.	.
