Natrans	Natrans.1	Natrans.2	Natrans.3	Natrans.4	Natrans.5	Natrans.6	Natrans.7
clpC	clpC.1	clpC.2	clpC.3	clpC.4	clpC.5	clpC.6
ftsA	ftsA.1	ftsA.2	ftsA.3	ftsA.4	ftsA.5
glpF	glpF.1	glpF.2	glpF.3	glpF.4	glpF.5	glpF.6	glpF.7	glpF.8
glpT	glpT.1	glpT.2	glpT.3	glpT.4	glpT.5
rpoB	rpoB.1	rpoB.2	rpoB.3	rpoB.4	rpoB.5	rpoB.6	rpoB.7
sigF	sigF.1	sigF.2	sigF.3	sigF.4	sigF.5
