dfrB.1	KEEP	Made into gene. strand=+, frame=0
fusA.1	KEEP	Made into gene. strand=+, frame=0
grlA.1	KEEP	Made into gene. strand=+, frame=0
grlB.1	KEEP	Made into gene. strand=+, frame=0
gyrA.1	KEEP	Made into gene. strand=+, frame=0
ileS.1	KEEP	Made into gene. strand=+, frame=0
pbp2.1	KEEP	Made into gene. strand=+, frame=0
pbp4.1	KEEP	Made into gene. strand=+, frame=0
rpoB.1	KEEP	Made into gene. strand=+, frame=0
