name	taxID	taxRank	genomeSize	numReads	numUniqueReads	abundance
Shewanella	22	genus	5140018	96	0	0.0
Cystobacter fuscus	43	species	12349744	1	0	0.0
Archangium gephyra	48	species	12489432	1	1	0.0
Chondromyces crocatus	52	species	11388132	1	1	0.0
Azospirillum brasilense	192	species	13978806	1	0	0.0
Comamonas	283	genus	5695231	2	0	0.0
Pseudomonas	286	genus	6735709	9	1	0.0
Pseudomonas aeruginosa	287	species	6508174	9	0	9.18581e-73
Burkholderia cepacia	292	species	10707163	5	0	0.0
Pseudomonas fluorescens	294	species	6526868	1	0	0.0
Pseudomonas fragi	296	species	10253943	18	0	0
Hydrogenophilus thermoluteolus	297	species	2288780	1	1	0.0
Pseudomonas putida	303	species	6153625	1	0	0.0
Ralstonia solanacearum	305	species	5757294	23	2	0.0
Pseudomonas syringae	317	species	9277206	2	0	0.0
Pseudomonas syringae pv. syringae	321	leaf	17996541	3	0	0.0
Pseudomonas syringae pv. tomato	323	leaf	6523367	1	0	0.0
Ralstonia pickettii	329	species	5505543	14	3	0.0
Xanthomonas campestris pv. campestris	340	leaf	19971072	2	0	0.0
Agrobacterium tumefaciens	358	species	7273300	2	2	0.0
Bradyrhizobium japonicum	375	species	9207384	2	0	0.0
Sinorhizobium meliloti	382	species	7082772	1	1	0.0
Rhizobium leguminosarum	384	species	9732818	1	0	0.0
Rhizobium phaseoli	396	species	6665454	3	1	0.0
Methylococcaceae	403	family	4384317	1	0	0.0
Methylobacillus flagellatus	405	species	2971517	1	0	0.0
Methylomonas	416	genus	5051681	2	0	0.0
Moraxellaceae	468	family	3802099	4	0	0.0
Acinetobacter	469	genus	4001637	53	0	0.0
Acinetobacter baumannii	470	species	3995919	5	1	0.0
Moraxella bovis	476	species	2911207	1	0	0.0
Neisseriaceae	481	family	2245252	3	0	0.0
Neisseria cinerea	483	species	1832904	1	0	0
Neisseria gonorrhoeae	485	species	2209297	1	0	0.108429
Neisseria lactamica	486	species	2220606	2	0	3.54923e-06
Neisseria meningitidis	487	species	2222288	1	0	3.76899e-05
Neisseria elongata	495	species	2253031	1	0	0
Psychrobacter	497	genus	2875899	1	0	0.0
Alcaligenaceae	506	family	4001103	1	0	0.0
Enterobacteriaceae	543	family	8974696	852	64	0.0
Citrobacter	544	genus	5356580	405	3	0.0
Citrobacter koseri	545	species	4735357	76	0	2.06219e-228
Citrobacter freundii	546	species	5371331	619	35	3.37822e-44
Enterobacter	547	genus	8075228	400	1	0.0
Klebsiella aerogenes	548	species	5435727	280	30	1.29439e-151
Enterobacter cloacae	550	species	5160721	490	53	0
Erwinia	551	genus	4250482	1	0	0.0
Erwinia amylovora	552	species	3869718	1	0	0.0
Pantoea ananatis	553	species	4838981	1	0	0.0
Pectobacterium carotovorum	554	species	8172380	11	0	0.0
Escherichia	561	genus	7248177	2	0	0.0
Escherichia coli	562	species	7295430	4491	846	0.000469908
Hafnia	568	genus	4712721	52	0	0.0
Hafnia alvei	569	species	4712721	16	0	0
Klebsiella	570	genus	10431961	1083	7	0.0
Klebsiella oxytoca	571	species	6684898	3881	68	3.79213e-06
Klebsiella pneumoniae	573	species	12022929	207779	179354	0.0426144
Klebsiella pneumoniae subsp. ozaenae	574	subspecies	5651305	75	0	1.35922e-175
Raoultella planticola	575	species	5823931	344	3	1.43828e-268
Morganella	581	genus	3799539	171	0	0.0
Morganella morganii	582	species	3799539	4	0	0
Proteus	583	genus	3973324	123	0	0.0
Proteus mirabilis	584	species	3973324	29	2	1.28047e-28
Proteus vulgaris	585	species	3961988	2	0	0.0
Providencia	586	genus	4402109	12	0	0.0
Providencia rettgeri	587	species	13861830	27	0	0
Salmonella enterica subsp. enterica serovar Infantis	595	leaf	34245189	14	3	9.50355e-07
Salmonella enterica subsp. enterica serovar Thompson	600	leaf	23736161	5	1	0
Salmonella enterica subsp. enterica serovar Pullorum	605	leaf	4882929	4	0	9.37833e-06
Salmonella enterica subsp. enterica serovar Heidelberg	611	leaf	97441747	2	0	0
Serratia	613	genus	5337459	398	0	0.0
Serratia marcescens	615	species	5201904	161	7	2.82593e-232
Xenorhabdus nematophila	628	species	4586662	1	0	0.0
Yersinia	629	genus	5888768	44	0	0.0
Yersinia enterocolitica	630	species	4744476	2	0	0
Edwardsiella	635	genus	3906392	49	0	0.0
Edwardsiella tarda	636	species	3766483	6	0	0.0
Vibrionaceae	641	family	5361384	5	0	0.0
Aeromonas	642	genus	4922242	148	0	0.0
Aeromonas hydrophila	644	species	4976268	4	1	0.0
Aeromonas salmonicida	645	species	4926750	1	0	0.0
Aeromonas caviae	648	species	18457506	1	0	0.0
Aeromonas schubertii	652	species	4400034	2	0	0.0
Aeromonas veronii	654	species	4551783	2	1	0.0
Vibrio	662	genus	5428754	4	0	0.0
Vibrio parahaemolyticus	670	species	5172800	1	1	0.0
Vibrio vulnificus	672	species	5071151	1	0	0.0
Vibrio mimicus	674	species	8922712	2	0	0
Vibrio campbellii	680	species	8634154	1	1	0.0
Plesiomonas shigelloides	703	species	7376338	4	2	0.0
Actinobacillus pleuropneumoniae	715	species	2303652	1	1	0.0
[Haemophilus] ducreyi	730	species	1698955	4	0	0.0
Rhodobacter sphaeroides	1063	species	4596850	3	0	0.0
Porphyrobacter neustonensis	1112	species	3090363	1	1	0.0
Gammaproteobacteria	1236	class	7010314	15	1	0.0
Streptococcus salivarius	1304	species	2213879	1	0	0
Streptococcus thermophilus	1308	species	1844731	2	0	0.0
Enterococcus gallinarum	1353	species	3821476	1	0	0.0
Cellulosimicrobium cellulans	1710	species	4799856	1	1	0.0
Corynebacterium diphtheriae	1717	species	2464936	1	0	0.0
Cutibacterium acnes	1747	species	2515790	3	1	1.90659e-05
Mycobacterium tuberculosis	1773	species	5425114	1	1	0.0
Streptomyces actuosus	1885	species	8145579	1	1	0.0
Streptomyces albus	1888	species	6841649	1	1	0.0
Candidatus Sodalis pierantonius str. SOPE	2342	leaf	4513140	9	1	0.0
Homo sapiens	9606	species	3257319537	21	15	9.04347e-08
Prevotella intermedia	28131	species	2686803	2	0	0.0
Prevotella melaninogenica	28132	species	3168282	1	0	0.0
Cronobacter sakazakii	28141	species	4439412	160	7	2.39655e-16
Salmonella enterica subsp. enterica serovar Derby	28144	leaf	9935604	6	3	6.78079e-05
Salmonella enterica subsp. enterica serovar Oranienburg	28147	leaf	4651134	1	0	0
Salmonella enterica subsp. enterica serovar Senftenberg	28150	leaf	20218480	22	5	3.35336e-06
Yersinia kristensenii	28152	species	4496569	1	0	0.0
Alphaproteobacteria	28211	class	3938269	4	0	0.0
Betaproteobacteria	28216	class	5503525	2	0	0.0
Marinomonas	28253	genus	4292128	3	0	0.0
Salmonella enterica	28901	species	10337520	21181	20488	0.82509
Natronococcus occultus	29288	species	4314118	1	0	0.0
Veillonella parvula	29466	species	2132142	2	0	0.0
Yersinia frederiksenii	29484	species	4550894	3	2	0.0
Yersinia rohdei	29485	species	4372253	1	1	0.0
Propionibacteriaceae	31957	family	2829393	1	0	0.0
Nitrosomonadales	32003	order	3061161	2	0	0.0
Parvimonas micra	33033	species	3288872	2	0	2.86463e-06
Zymobacter palmae	33074	species	3028543	1	0	0.0
Paracoccus aminovorans	34004	species	4038130	2	2	0.0
Rahnella aquatilis	34038	species	5656799	1	0	0.0
Citrobacter amalonaticus	35703	species	5875351	18	0	2.00521e-256
Desulfitobacterium	36853	genus	4425788	1	0	0.0
Paraburkholderia xenovorans	36873	species	19434089	1	0	0.0
Nocardia farcinica	37329	species	6292344	2	0	0.0
Nocardia seriolae	37332	species	16426251	1	1	0.0
Photobacterium damselae subsp. piscicida	38294	subspecies	4293175	1	1	0.0
Stenotrophomonas maltophilia	40324	species	4684682	2	0	0.0
Sphingomonadaceae	41297	family	4153184	24	0	0.0
Salmonella enterica subsp. arizonae serovar 62:z4,z23:-	41514	leaf	4600800	7	2	2.07373e-07
Burkholderia plantarii	41899	species	8081051	2	1	0.0
Tolumonas auensis	43948	species	3471292	1	0	0.0
Thauera aromatica K172	44139	leaf	3711792	1	1	0.0
Staphylococcus aureus subsp. aureus	46170	subspecies	103787154	1	1	0.0
Pseudomonas avellanae	46257	species	6576340	1	0	0.0
Salmonella enterica subsp. enterica serovar Give	46626	leaf	9538123	4	0	6.14155e-18
Serratia fonticola	47917	species	18051695	4	1	0.0
Pseudoalteromonas	53246	genus	4529238	1	0	0.0
Pantoea	53335	genus	4926392	289	0	0.0
Tatumella citrea	53336	species	8982233	2	0	0.0
Raoultella ornithinolytica	54291	species	5398151	387	36	2.11416e-284
Salmonella enterica subsp. enterica serovar Paratyphi A	54388	leaf	13799394	5	0	1.64168e-06
Streptomyces venezuelae	54571	species	26469547	2	0	0.0
Salmonella bongori	54736	species	4524275	4	0	0.0
Erwinia persicina	55211	species	5070450	1	1	0.0
Xanthomonas sacchari	56458	species	5006106	1	1	0.0
Syntrophus aciditrophicus SB	56780	leaf	3179300	1	0	0.0
Citrobacter braakii	57706	species	10079064	7	1	3.21874e-310
Salmonella enterica subsp. enterica serovar Weltevreden	57743	leaf	20446954	11	0	2.27862e-06
Burkholderia thailandensis	57975	species	7411824	1	0	0.0
Salmonella enterica subsp. houtenae serovar Houten	58100	leaf	4624613	17	1	0
Salmonella enterica subsp. enterica serovar Waycross	58101	leaf	4812886	7	6	2.47343e-05
Salmonella enterica subsp. enterica serovar Anatum	58712	leaf	19533469	9	0	3.36813e-06
Salmonella enterica subsp. enterica	59201	subspecies	142069846	191	10	1.35545e-06
Salmonella enterica subsp. salamae	59202	subspecies	10002039	8	0	9.11104e-07
Salmonella enterica subsp. diarizonae	59204	subspecies	24824988	15	0	7.68144e-07
Burkholderia vietnamiensis	60552	species	6930496	1	0	0.0
Enterobacter asburiae	61645	species	4787018	37	0	1.60364e-06
Lelliottia amnigena	61646	species	9085730	12	3	0.0
Pluralibacter gergoviae	61647	species	10897762	35	1	0
Serratia ficaria	61651	species	5209973	1	0	0.0
Serratia rubidaea	61652	species	9918189	7	0	0.0
Haloterrigena turkmenica	62320	species	5440782	1	0	0.0
Shewanella baltica	62322	species	5379488	1	1	0.0
Sodalis glossinidius	63612	species	4292502	1	0	0.0
Edwardsiella ictaluri	67780	species	3812301	2	2	0
Citrobacter farmeri	67824	species	5715629	49	0	2.39495e-243
Citrobacter rodentium	67825	species	5444283	4	0	0.0
Citrobacter werkmanii	67827	species	15089488	57	39	3.8e-07
Streptomyces fungicidicus	68203	species	7667496	1	1	0.0
Cupriavidus basilensis	68895	species	8421483	1	1	0.0
Thermales	68933	order	2498247	1	0	0.0
Enterobacter cancerogenus	69218	species	4796512	2	0	0.0
Lelliottia nimipressuralis	69220	species	4826854	9	1	0
Pseudomonas sp. VLB120	69328	species	5966222	1	0	0.0
Moritella yayanosii	69539	species	4433651	1	0	0.0
Salmonella enterica subsp. enterica serovar Minnesota	70803	leaf	5004825	3	1	4.6025e-40
Pseudomonadales	72274	order	6135410	2	0	0.0
Campylobacteraceae	72294	family	2371300	1	0	0.0
Klebsiella pneumoniae subsp. pneumoniae	72407	subspecies	172715673	1856	467	2.87403e-06
Prevotella enoeca	76123	species	2861432	1	1	0.0
Xanthobacter autotrophicus Py2	78245	leaf	5625098	1	1	0.0
Pseudomonas mosselii	78327	species	6247860	1	1	0.0
Erwinia pyrifoliae	79967	species	4072846	1	0	0.0
Burkholderiales	80840	order	6713841	35	0	0.0
Moritella viscosa	80854	species	5093989	1	0	0.0
Comamonadaceae	80864	family	5402391	21	0	0.0
Obesumbacterium	82982	genus	0	10	0	0.0
Obesumbacterium proteus	82983	species	5011796	1	0	0.0
Serratia plymuthica	82996	species	5447150	4	0	0.0
Escherichia coli K-12	83333	leaf	65191842	1	0	0.0
Escherichia coli O157:H7	83334	leaf	78215862	4	0	0
Stenotrophomonas nitritireducens	83617	species	4541729	1	1	0.0
Leclercia	83654	genus	0	5	0	0.0
Leclercia adecarboxylata	83655	species	4803917	3	1	0
Sodalis	84565	genus	4402821	1	0	0.0
Aeromonadaceae	84642	family	4831557	29	0	0.0
Micrococcales	85006	order	3661464	2	0	0.0
Streptosporangiales	85012	order	6364076	1	0	0.0
Frankiales	85013	order	7497934	1	0	0.0
Achromobacter xylosoxidans	85698	species	7359146	3	0	0.0
Burkholderia multivorans	87883	species	10170089	3	0	1.96851e-06
Salmonella enterica subsp. enterica serovar Saintpaul	90105	leaf	29368410	10	0	5.96546e-07
Salmonella enterica subsp. enterica serovar Typhi	90370	leaf	505801019	300	42	1.23054e-05
Salmonella enterica subsp. enterica serovar Typhimurium	90371	leaf	150109640	52	9	1.69221e-06
Enterobacterales	91347	order	8015187	56	0	0.0
Ramlibacter tataouinensis	94132	species	4070193	1	0	0.0
Burkholderia cenocepacia	95486	species	7744804	3	0	0
Thauera chlorobenzoica	96773	species	3735506	1	1	0.0
Vitreoscilla sp. C1	96942	species	2610419	1	0	0.0
Salmonella enterica subsp. enterica serovar Dublin	98360	leaf	35415966	4	0	3.41431e-08
Burkholderia ubonensis	101571	species	7189071	2	0	0.0
Bordetella hinzii	103855	species	14686667	1	0	0.0
Serratia sp. ATCC 39006	104623	species	9943513	5	0	0.0
Ralstonia mannitolilytica	105219	species	9915295	54	31	1.69938e-05
Salmonella enterica subsp. enterica serovar Newport	108619	leaf	24036368	48	0	5.14311e-42
Bradyrhizobium sp. ORS 285	115808	species	7797098	1	1	0.0
Burkholderiaceae	119060	family	7900732	3	0	0.0
Salmonella enterica subsp. enterica serovar Choleraesuis	119912	leaf	4751585	3	0	0.0
Pectobacterium	122277	genus	6614713	3	0	0.0
Providencia alcalifaciens	126385	species	8033032	1	1	0.0
Pseudomonas amygdali pv. morsprunorum	129138	leaf	6445963	1	0	0.0
Citrobacter youngae	133448	species	4945156	4	0	5.87615e-243
Salmonella enterica subsp. enterica serovar Bredeney	134047	leaf	4627083	1	0	0
Actinoplanes sp. SE50/110	134676	species	18480017	2	0	0.0
Chromatiales	135613	order	3795179	1	0	0.0
Oceanospirillales	135619	order	3313271	1	0	0.0
Pseudomonadaceae	135621	family	6675755	49	0	0.0
Salmonella enterica subsp. enterica serovar Tennessee	143221	leaf	24316845	6	1	7.38374e-07
Paracoccus yeei	147645	species	14118684	23	6	1.08035e-06
Salmonella enterica subsp. enterica serovar Braenderup	149391	leaf	4734880	4	0	4.02992e-07
Salmonella enterica subsp. enterica serovar Enteritidis	149539	leaf	208834451	226	45	2.07805e-06
Burkholderia ambifaria	152480	species	11349840	1	0	0.0
Cedecea neteri	158822	species	19970488	14	1	0.0
Enterobacter hormaechei	158836	species	11512864	103	0	0
Leminorella richardii	158841	species	3976274	1	0	0.0
Raoultella	160674	genus	5398151	23	0	0.0
Bradyrhizobium sp. ORS 3257	167468	species	8156021	1	0	0.0
Laribacter	168470	genus	3169329	3	0	0.0
Escherichia coli O127:H6	168807	leaf	9641111	49	3	3.83235e-199
Pseudoalteromonas agarivorans	176102	species	4544962	2	0	0.0
Candidatus Baumannia cicadellinicola	186490	species	686194	1	0	0.0
Ralstonia insidiosa	190721	species	12164766	26	7	1.7291e-208
Vibrio coralliilyticus	190893	species	23103305	1	0	0.0
Salmonella enterica subsp. enterica serovar Stanley	192953	leaf	4791042	5	1	2.44676e-06
Salmonella enterica subsp. enterica serovar Mbandaka	192954	leaf	9505961	10	9	0.0
Salmonella enterica subsp. enterica serovar Kentucky	192955	leaf	4900326	4	1	7.28836e-06
Chlorobaculum tepidum TLS	194439	leaf	2154946	1	1	0.0
Sinorhizobium americanum	194963	species	6853050	1	0	0.0
Nocardioides sp. JS614	196162	species	5293685	1	0	0.0
Arcobacter halophilus	197482	species	2812536	1	0	0.0
Haemophilus aegyptius	197575	species	1993258	1	0	0
Shigella flexneri 2a str. 301	198214	leaf	4828820	2	0	3.38576e-06
Dickeya dadantii 3937	198628	leaf	4922802	1	1	0.0
Escherichia coli CFT073	199310	leaf	5231428	15	2	4.98068e-320
Sulfurimonas	202746	genus	2177379	1	0	0.0
Dickeya	204037	genus	4822257	5	0	0.0
Dickeya zeae	204042	species	4675379	3	0	0.0
Sphingomonadales	204457	order	4098145	1	0	0.0
Pseudomonas syringae pv. syringae B728a	205918	leaf	6093698	1	0	0.0
Pseudomonas fluorescens Pf0-1	205922	leaf	6438405	4	4	0.0
Neisseriales	206351	order	2372285	1	0	0.0
Rhodocyclales	206389	order	4186782	10	0	0.0
Kosakonia cowanii	208223	species	4857324	1	0	0.0
Enterobacter kobei	208224	species	10094268	517	0	1.66674e-236
Escherichia albertii	208962	species	4701875	314	20	8.18292e-06
Salmonella enterica subsp. enterica serovar Typhi str. Ty2	209261	leaf	4791961	1	0	2.51851e-29
Erwinia sp. Ejp617	215689	species	3957675	1	0	0.0
Escherichia coli 042	216592	leaf	5355323	1	0	0.0
Rhizobium leguminosarum bv. viciae 3841	216596	leaf	7751309	1	0	0.0
Achromobacter spanius	217203	species	12765991	1	0	0.0
Achromobacter insolitus	217204	species	13385742	1	0	0.0
Pectobacterium atrosepticum SCRI1043	218491	leaf	5064019	6	0	0.0
Salmonella bongori NCTC 12419	218493	leaf	4460105	16	0	0
Salmonella enterica subsp. enterica serovar Typhi str. CT18	220341	leaf	5133713	145	45	0.0116074
Pseudomonas protegens Pf-5	220664	leaf	7074893	1	0	0.0
Salmonella enterica subsp. enterica serovar Java	224729	leaf	4756780	4	3	5.21475e-06
Shewanella psychrophila	225848	species	6353406	1	0	0.0
Comamonas kerstersii	225992	species	3547915	1	0	0.0
Photorhabdus thracensis	230089	species	5147098	2	1	0.0
[Haemophilus] ducreyi 35000HP	233412	leaf	1698955	1	0	0.0
Pseudomonas alkylphenolica	237609	species	5764622	1	1	0.0
Mycobacterium avium 104	243243	leaf	5475491	1	1	0.0
Klebsiella variicola	244366	species	5458505	4501	27	2.58699e-06
Prevotella intermedia 17	246198	leaf	2699437	1	0	0.0
Pseudomonas syringae group genomosp. 3	251701	species	6530813	1	0	0.0
Natronolimnobius	253106	genus	0	1	0	0.0
Roseomonas gilardii	257708	species	5412463	2	0	0.0
Lysobacter gummosus	262324	species	6056618	1	0	0.0
Streptomyces hygroscopicus subsp. limoneus	264445	subspecies	10537932	1	0	0.0
Paraburkholderia xenovorans LB400	266265	leaf	19434089	1	1	0.0
Mesorhizobium japonicum MAFF 303099	266835	leaf	7596297	2	0	0.0
Shewanellaceae	267890	family	5140018	24	0	0.0
Nitratiruptor	269258	genus	0	1	0	0.0
Rhodospirillum rubrum ATCC 11170	269796	leaf	4406557	1	0	0.0
Methanosarcina barkeri str. Fusaro	269797	leaf	4873766	1	0	0.0
Gluconacetobacter diazotrophicus PA1 5	272568	leaf	7914538	2	0	0.0
Klebsiella pneumoniae subsp. pneumoniae MGH 78578	272620	leaf	5694894	203	43	1.45927e-175
Leifsonia xyli subsp. xyli str. CTCB07	281090	leaf	2584158	1	1	0.0
Kosakonia radicincitans	283686	species	6122453	32	1	0
Sulfuricurvum	286130	genus	2819357	1	0	0.0
Salmonella enterica subsp. enterica serovar Indiana	286783	leaf	5119391	2	0	0
Chlorobium phaeobacteroides DSM 266	290317	leaf	3133902	1	1	0.0
Citrobacter koseri ATCC BAA-895	290338	leaf	4735357	10	2	9.1732e-242
Cronobacter sakazakii ATCC BAA-894	290339	leaf	4530777	1	0	0.0
Gluconobacter oxydans 621H	290633	leaf	5847221	1	1	0.0
Photorhabdus asymbiotica	291112	species	5094138	3	1	0.0
Ruegeria sp. TM1040	292414	species	4153699	1	0	0.0
Salmonella enterica subsp. enterica serovar Paratyphi A str. ATCC 9150	295319	leaf	4585229	2	0	1.39539e-21
Salmonella enterica subsp. salamae serovar Greenside	297361	leaf	4732250	6	3	6.14104e-06
Enterobacter hormaechei subsp. steigerwaltii	299766	subspecies	20496016	3	1	0
Enterobacter ludwigii	299767	species	4952770	2	0	0.0
Shigella dysenteriae Sd197	300267	leaf	4560911	1	1	0.0
Enterobacter hormaechei subsp. oharae	301102	subspecies	14941448	8	0	0
Bifidobacterium animalis subsp. lactis	302911	subspecies	7762260	1	0	0.0
Bifidobacterium animalis subsp. animalis	302912	subspecies	3960056	1	0	0.0
Erythrobacter litoralis HTCC2594	314225	leaf	3052398	1	0	0.0
Alteromonas mediterranea	314275	species	4576285	1	0	0.0
Psychromonas sp. CNPT3	314282	species	3052410	1	1	0.0
Xanthomonas campestris pv. campestris str. 8004	314565	leaf	5148708	1	0	0.0
Paracoccus denitrificans PD1222	318586	leaf	5236194	4	3	0.0
Salmonella enterica subsp. enterica serovar Choleraesuis str. SC-B67	321314	leaf	4944000	4	1	1.73202e-06
Azotobacter vinelandii DJ	322710	leaf	5365318	4	0	0.0
Escherichia coli HS	331112	leaf	4643538	22	0	5.00423e-263
Bradyrhizobium sp. S23321	335659	species	7231841	1	1	0.0
Rhodoferax ferrireducens T118	338969	leaf	4969784	1	0	0.0
Salmonella enterica subsp. enterica serovar Cerro	340188	leaf	4602439	4	0	5.52546e-44
Salmonella enterica subsp. enterica serovar Manhattan	340189	leaf	4802602	1	0	2.78436e-06
Sodalis glossinidius str. 'morsitans'	343509	leaf	4292502	2	1	0.0
Streptococcus salivarius JIM8777	347253	leaf	2210574	2	0	1.13947e-05
Rhodobacter sphaeroides ATCC 17025	349102	leaf	4557127	1	0	0.0
Acidiphilium cryptum JF-5	349163	leaf	3963080	1	0	0.0
Burkholderia dolosa AU0158	350701	leaf	6409095	3	0	0.0
Xenorhabdus doucetiae	351671	species	4203651	1	0	0.0
Xenorhabdus hominickii	351679	species	4522699	3	1	0.0
Halostagnicola larsenii	353800	species	4131176	1	0	0.0
Psychromonas ingrahamii 37	357804	leaf	4559598	1	0	0.0
Acidovorax sp. KKS102	358220	species	5196935	1	1	0.0
Escherichia coli 536	362663	leaf	4938920	1	0	0.0
Polaromonas naphthalenivorans CJ2	365044	leaf	5366143	1	1	0.0
Ramlibacter tataouinensis TTB310	365046	leaf	4070193	1	0	0.0
Halotalea alkalilenta	376489	species	4387428	1	1	0.0
Kocuria rhizophila DC2201	378753	leaf	2697540	1	0	0.0
Pseudomonas protegens	380021	species	6923588	1	0	0.0
Cupriavidus necator H16	381666	leaf	7416678	1	1	0.0
Moraxella bovoculi	386891	species	15802199	1	0	0.0
Rhizobium leguminosarum bv. trifolii WSM1325	395491	leaf	7418122	1	0	0.0
Rhizobium leguminosarum bv. trifolii WSM2304	395492	leaf	6872702	1	1	0.0
Leptothrix cholodnii SP-6	395495	leaf	4909403	1	1	0.0
Shewanella pealeana ATCC 700345	398579	leaf	5174581	1	0	0.0
Serratia proteamaculans 568	399741	leaf	5495657	1	0	0.0
Enterobacter sp. 638	399742	species	4676461	7	2	0.0
Ralstonia pickettii 12J	402626	leaf	5325729	185	104	0.000173924
Escherichia coli APEC O1	405955	leaf	5497653	1	0	0
Cronobacter	413496	genus	4479995	16	0	0.0
Cronobacter turicensis	413502	species	4599092	4	0	0.0
Cronobacter malonaticus	413503	species	4473761	9	0	0
Methylobacterium phyllosphaerae	418223	species	6316624	1	0	0.0
Shewanella sediminis HAW-EB3	425104	leaf	5517674	1	1	0.0
Methylobacterium sp. 4-46	426117	species	7737025	1	1	0.0
Ralstonia pickettii 12D	428406	leaf	5685358	202	123	4.81756e-05
Mycobacterium avium subsp. hominissuis	439334	subspecies	31569362	1	0	0.0
Salmonella enterica subsp. enterica serovar Schwarzengrund str. CVM19633	439843	leaf	4823887	1	0	0.000335252
Salmonella enterica subsp. enterica serovar Dublin str. CT_02021853	439851	leaf	4917459	1	0	0.0
Nostoc sphaeroides	446679	species	6684490	1	0	0.0
Anaeromyxobacter sp. K	447217	species	5061632	1	0	0.0
Phytobacter	447792	genus	0	159	0	0.0
Phenylobacterium zucineum HLK1	450851	leaf	4379231	1	0	0.0
Agromyces aureus	453304	species	4373124	1	1	0.0
Salmonella enterica subsp. enterica serovar Agona str. SL483	454166	leaf	4836638	1	0	8.1885e-18
Anaeromyxobacter dehalogenans 2CP-1	455488	leaf	5029329	1	0	0.0
Streptomyces lividans TK24	457428	leaf	8345283	1	1	0.0
Shewanella halifaxensis HAW-EB4	458817	leaf	5226917	1	0	0.0
Methylobacterium nodulans ORS 2060	460265	leaf	8839022	1	1	0.0
Micrococcus luteus NCTC 2665	465515	leaf	4996790	2	0	0.0
Erwinia tasmaniensis Et1/99	465817	leaf	4067864	2	1	0.0
Pantoea vagans	470934	species	4888338	5	4	0.0
Halomonas beimenensis	475662	species	4053030	1	0	0.0
Salmonella enterica subsp. enterica serovar Paratyphi C str. RKS4594	476213	leaf	4888494	4	1	3.72791e-05
Candidatus Ishikawaella capsulata Mpkobe	476281	leaf	754729	1	1	0.0
Veillonella parvula DSM 2008	479436	leaf	2132142	1	0	0.0
Micromonospora tulbaghiae	479978	species	7228472	1	0	0.0
Acinetobacter baumannii AB0057	480119	leaf	4063879	1	0	0.0
Escherichia coli ATCC 8739	481805	leaf	9493136	36	0	0.0
Myxococcus fulvus HW-1	483219	leaf	9003593	1	0	0.0
Klebsiella pneumoniae subsp. pneumoniae NTUH-K2044	484021	leaf	5472672	32	10	0.0
Burkholderia latens	488446	species	6614478	1	0	0.0
Burkholderia contaminans	488447	species	16680024	1	1	0.0
Burkholderia seminalis	488731	species	7648944	1	0	0.0
Neisseria lactamica 020-06	489653	leaf	2220606	1	0	1.09297e-102
Rhizobium etli CIAT 652	491916	leaf	6448048	1	0	0.0
Kosakonia oryzae	497725	species	5303342	7	1	0.0
Klebsiella pneumoniae 342	507522	leaf	5920257	48	1	0.0
Oceanimonas sp. GK1	511062	species	3527244	2	1	0.0
Actinoplanes missouriensis 431	512565	leaf	8773466	1	1	0.0
[Eubacterium] rectale ATCC 33656	515619	leaf	3449685	1	1	8.71339e-06
Rhodothermus marinus DSM 4252	518766	leaf	3386737	1	0	0.0
Candidatus Accumulibacter phosphatis clade IIA str. UW-1	522306	leaf	5306133	1	1	0.0
Pirellula staleyi DSM 6068	530564	leaf	6196199	1	0	0.0
Salmonella enterica subsp. enterica serovar Gallinarum str. 287/91	550538	leaf	4658697	1	0	3.32003e-36
Prevotella melaninogenica ATCC 25845	553174	leaf	3168282	1	0	0.0
Salmonella enterica subsp. enterica serovar Paratyphi A str. AKU_12601	554290	leaf	4581797	2	0	3.33174e-06
Rhodobacter sphaeroides KD131	557760	leaf	4711139	1	1	0.0
Pectobacterium parmentieri WPP163	561231	leaf	5063892	1	0	0.0
Escherichia coli W	566546	leaf	10014211	14	0	0.0
Escherichia coli O127:H6 str. E2348/69	574521	leaf	5069678	24	0	4.71407e-173
Isosphaera pallida ATCC 43644	575540	leaf	5529304	1	0	0.0
Polynucleobacter necessarius	576610	species	1560469	10	10	0.0
Escherichia coli S88	585035	leaf	5166121	21	0	0
Escherichia fergusonii ATCC 35469	585054	leaf	4643861	2	1	0
Escherichia coli IAI39	585057	leaf	5132068	5	1	1.11545e-06
Escherichia coli O103:H2 str. 12009	585395	leaf	5524860	1	0	0.0
Haloterrigena daqingensis	588898	species	3835796	1	0	0.0
Dickeya zeae Ech586	590409	leaf	4818394	2	0	0.0
Escherichia coli LF82	591946	leaf	4773108	13	7	4.002e-06
Pantoea sp. At-9b	592316	species	6312783	3	1	0.0
Salmonella enterica subsp. enterica serovar Corvallis	593905	leaf	5359100	5	0	7.19543e-06
Tolumonas auensis DSM 9187	595494	leaf	3471292	1	0	0.0
Escherichia coli KO11FL	595495	leaf	10056495	8	0	0.0
Burkholderia glumae PG1	595500	leaf	7896538	1	0	0.0
Methylosinus trichosporium OB3b	595536	leaf	5183433	1	1	0.0
Alicycliphilus denitrificans BC	596153	leaf	4835713	3	1	1.05489e-06
Hydrogenobacter thermophilus TK-6	608538	leaf	3486067	12	0	0.0
Shimwellia blattae DSM 4481 = NBRC 105725	630626	leaf	4158725	4	3	0.0
Rhodococcus opacus B4	632772	leaf	8834939	1	1	0.0
Erwinia billingiae Eb661	634500	leaf	5372268	3	2	0.0
Shewanella violacea DSS12	637905	leaf	4962103	1	0	0.0
Citrobacter rodentium ICC168	637910	leaf	5444283	7	5	0.0
Klebsiella variicola At-22	640131	leaf	5458505	187	15	1.06573e-06
Burkholderia sp. CCGE1002	640511	species	7884858	1	1	0.0
Burkholderia sp. CCGE1003	640512	species	7043595	1	0	0.0
Enterobacter asburiae LF7a	640513	leaf	5012132	2	1	0.0
Micromonospora sp. L5	648999	species	6962533	1	0	0.0
Pantoea stewartii subsp. stewartii DC283	660596	leaf	5314092	3	2	0.0
Arcobacter suis CECT 7833	663365	leaf	2639269	5	5	0.0
Azospirillum sp. TSH58	664962	species	7244074	2	1	0.0
Mixta calida	665913	species	4308453	21	1	0
Mixta gaviniae	665914	species	4527605	10	0	0.0
Edwardsiella anguillarum ET080813	667120	leaf	4329652	1	1	0.0
Propionibacterium sp. oral taxon 193	671223	species	2649207	1	1	3.84507e-06
Serratia sp. FGI94	671990	species	4858216	5	1	0.0
Candidatus Hamiltonella defensa (Bemisia tabaci)	672795	leaf	1739504	1	1	0.0
Phaeobacter sp. LSS9	681157	species	4038237	1	1	0.0
Salmonella enterica subsp. enterica serovar Gallinarum str. 9184	685040	leaf	4609911	1	0	1.20931e-06
Salmonella enterica subsp. enterica serovar Dublin str. ATCC 39184	687860	leaf	4917142	2	2	4.48782e-06
Cronobacter turicensis z3032	693216	leaf	4599092	10	5	0.0
Enterobacteriaceae bacterium strain FGI 57	693444	species	4762179	8	1	0
Pseudomonas savastanoi pv. savastanoi NCPPB 3335	693985	leaf	6016828	1	0	0.0
Escherichia coli UMNK88	696406	leaf	5666764	5	1	7.7369e-217
[Enterobacter] lignolyticus SCF1	701347	leaf	4814049	25	11	0
Salmonella enterica subsp. enterica serovar Saintpaul str. SARA26	702982	leaf	4686793	6	4	1.56214e-05
Tannerella sp. oral taxon HOT-286	712710	species	2973544	1	0	0.0
Amycolatopsis mediterranei S699	713604	leaf	20483699	2	0	0.0
Erwinia amylovora ATCC 49946	716540	leaf	3905604	1	0	0.0
Enterobacter cloacae subsp. cloacae ATCC 13047	716541	leaf	5598796	4	0	3.90458e-269
Salmonella enterica subsp. enterica serovar Typhimurium str. T000240	718274	leaf	5069994	1	1	5.64503e-07
Rahnella sp. Y9602	741091	species	5614252	1	0	0.0
Sphingomonas sp. MM-1	745310	species	4633613	1	1	0.0
Azoarcus sp. KH32C	748247	species	5818755	1	1	0.0
Amycolatopsis mediterranei U32	749927	leaf	10236715	1	0	0.0
Salmonella enterica subsp. enterica serovar Senftenberg str. 361154004	749965	leaf	5114779	1	0	0.0
Burkholderia insecticola	758793	species	6964487	6	3	0.0
Streptococcus parasanguinis ATCC 15912	760570	leaf	2153652	1	0	0.0
Rhodothermus marinus SG0.5JP17-172	762570	leaf	3334122	1	0	0.0
Streptococcus thermophilus ND03	767463	leaf	1831949	1	0	0.0
Serratia sp. AS12	768490	species	5443009	1	0	0.0
Serratia sp. AS13	768493	species	5442549	1	0	0.0
Salmonella enterica subsp. enterica serovar Newport str. CVM 22425	796730	leaf	4991133	2	1	0.0
Haemophilus influenzae F3031	866630	leaf	1985832	1	0	0.0
Escherichia coli DSM 30083 = JCM 1649 = ATCC 11775	866789	leaf	5034833	1	1	0.0
Arcobacter molluscorum LMG 25693	870501	leaf	2800582	1	0	0.0
Cupriavidus sp. USMAA2-4	876364	species	8698226	1	0	7.96642e-314
Bernardetia litoralis DSM 6794	880071	leaf	4919337	1	1	0.0
Caldithrix abyssi DSM 13497	880073	leaf	4978541	1	1	0.0
Enterobacter bugandensis	881260	species	4717613	3	1	1.4235e-06
Singulisphaera acidiphila DSM 18658	886293	leaf	9755686	1	0	0.0
Desulfomicrobium orale DSM 12838	888061	leaf	2783374	1	0	0.0
Plautia stali symbiont	891974	species	4092852	1	0	0.0
Salmonella enterica subsp. enterica serovar Gaminara	913070	leaf	5030148	2	0	0.0
Methylobacterium sp. AMS5	925818	species	5599206	1	0	0.0
Echinicola vietnamensis DSM 17526	926556	leaf	5608040	1	1	0.0
Acidiphilium multivorum AIU301	926570	leaf	4214744	1	0	0.0
Gibbsiella quercinecans	929813	species	5548506	9	1	0.0
Salmonella phage RE-2010	929814	species	34117	17	0	1.74079e-47
Salmonella enterica subsp. enterica serovar Newport str. Levine 1	930778	leaf	4841916	3	1	1.31009e-05
Salmonella enterica subsp. enterica serovar Newport str. Levine 15	930779	leaf	4883715	2	0	3.78614e-06
Klebsiella aerogenes EA1509E	935296	leaf	5591105	8	0	8.46913e-168
Haemophilus influenzae F3047	935897	leaf	2007018	1	0	0
Salmonella enterica subsp. enterica serovar Sloterdijk str. ATCC 15791	938141	leaf	4817791	1	1	1.55107e-23
Salmonella enterica subsp. enterica serovar Choleraesuis str. ATCC 10708	938142	leaf	4801679	3	0	3.88052e-18
Salmonella enterica subsp. enterica serovar Pomona str. ATCC 10729	941188	leaf	4678025	3	3	6.93417e-06
Salmonella enterica subsp. enterica serovar Paratyphi A str. ATCC 11511	941189	leaf	4580689	1	0	1.18034e-05
Salmonella enterica subsp. enterica serovar Chester str. ATCC 11997	941190	leaf	4660922	10	2	3.67734e-06
Escherichia coli O25b:H4	941280	leaf	5483091	40	0	0
Cronobacter sakazakii SP291	956149	leaf	4518784	7	6	0.0
Salmonella enterica subsp. enterica serovar Mbandaka str. ATCC 51958	984237	leaf	4905181	2	0	9.89581e-06
Marinovum algicola DG 898	988812	leaf	5252390	1	1	0.0
Polymorphum gilvum SL003B-26A1	991905	leaf	4718963	1	0	0.0
Salmonella enterica subsp. enterica serovar Oranienburg str. 0250	997333	leaf	4648879	2	0	0
Salmonella enterica subsp. enterica serovar Newport str. WA_14882	997339	leaf	4712541	2	1	3.44168e-06
Paenibacillus mucilaginosus K02	997761	leaf	8819200	1	1	0.0
Salmonella enterica subsp. enterica serovar Enteritidis str. RM2968	998822	leaf	4792035	3	0	1.88166e-43
Alteromonas mediterranea DE1	1004786	leaf	4947126	1	0	0.0
Klebsiella michiganensis KCTC 1686	1006551	leaf	5974109	2	2	0.0
Salmonella enterica subsp. enterica serovar Typhimurium str. 798	1008297	leaf	4970096	5	4	6.19312e-07
Novosphingobium sp. THN1	1016987	species	4649073	1	0	0.0
Klebsiella aerogenes KCTC 2190	1028307	leaf	5280350	28	1	2.03015e-165
Psychrobacter sp. DAB_AL43B	1028416	species	3309148	1	1	0.0
Pseudomonas sp. StFLB209	1028989	species	6332373	2	0	0.0
Salmonella enterica subsp. enterica serovar Typhimurium str. SARA13	1029978	leaf	4913633	2	0	1.9416e-07
Salmonella enterica subsp. enterica serovar Pullorum str. ATCC 9120	1029979	leaf	4781492	30	2	4.70311e-33
Salmonella enterica subsp. enterica serovar Abony str. 0014	1029983	leaf	4737447	6	3	2.26491e-06
Salmonella enterica subsp. enterica serovar Heidelberg str. SARA35	1029997	leaf	4751206	3	0	5.39702e-20
Ralstonia solanacearum Po82	1031711	leaf	5430263	2	0	0.0
Arcobacter mytili LMG 24559	1032238	leaf	3037595	1	0	0.0
Rhodospirillum rubrum F11	1036743	leaf	4352825	1	0	0.0
Bradyrhizobium japonicum USDA 6	1037409	leaf	9207384	1	0	0.0
Enterobacter cloacae EcWSU1	1045856	leaf	4798091	1	0	0.0
Klebsiella pneumoniae KCTC 2242	1049565	leaf	5462423	191	44	4.43653e-06
Salmonella enterica subsp. enterica serovar Thompson str. RM6836	1064551	leaf	4707648	2	0	0
Escherichia coli O7:K1 str. CE10	1072459	leaf	5378729	10	0	0
Salmonella enterica subsp. enterica serovar Agona str. 392869-2	1072590	leaf	4798530	2	0	6.75992e-06
Cronobacter condimenti 1330	1073999	leaf	4499482	7	2	0.0
Cronobacter universalis NCTC 9529	1074000	leaf	4436873	3	1	0.0
Pantoea rwandensis	1076550	species	4327607	2	1	0.0
Salmonella enterica subsp. enterica serovar Fresno	1077085	leaf	4822167	2	1	1.98888e-05
Paracoccus zhejiangensis	1077935	species	4637247	2	1	0.0
Klebsiella pneumoniae subsp. pneumoniae KPNIH1	1087440	leaf	5766615	1	0	0.0
Dickeya solani	1089444	species	4920704	8	0	0.0
Cutibacterium acnes subsp. defendens ATCC 11828	1091045	leaf	2488626	1	0	1.52978e-24
Methylomicrobium alcaliphilum 20Z	1091494	leaf	4796711	1	1	0.0
Klebsiella pneumoniae subsp. pneumoniae KPNIH10	1094170	leaf	5767822	1	0	0.0
Pseudonocardia sp. EC080619-01	1096856	species	7205934	1	0	0.0
Pseudonocardia sp. EC080625-04	1096868	species	6554452	1	0	0.0
Burkholderia sp. YI23	1097668	species	8896411	1	1	0.0
Enterobacter cloacae subsp. dissolvens SDM	1104326	leaf	4968248	3	0	0.0
Brenneria goodwinii	1109412	species	5360730	2	1	0.0
Gordonia polyisoprenivorans VH2	1112204	leaf	5844299	1	1	0.0
Streptococcus parasanguinis FW213	1114965	leaf	2171609	1	0	0.0
Martelella mediterranea DSM 17316	1122214	leaf	5693067	1	1	0.0
Klebsiella pneumoniae subsp. pneumoniae Kp13	1123862	leaf	5739888	67	16	8.4262e-07
Salmonella enterica subsp. enterica serovar Agona str. 460004 2-1	1124917	leaf	4797171	1	0	3.95376e-18
Salmonella enterica subsp. enterica serovar Minnesota str. ATCC 49284	1124956	leaf	4592393	4	2	2.72692e-06
Salmonella enterica subsp. enterica serovar Muenster str. 0315	1124958	leaf	4972820	2	0	4.33965e-65
Salmonella enterica subsp. enterica serovar Muenster str. 420	1124959	leaf	4756014	2	0	3.41193e-06
Salmonella enterica subsp. enterica serovar Panama str. ATCC 7378	1124961	leaf	4555576	3	1	2.68676e-06
Salmonella enterica subsp. enterica serovar Poona str. ATCC BAA-1673	1124962	leaf	5091833	2	1	4.16387e-05
Pseudomonas protegens CHA0	1124983	leaf	6867980	1	0	0.0
Klebsiella pneumoniae subsp. pneumoniae HS11286	1125630	leaf	5682322	74	51	0.0
Salmonella phage SPN9CC	1127357	species	40128	5	0	1.45827e-121
Salmonella enterica subsp. enterica serovar Nitra	1129117	leaf	4691807	1	0	4.07419e-07
Ralstonia solanacearum FJAT-1458	1130828	leaf	6059899	1	0	0.0
Ralstonia solanacearum FJAT-91	1130829	leaf	5874087	3	0	0.0
Streptomyces hygroscopicus subsp. jinggangensis 5008	1133850	leaf	10383684	1	0	0.0
Cutibacterium acnes HL096PA1	1134454	leaf	2549775	1	0	0.0
Klebsiella michiganensis	1134687	species	6150064	858	1	2.11194e-127
Cronobacter sakazakii ES15	1138308	leaf	4268675	1	0	0.0
Corallococcus coralloides DSM 2259	1144275	leaf	10080619	1	0	0.0
Blastococcus saxobsidens DD2	1146883	leaf	4875340	3	3	0.0
Salmonella phage SPN3UB	1147140	species	47355	1	0	2.47468e-149
Rahnella aquatilis HX2	1151116	leaf	5656799	2	1	0.0
Streptococcus sp. I-G2	1156431	species	1992567	1	0	0.0
Streptococcus sp. I-P16	1156433	species	2023580	1	0	0.0
Kosakonia sacchari	1158459	species	4902027	17	6	0.0
Cronobacter malonaticus LMG 23826	1159491	leaf	4473761	4	0	0.0
Cronobacter dublinensis subsp. dublinensis LMG 23823	1159554	leaf	4628405	4	0	0
Cronobacter muytjensii ATCC 51329	1159613	leaf	4364114	7	1	0.0
Salmonella enterica subsp. enterica serovar Heidelberg str. B182	1160717	leaf	4788046	7	4	6.33421e-07
Enterobacter sp. R4-368	1166130	species	5155034	6	0	0.0
Salmonella enterica subsp. enterica serovar Bareilly str. CFSAN000189	1173427	leaf	4808805	8	0	1.41844e-05
Salmonella enterica subsp. enterica serovar Bareilly str. CFSAN000191	1173457	leaf	4723270	7	0	8.58936e-65
Salmonella enterica subsp. enterica serovar Albany str. ATCC 51960	1173798	leaf	4805448	2	1	2.3363e-07
Salmonella enterica subsp. enterica serovar Weltevreden str. 1655	1173939	leaf	5129059	3	0	2.83074e-06
Pectobacterium wasabiae CFBP 3304	1175631	leaf	5043228	3	0	0
Kosakonia radicincitans DSM 16656	1177180	leaf	6122453	9	2	0
Halomonas huangheensis	1178482	species	4757486	1	0	0.0
Klebsiella michiganensis E718	1191061	leaf	6561678	2	0	0.0
Flammeovirga sp. MY04	1191459	species	7327614	1	1	0.0
Klebsiella pneumoniae subsp. pneumoniae 1084	1193292	leaf	5386705	766	623	6.29194e-06
Salmonella enterica subsp. enterica serovar Bredeney str. CFSAN001080	1194154	leaf	4603849	2	0	1.82367e-05
Gilliamella apicola	1196095	species	3139412	1	0	0.0
Salmonella bongori N268-08	1197719	leaf	4773537	15	0	0
secondary endosymbiont of Ctenarytaina eucalypti	1199245	species	1441139	1	0	0.0
Streptomyces hygroscopicus subsp. jinggangensis TL01	1203460	leaf	10077952	1	0	0.0
Aeromonas media WS	1208104	leaf	4788430	1	0	0.0
Celeribacter indicus	1208324	species	4969388	1	1	0.0
Enterobacter cloacae subsp. cloacae ENHKU01	1211025	leaf	4726582	9	6	0.0
Dyella japonica A8	1217721	leaf	4831185	1	1	0.0
Amycolatopsis mediterranei RB	1221524	leaf	10246864	1	0	0.0
Gluconobacter oxydans H24	1224746	leaf	3816232	1	1	0.0
Pseudomonas mendocina S5.2	1225174	leaf	5372474	2	2	0.0
Salmonella enterica subsp. enterica serovar Gallinarum/pullorum str. CDC1983-67	1225522	leaf	4623089	2	0	9.11492e-38
Dickeya solani D s0432-1	1231725	leaf	4919812	6	0	0.0
Nocardiopsis gilva YIM 90087	1235441	leaf	6142152	2	2	0.0
Kosakonia sacchari SP1	1235834	leaf	4902027	1	0	0.0
Candidatus Pantoea carbekii	1235990	species	2348022	2	0	0.0
Sodalis praecaptivus	1239307	species	5159425	9	1	0.0
Salmonella enterica subsp. enterica serovar Bergen str. ST350	1240708	leaf	4801835	1	0	1.14045e-05
Salmonella enterica subsp. enterica serovar Antsalova str. S01-0511	1242087	leaf	4648086	2	0	8.18232e-07
Salmonella enterica subsp. enterica serovar Apapa str. SA20060561	1242088	leaf	4801658	2	0	6.94578e-06
Salmonella enterica subsp. enterica serovar Borreze str. SA20041063	1242089	leaf	4777558	1	0	1.19681e-58
Salmonella enterica subsp. enterica serovar Gaminara str. SA20063285	1242094	leaf	4957986	5	2	0
Salmonella enterica subsp. enterica serovar Hillingdon str. N1529-D3	1242096	leaf	4618056	4	2	1.26024e-05
Salmonella enterica subsp. enterica serovar Hvittingfoss str. SA20014981	1242097	leaf	4940239	1	1	9.33854e-06
Salmonella enterica subsp. enterica serovar Kentucky str. SA20030505	1242102	leaf	4850980	3	1	3.57283e-06
Salmonella enterica subsp. enterica serovar Koessen str. S-1501	1242105	leaf	4566169	2	0	3.27837e-15
Salmonella enterica subsp. enterica serovar Krefeld str. SA20030536	1242106	leaf	4942273	1	0	9.61957e-06
Salmonella enterica subsp. enterica serovar Macclesfield str. S-1643	1242107	leaf	5268613	10	8	2.02448e-05
Salmonella enterica subsp. enterica serovar Manchester str. ST278	1242108	leaf	4532753	3	0	1.19222e-05
Salmonella enterica subsp. enterica serovar Milwaukee str. SA19950795	1243578	leaf	5102439	1	1	3.62205e-06
Salmonella enterica subsp. enterica serovar Moscow str. S-1843	1243579	leaf	4690402	1	1	1.22045e-06
Salmonella enterica subsp. enterica serovar Onderstepoort str. SA20060086	1243584	leaf	5005424	6	3	5.43289e-06
Salmonella enterica subsp. enterica serovar Ouakam str. SA20034636	1243586	leaf	4874915	2	2	6.51668e-06
Salmonella enterica subsp. enterica serovar Wandsworth str. SA20092095	1243595	leaf	4916040	4	1	2.9729e-05
Salmonella enterica subsp. salamae serovar 55:k:z39 str. 1315K	1243602	leaf	5051440	6	3	3.39948e-06
Salmonella enterica subsp. diarizonae serovar 50:k:z str. MZ0080	1243612	leaf	5076950	2	0	0.0
Salmonella enterica subsp. diarizonae serovar 65:c:z str. SA20044251	1243616	leaf	5066092	3	0	0
Salmonella bongori serovar 66:z41:- str. SA19983605	1243617	leaf	4468959	13	1	0
Klebsiella pneumoniae CG43	1244085	leaf	5166857	127	25	1.65386e-167
Salmonella enterica subsp. enterica serovar Enteritidis str. EC20110361	1244119	leaf	4682911	1	1	0.0
endosymbiont of unidentified scaly snail isolate Monju	1248727	species	2597759	1	1	0.0
Pelagibaca abyssi	1250539	species	5259072	1	1	0.0
Pseudomonas sp. FGI182	1259844	species	5891312	1	0	0.0
Citrobacter amalonaticus Y19	1261127	leaf	5875351	5	0	1.81611e-260
Edwardsiella piscicida	1263550	species	3857040	1	0	0.0
Chryseobacterium camelliae	1265445	species	4376354	1	1	0.0
Frischella perrara	1267021	species	2692351	1	0	0.0
Cupriavidus gilardii CR3	1267562	leaf	5578743	1	1	0.0
Salmonella enterica subsp. enterica serovar Javiana str. CFSAN001992	1267753	leaf	4675267	2	0	6.48418e-06
Salmonella enterica subsp. enterica serovar Cubana str. CFSAN002050	1271863	leaf	5267011	5	3	8.52067e-06
Sphingomonas wittichii DC-6	1283312	leaf	6573352	1	0	0.0
Azotobacter vinelandii CA	1283330	leaf	5366370	4	0	0.0
Azotobacter vinelandii CA6	1283331	leaf	5323210	4	0	0.0
Klebsiella pneumoniae UHKPC33	1284802	leaf	5663117	24	10	0.0
Raoultella ornithinolytica B6	1286170	leaf	5398151	22	0	0.0
Edwardsiella piscicida C07-087	1288122	leaf	3857040	1	0	0.0
Rhodococcus erythropolis R138	1289591	leaf	6806506	1	0	0.0
Pseudomonas sp. ATCC 13867	1294143	species	5696307	1	1	0.0
Melittangium boletus DSM 14713	1294270	leaf	9910441	1	0	0.0
Roseibacterium elongatum DSM 19469	1294273	leaf	3555109	1	1	0.0
Enterobacter hormaechei subsp. xiangfangensis	1296536	subspecies	20054814	2	0	0.0
Kosakonia cowanii JCM 10956 = DSM 18146	1300165	leaf	4857324	14	2	0
Alteromonas mediterranea UM7	1300258	leaf	4931660	1	0	0.0
Isoptericola dokdonensis DS-3	1300344	leaf	3826972	1	1	0.0
Rhizobium sp. IE4771	1301032	species	7057405	1	0	0.0
Klebsiella pneumoniae 500_1420	1304922	leaf	5547643	18	18	0.0
Salinivirga cyanobacteriivorans	1307839	species	4812386	1	1	0.0
Klebsiella michiganensis HKOPL1	1308980	leaf	5914407	8	3	0.0
Ralstonia pseudosolanacearum	1310165	species	11622205	5	1	0.0
Escherichia coli ACN001	1311757	leaf	4936576	23	1	0
Pseudoalteromonas agarivorans DSM 14585	1312369	leaf	4544962	1	0	0.0
Pseudomonas syringae pv. syringae B301D	1324931	leaf	6094819	1	0	0.0
Nitrospira japonica	1325564	species	4084817	1	1	0.0
Klebsiella pneumoniae subsp. pneumoniae KPNIH27	1328324	leaf	6132443	122	25	7.8794e-07
Klebsiella pneumoniae subsp. pneumoniae KPR0928	1328325	leaf	5436785	3	0	0.0
Escherichia coli APEC IMT5155	1329907	leaf	5126057	14	11	0
Lelliottia	1330545	genus	0	3	0	0.0
Pluralibacter	1330546	genus	4814049	4	0	0.0
Brachybacterium ginsengisoli	1331682	species	3953253	1	1	0.0
Citrobacter freundii CFNIH1	1333848	leaf	5371331	176	0	1.34217e-64
Enterobacter hormaechei subsp. hoffmannii ECR091	1333849	leaf	4959888	9	0	2.04999e-259
Klebsiella oxytoca KONIH1	1333852	leaf	6684898	33	0	2.91232e-190
[Enterobacter] lignolyticus	1334193	species	4814049	26	4	0
Serratia marcescens SM39	1334564	leaf	5326023	3	0	0.0
Serratia liquefaciens ATCC 27592	1346614	leaf	5282719	1	1	0.0
Enterobacter cloacae P101	1354030	leaf	5369929	4	0	0.0
Bradyrhizobium diazoefficiens	1355477	species	18211892	1	0	0.0
Escherichia coli PCN061	1358422	leaf	4901825	6	0	0
Klebsiella pneumoniae KP-1	1365186	leaf	5375667	218	27	9.00672e-07
Paracoccus aminophilus JCM 7686	1367847	leaf	4873118	2	0	0.0
Klebsiella pneumoniae JM45	1380908	leaf	5603174	55	43	1.89965e-06
Salmonella bongori serovar 48:z41:-- str. RKS3044	1382510	leaf	4394500	14	1	0
Salmonella enterica subsp. arizonae serovar 62:z36:- str. RKS2983	1386967	leaf	4574846	5	1	0.0
Sulfitobacter sp. SK012	1389005	species	5176795	2	1	0.0
Sphingomonas sp. LK11	1390395	species	3938206	2	2	0.0
Klebsiella pneumoniae subsp. pneumoniae 1158	1392499	leaf	5341039	37	6	6.79032e-19
Klebsiella pneumoniae HK787	1392500	leaf	5329385	39	8	2.29044e-170
Escherichia coli APEC O18	1401688	leaf	5006568	1	0	0
Klebsiella pneumoniae subsp. pneumoniae PittNDM01	1406314	leaf	5812304	3	0	0.0
Salmonella enterica subsp. enterica serovar Agona str. 24249	1406860	leaf	4762840	1	0	1.92574e-58
Sinorhizobium americanum CCGM7	1408224	leaf	6853050	1	0	0.0
Pseudomonas aeruginosa LES431	1408272	leaf	6550070	1	0	0.0
Salmonella enterica subsp. enterica serovar Cerro str. CFSAN001588	1410916	leaf	4768236	5	1	6.70704e-06
Actinomadura amylolytica	1411117	species	6800142	1	1	0.0
Celeribacter manganoxidans	1411902	species	3956796	2	2	0.0
Salmonella enterica subsp. enterica serovar Enteritidis str. EC20090698	1412454	leaf	4680996	1	0	0.0
Candidatus Walczuchella monophlebidarum	1415657	species	309299	1	1	0.0
Oceanisphaera profunda	1416627	species	3508860	1	0	0.0
Klebsiella pneumoniae 30660/NJST258_1	1420012	leaf	5540936	2	1	0.0
Pseudomonas protegens Cab57	1420599	leaf	6827892	1	0	0.0
Enterobacter asburiae L1	1421338	leaf	4561905	6	0	0.0
Dickeya zeae EC1	1427366	leaf	4532364	1	0	0.0
Rhizobium etli bv. phaseoli str. IE4803	1432049	leaf	6997434	2	0	0.0
Vibrio cholerae O1 str. KW3	1433144	leaf	4089020	1	0	0.0
Methanosarcina barkeri str. Wiesmoor	1434109	leaf	4907186	1	0	0.0
Pseudomonas monteilii SB3078	1435044	leaf	6000087	1	0	0.0
Pseudomonas monteilii SB3101	1435058	leaf	5945120	1	0	0.0
Streptomyces leeuwenhoekii	1437453	species	8122491	1	1	0.0
Xenorhabdus nematophila AN6/1	1437823	leaf	4586662	2	0	0.0
Castellaniella defragrans 65Phen	1437824	leaf	3952818	1	0	0.0
Escherichia albertii KF1	1440052	leaf	4701875	55	10	3.77954e-06
Nitrospirillum amazonense CBAmc	1441467	leaf	7382386	1	1	0.0
Escherichia coli str. Sanji	1441627	leaf	5428586	7	0	0
Pseudomonas cichorii JBC1	1441629	leaf	5986012	1	0	0.0
Chania multitudinisentens RB-25	1441930	leaf	5488183	1	0	0.0
Yersinia enterocolitica LC20	1443113	leaf	4850874	1	0	0.0
Gynuella sunshinyii	1445505	species	6475959	3	0	0.0
Escherichia coli O169:H41	1446701	leaf	10379449	2	0	4.61525e-287
Escherichia coli O25:NM	1446707	leaf	5042926	1	0	0
Escherichia coli O6:H16	1446746	leaf	15266711	68	2	9.28107e-169
Hafnia alvei FB1	1453496	leaf	4712721	1	0	0.0
Salmonella enterica subsp. enterica serovar Anatum str. USDA-ARS-USMARC-1727	1454584	leaf	4980540	1	1	1.83185e-25
Salmonella enterica subsp. enterica serovar Anatum str. USDA-ARS-USMARC-1736	1454586	leaf	4864598	1	1	3.85804e-81
Salmonella enterica subsp. enterica serovar Anatum str. CDC 06-0532	1454592	leaf	4667713	1	1	3.27036e-06
Salmonella enterica subsp. enterica serovar Montevideo str. USDA-ARS-USMARC-1912	1454600	leaf	4547966	2	2	0.0
Salmonella enterica subsp. enterica serovar Montevideo str. USDA-ARS-USMARC-1903	1454603	leaf	4565462	1	1	2.13062e-07
Salmonella enterica subsp. enterica serovar Montevideo str. USDA-ARS-USMARC-1904	1454604	leaf	4598213	1	0	0.0
Salmonella enterica subsp. enterica serovar Montevideo str. CDC 07-0954	1454607	leaf	4773383	1	0	0.0
Salmonella enterica subsp. enterica serovar Montevideo str. CDC 2011K-1674	1454610	leaf	4693862	1	0	0.0
Salmonella enterica subsp. enterica serovar Montevideo str. CDC 2013K-0218	1454612	leaf	4655223	1	1	0.0
Salmonella enterica subsp. enterica serovar Montevideo str. CDC 2010K-0257	1454613	leaf	4814175	4	0	3.98105e-23
Salmonella enterica subsp. enterica serovar Typhimurium str. USDA-ARS-USMARC-1896	1454636	leaf	5003736	2	1	2.41174e-07
Salmonella enterica subsp. enterica serovar Typhimurium str. CDC 2009K-1640	1454644	leaf	5027726	1	0	2.66028e-23
Salmonella enterica subsp. enterica serovar Typhimurium str. USDA-ARS-USMARC-1810	1454647	leaf	4927145	6	2	6.64523e-05
Klebsiella quasipneumoniae subsp. similipneumoniae	1463164	subspecies	5514898	158	2	1.03722e-164
Klebsiella quasipneumoniae	1463165	species	5528721	2921	10	9.59736e-95
Pantoea sp. PSNIH2	1484157	species	4967343	12	0	0
Pantoea sp. PSNIH1	1484158	species	4410683	3	1	0.0
Paracoccus mutanolyticus	1499308	species	3592357	4	0	0.0
Escherichia marmotae	1499973	species	4896291	1	0	0
Burkholderia stagnalis	1503054	species	7583807	2	2	0.0
Methylomonas denitrificans	1538553	species	5172098	1	0	0.0
Blastomonas fulva	1550728	species	4123210	1	0	0.0
Enterobacter sp. E20	1560339	species	4763114	1	0	0.0
Citrobacter pasteurii	1563222	species	4654874	11	0	4.02417e-238
Lentzea guizhouensis	1586287	species	9997872	1	1	0.0
Confluentimicrobium sp. EMB200-NS6	1609966	species	4147426	1	0	0.0
Erwinia gerundensis	1619313	species	4481256	3	0	0.0
Planctomyces sp. SH-PL62	1636152	species	6784659	1	0	0.0
Aeromonas sp. ASNIH4	1636609	species	5480196	1	0	0.0
Chania multitudinisentens	1639108	species	5488183	1	0	0.0
Devosia sp. H5989	1643450	species	4594249	1	1	0.0
Salmonella phage SEN34	1647463	species	40740	10	0	4.55465e-13
Mitsuaria sp. 7	1658665	species	6085092	1	1	0.0
Magnetospirillum sp. XM-1	1663591	species	4992477	1	1	0.0
Klebsiella quasipneumoniae subsp. quasipneumoniae	1667327	subspecies	5542544	121	6	4.17639e-170
Caulobacter flavus	1679497	species	5659202	1	0	0.0
Pseudonocardia sp. EC080610-09	1688404	species	7131853	1	0	0.0
Enterobacter sp. FY-07	1692238	species	5138701	52	49	1.53009e-05
Kocuria sp. BT304	1702043	species	2763150	1	0	0.0
Citrobacter sp. FDAARGOS_156	1702170	species	4727498	10	3	1.63068e-236
Citrobacter sp. CRE-46	1703250	species	6081860	19	1	1.38157e-262
Methylovulum psychrotolerans	1704499	species	4923400	2	0	0.0
Burkholderia sp. IDO3	1705310	species	8003806	2	0	4.37514e-23
Massilia sp. WG5	1707785	species	6216151	1	0	0.0
Salmonella enterica subsp. salamae serovar 57:z29:z42	1710356	leaf	4719375	4	1	1.3457e-05
Pedobacter sp. PACM 27299	1727164	species	6147290	1	1	0.0
Rhodococcus sp. H-CA8f	1727214	species	6497607	1	0	0.0
Burkholderia sp. Bp7605	1740163	species	5705688	1	0	0.0
Phytobacter sp. SCO41	1756993	species	5599325	14	0	0.0
Achromobacter sp. AONIH1	1758194	species	6648943	1	0	0.0
Serratia sp. SSNIH1	1758196	species	5388594	23	0	0
Serinicoccus sp. JLT9	1758689	species	3597394	1	1	0.0
Serratia sp. YD25	1759437	species	5117644	3	1	0.0
Salinicola tamaricis	1771309	species	4276240	1	0	0.0
Candidatus Hoaglandella endobia	1778263	species	636713	2	1	0.0
Dickeya fangzhongdai	1778540	species	10011670	2	0	0.0
Bosea sp. PAMC 26642	1792307	species	5510355	1	1	0.0
Enterobacter roggenkampii	1812935	species	10176893	9	1	0.0
Shigella sp. PAMC 28760	1813821	species	4558287	14	0	0
Synechococcus sp. NIES-970	1827144	species	3123859	1	1	0.0
Enterobacter sp. ODB01	1827481	species	4534036	2	0	2.01595e-252
Streptococcus sp. FDAARGOS_192	1839799	species	2435494	1	0	0.0
Acidovorax sp. RAC01	1842533	species	4574859	2	0	3.90886e-48
Sinorhizobium sp. RAC02	1842534	species	6626583	1	1	0.0
Blastomonas sp. RAC04	1842535	species	4403499	1	0	0.0
Bosea sp. RAC05	1842539	species	5620120	1	1	0.0
Hafnia sp. CBA7124	1848580	species	4585298	3	0	0.0
Arthrobacter sp. U41	1849032	species	4792631	1	1	0.0
Rhizorhabdus dicambivorans	1850238	species	5541299	1	0	0.0
Rhodobacter sp. LPB0142	1850250	species	3780829	1	1	0.0
Acidovorax sp. T1	1858609	species	4416593	2	2	0.0
Enterobacter sp. HK169	1868135	species	4551186	5	0	5.47042e-250
Candidatus Fukatsuia symbiotica	1878942	species	3131594	2	1	0.0
Pantoea alhagi	1891675	species	4316301	4	0	0.0
Amycolatopsis sp. AA4	1896961	species	9172799	7	7	0.0
Rhodocyclaceae bacterium	1898103	species	3192379	2	1	0.0
Erwiniaceae	1903409	family	1800752	2	0	0.0
Yersiniaceae	1903411	family	5752198	14	0	0.0
Morganellaceae	1903414	family	5691351	15	0	0.0
Oceanisphaera avium	1903694	species	2902896	2	0	0.0
Klebsiella sp. LTGPAF-6F	1905288	species	6790399	31	0	3.04918e-191
Pectobacterium parmentieri	1905730	species	5063892	16	0	0.0
Jeongeupia sp. USM3	1906741	species	3788814	1	1	0.0
Lelliottia jeotgali	1907578	species	4603334	1	0	0
Nonomuraea sp. ATCC 55076	1909395	species	13047416	1	1	0.0
Enterobacter sp. SA187	1914861	species	4429597	6	1	0.0
Thioclava nitratireducens	1915078	species	4238255	1	1	0.0
Enterobacter cloacae complex sp. ECNIH7	1915310	species	5388828	26	3	2.42642e-262
Enterobacteriaceae bacterium ENNIH2	1920109	species	6262406	185	10	1.20237e-60
Citrobacter sp. CFNIH10	1920110	species	5738233	262	1	4.35955e-216
Leclercia sp. LSNIH1	1920114	species	5411940	34	7	0
Leclercia sp. LSNIH3	1920116	species	5389886	3	0	0
Enterobacteriaceae bacterium ENNIH3	1920128	species	6079128	149	1	7.8725e-07
Sphingomonas sp. JJ-A5	1921510	species	3787976	1	1	0.0
Candidatus Erwinia sp. ErCipseudotaxifoliae	1922217	species	1094672	1	0	0.0
Pseudomonas sp. CC6-YY-74	1930532	species	5040792	1	0	0.0
Pseudomonas sp. S-6-2	1931241	species	4035153	1	1	0.0
Klebsiella sp. M5al	1934254	species	5800138	14	0	0.0
Aquaspirillum sp. LM1	1938604	species	3962240	2	1	0.0
Sphingomonas sp. LM7	1938607	species	4155514	1	1	0.0
Phytobacter ursingii	1972431	species	6166452	245	95	3.76133e-05
Streptomyces sp. Sge12	1972846	species	8110698	1	1	0.0
Enterobacter sp. Crenshaw	1977566	species	4630785	1	0	0.0
Sagittula sp. P11	2009329	species	5576178	1	1	0.0
Citrobacter sp. 86	2013114	species	5048670	47	0	1.51205e-244
Brachybacterium sp. VM2412	2017484	species	3796663	1	1	0.0
Roseomonas sp. FDAARGOS_362	2018065	species	5174209	2	0	0.0
Shewanella bicestrii	2018305	species	5004414	38	0	0
Citrobacter sp. 92	2019568	species	5109913	55	5	1.05459e-245
Rhizobium sp. Kim5	2020311	species	6817255	1	0	0.0
Plantactinospora sp. KBS50	2024580	species	6689726	1	1	0.0
Paraburkholderia aromaticivorans	2026199	species	8907716	2	2	0.0
Klebsiella quasivariicola	2026240	species	5946706	2357	39	5.94221e-85
Enterobacter cloacae complex sp.	2027919	species	10167193	213	2	0
Rhodobacteraceae bacterium QY30	2033435	species	3551172	1	1	0.0
Serratia sp. MYb239	2033438	species	4986519	5	0	0.0
Actinoplanes sp. SE50	2033844	species	9239482	1	0	0.0
Dickeya sp. Secpp 1600	2037915	species	5108113	1	0	0.0
Nostoc flagelliforme CCNUN1	2038116	leaf	10231233	1	0	0.0
Pectobacterium polaris	2042057	species	9835240	5	5	0.0
Escherichia coli O128:H27	2048776	leaf	5130625	17	14	4.37216e-176
Escherichia coli O15:H11	2048777	leaf	5181145	6	2	0
Enterobacter sp. CRENT-193	2051905	species	5196641	102	0	1.8243e-244
Enterobacteriaceae bacterium S05	2052938	species	5157054	986	0	2.66178e-243
Enterococcus sp. CR-Ec1	2057791	species	3889849	1	0	0.0
Enterococcus sp. FDAARGOS_375	2060307	species	3549293	1	0	0.0
Paracoccus sp. CBA4604	2065379	species	3299166	2	2	0.0
Citrobacter freundii complex sp. CFNIH2	2066049	species	5340584	5	1	5.44252e-236
Enterobacteriaceae bacterium ENNIH1	2066051	species	5666332	11	0	0.0
Pseudomonas sp. NC02	2067572	species	6890566	1	1	0.0
Pseudomonas sp. XWY-1	2069256	species	6297253	1	0	0.0
Enterobacter cloacae complex sp. FDA-CDC-AR_0164	2077136	species	4849791	4	0	0.0
Enterobacter cloacae complex sp. FDA-CDC-AR_0132	2077137	species	4971441	2	0	0.0
Citrobacter freundii complex sp. CFNIH3	2077147	species	5634842	81	0	1.46303e-247
Citrobacter freundii complex sp. CFNIH4	2077148	species	5629494	17	0	7.50504e-255
Citrobacter freundii complex sp. CFNIH9	2077149	species	5688355	57	3	2.29238e-256
Actinomyces sp. Z16	2079536	species	3761642	1	1	0.0
Zoogloeaceae bacteirum Par-f-2	2080469	species	3127098	1	0	0.0
Pseudomonas sp. SWI6	2083051	species	5652054	1	0	0.0
Pseudomonas sp. SWI44	2083053	species	5919083	1	0	0.0
Streptomyces sp. WAC00288	2094021	species	7852859	1	0	0.0
Mixta	2100764	genus	0	116	0	0.0
Plantactinospora sp. BC1	2108470	species	8333965	1	1	0.0
Lachnospiraceae bacterium GAM79	2109691	species	4078671	1	1	0.0
Halomonas sp. SF2003	2136172	species	4358421	1	1	0.0
Lelliottia sp. WB101	2153385	species	4734070	4	0	0.0
Saccharospirillum mangrovi	2161747	species	3686911	3	0	0.0
Dialister sp. Marseille-P5638	2161821	species	2320245	1	0	0.0
Gemmobacter sp. HYN0069	2169400	species	4206589	1	1	0.0
Limnobaculum parvum	2172103	species	3841771	1	1	0.0
Thauera hydrothermalis	2184083	species	3059321	1	0	0.0
Micromonospora sp. B006	2201999	species	7040153	1	1	0.0
Azospirillum sp. CFH 70021	2202148	species	6776313	1	1	0.0
Methylobacterium sp. 17Sr1-1	2202826	species	6542583	1	0	0.0
Pseudomonas sp. R2A2	2213057	species	4559447	1	0	0.0
Photorhabdus laumondii	2218628	species	11301093	2	0	0.0
Sphingomonas sp. FARSPH	2219696	species	3761538	1	1	0.0
Indioceanicola profundi	2220096	species	5374982	1	1	0.0
Raoultella sp. X13	2259647	species	5448479	38	0	0.0
Hydromonas sp. F02	2268024	species	2723407	1	1	0.0
Enterobacteriaceae bacterium w17	2282309	species	5125645	79	2	0
Enterobacteriaceae bacterium w6	2282310	species	4945486	8	1	0.0
Achromobacter sp. B7	2282475	species	6236552	1	0	0.0
Chryseolinea sp. KIS68-18	2321403	species	8241389	1	0	0.0
Alistipes sp. Marseille-P5997	2364787	species	3270862	1	1	0.0
Serratia sp. 3ACOL1	2448483	species	5876609	3	0	0.0
Serratia sp. LS-1	2485839	species	5129267	1	1	0.0
