# KrakenUniq v0.5.7 DATE:2019-04-15T17:43:36Z DB:/home/biouser/SAM/DBDIR/LIBRARY_MINIKRAKEN/minikraken_20171019_8GB DB_SIZE:8053064728 WD:/home/biouser/SAM
# CL:perl /home/biouser/miniconda3/bin/krakenuniq --db /home/biouser/SAM/DBDIR/LIBRARY_MINIKRAKEN/minikraken_20171019_8GB -paired /home/biouser/SAM/data/7-GC_S7_mixed_with_5%_10-KPN_S9_R1.fastq.gz /home/biouser/SAM/data/7-GC_S7_mixed_with_5%_10-KPN_S9_R2.fastq.gz --report-file /home/biouser/SAM/data/7-GC_S7_mixed_with_5%_10-KPN_S9.krakenuniq.report.tsv

%	reads	taxReads	kmers	dup	cov	taxID	rank	taxName
0.6279	3894	3894	11996538	14.9	1.398	0	no rank	unclassified
99.37	616300	15	283229	28.8	0.0004275	1	no rank	root
99.37	616285	3	282845	28.8	0.000433	131567	no rank	  cellular organisms
99.37	616282	2288	282845	28.8	0.0004478	2	superkingdom	    Bacteria
98.88	613259	4088	281504	28.6	0.000886	1224	phylum	      Proteobacteria
93.28	578533	39	97652	77.2	0.001633	28216	class	        Betaproteobacteria
93.27	578430	142	97092	77.5	0.03426	206351	order	          Neisseriales
93.24	578288	230	97092	77.4	0.06372	481	family	            Neisseriaceae
93.21	578057	44197	96233	77.5	0.08337	482	genus	              Neisseria
85.96	533094	522106	42416	91.8	0.6488	485	species	                Neisseria gonorrhoeae
1.399	8678	8678	107	165	0.1546	528354	no rank	                  Neisseria gonorrhoeae MS11
0.2344	1454	1454	8	296	0.03636	521006	no rank	                  Neisseria gonorrhoeae NCCP11945
0.138	856	856	52	37.3	0.03709	242231	no rank	                  Neisseria gonorrhoeae FA 1090
0.1051	652	552	1037	6.7	0.005213	487	species	                Neisseria meningitidis
0.007578	47	47	8	50	0.00404	942513	no rank	                  Neisseria meningitidis WUE 2594
0.004676	29	0	8	9.25	0.003712	491	no rank	                  Neisseria meningitidis serogroup B
0.004676	29	29	7	10.4	0.003853	630588	no rank	                    Neisseria meningitidis alpha710
0.001774	11	0	10	4.6	0.006592	65699	no rank	                  Neisseria meningitidis serogroup A
0.001774	11	11	10	4.6	0.006592	122587	no rank	                    Neisseria meningitidis Z2491
0.000645	4	0	29	1.1	0.003173	135720	no rank	                  Neisseria meningitidis serogroup C
0.0004837	3	3	20	1.1	0.003844	374833	no rank	                    Neisseria meningitidis 053442
0.0001612	1	1	7	1.14	0.002041	604162	no rank	                    Neisseria meningitidis 8013
0.0004837	3	3	31	1.13	0.004689	662598	no rank	                  Neisseria meningitidis alpha14
0.0003225	2	2	2	24	0.001584	935590	no rank	                  Neisseria meningitidis M0579
0.0001612	1	1	12	6.83	0.003873	935588	no rank	                  Neisseria meningitidis M01-240355
0.0001612	1	1	11	1.18	0.004386	935593	no rank	                  Neisseria meningitidis M04-240196
0.0001612	1	1	1	4	0.0025	935599	no rank	                  Neisseria meningitidis G2136
0.0001612	1	1	1	1	0.025	1095685	no rank	                  Neisseria meningitidis M7124
0.01564	97	81	259	3.73	0.003615	486	species	                Neisseria lactamica
0.00258	16	16	89	3.55	0.003619	489653	no rank	                  Neisseria lactamica 020-06
0.0009674	6	6	57	2	0.0005576	490	species	                Neisseria sicca
0.0004837	3	3	19	1.21	0.0001865	655307	species	                Neisseria sp. KEM232
0.0003225	2	0	28	1.14	0.0003134	495	species	                Neisseria elongata
0.0003225	2	0	28	1.14	0.0003134	88719	subspecies	                  Neisseria elongata subsp. glycolytica
0.0003225	2	2	28	1.14	0.0003134	546263	no rank	                    Neisseria elongata subsp. glycolytica ATCC 29315
0.0003225	2	2	22	1.05	0.0002047	1853278	species	                Neisseria sp. 10023
0.0003225	2	2	9	1.22	8.442e-05	1853276	species	                Neisseria sp. 10022
0.0001612	1	1	9	1	8.469e-05	326523	species	                Neisseria zoodegmatis
0.0001612	1	1	7	1.14	7.696e-05	28091	species	                Neisseria weaveri
0.0001612	1	0	10	1	0.0001084	538	genus	              Eikenella
0.0001612	1	1	10	1	0.0001084	539	species	                Eikenella corrodens
0.01032	64	0	634	1.09	1.248e-05	80840	order	          Burkholderiales
0.009997	62	0	604	1.09	2.272e-05	119060	family	            Burkholderiaceae
0.009836	61	3	586	1.08	0.000247	48736	genus	              Ralstonia
0.008707	54	13	499	1.06	0.001354	329	species	                Ralstonia pickettii
0.003709	23	23	142	1.05	0.001328	402626	no rank	                  Ralstonia pickettii 12J
0.002902	18	18	117	1.1	0.0009285	428406	no rank	                  Ralstonia pickettii 12D
0.0003225	2	2	18	1.33	0.00011	105219	species	                Ralstonia mannitolilytica
0.0003225	2	2	7	1	6.527e-06	305	species	                Ralstonia solanacearum
0.0001612	1	0	4	4	2.73e-07	32008	genus	              Burkholderia
0.0001612	1	0	2	6.5	2.587e-07	87882	species group	                Burkholderia cepacia complex
0.0001612	1	0	1	12	0.003145	152500	species	                  Burkholderia dolosa
0.0001612	1	1	1	12	0.003984	1385930	no rank	                    Burkholderia dolosa PC543
0.0001612	1	0	12	1	1.647e-06	506	family	            Alcaligenaceae
0.0001612	1	0	2	1	2.267e-05	1472344	genus	              Basilea
0.0001612	1	0	2	1	2.267e-05	1472345	species	                Basilea psittacipulmonis
0.0001612	1	1	2	1	2.267e-05	1072685	no rank	                  Basilea psittacipulmonis DSM 24701
0.0001612	1	0	7	1	7.927e-07	80864	family	            Comamonadaceae
0.0001612	1	1	1	1	7.085e-07	12916	genus	              Acidovorax
4.939	30634	104	186610	2.24	0.001221	1236	class	        Gammaproteobacteria
4.917	30494	298	184405	2.24	0.004388	91347	order	          Enterobacterales
4.867	30184	828	178197	2.23	0.008557	543	family	            Enterobacteriaceae
4.665	28930	2854	154376	2.27	0.0524	570	genus	              Klebsiella
4.193	26007	25561	79963	2.29	0.09267	573	species	                Klebsiella pneumoniae
0.05611	348	214	335	2.02	0.004005	72407	subspecies	                  Klebsiella pneumoniae subsp. pneumoniae
0.009352	58	58	64	1.97	0.008896	1123862	no rank	                    Klebsiella pneumoniae subsp. pneumoniae Kp13
0.006127	38	38	26	2.23	0.003194	272620	no rank	                    Klebsiella pneumoniae subsp. pneumoniae MGH 78578
0.004676	29	29	28	2.04	0.003131	1328324	no rank	                    Klebsiella pneumoniae subsp. pneumoniae KPNIH27
0.001129	7	7	5	2.6	0.00139	1392499	no rank	                    Klebsiella pneumoniae subsp. pneumoniae 1158
0.0003225	2	2	2	1.5	0.0009862	1125630	no rank	                    Klebsiella pneumoniae subsp. pneumoniae HS11286
0.008868	55	0	126	2.58	0.005729	39831	subspecies	                  Klebsiella pneumoniae subsp. rhinoscleromatis
0.008868	55	55	126	2.58	0.005729	861365	no rank	                    Klebsiella pneumoniae subsp. rhinoscleromatis SB3432
0.003064	19	19	31	1.61	0.007393	1365186	no rank	                  Klebsiella pneumoniae KP-1
0.002257	14	14	18	1.94	0.004395	1049565	no rank	                  Klebsiella pneumoniae KCTC 2242
0.001451	9	9	5	2.2	0.0002136	507522	no rank	                  Klebsiella pneumoniae 342
0.0001612	1	1	2	1	0.007605	1420012	no rank	                  Klebsiella pneumoniae 30660/NJST258_1
0.005321	33	31	72	2.26	0.0002321	548	species	                Klebsiella aerogenes
0.0003225	2	2	3	1.33	6.586e-05	1028307	no rank	                  Klebsiella aerogenes KCTC 2190
0.001774	11	9	28	2.07	0.0003838	244366	species	                Klebsiella variicola
0.0003225	2	2	5	3	0.0003446	640131	no rank	                  Klebsiella variicola At-22
0.001451	9	9	39	2.44	0.0003303	2026240	species	                Klebsiella quasivariicola
0.00129	8	8	23	2.13	0.0006753	1463165	species	                Klebsiella quasipneumoniae
0.0008062	5	5	26	2.31	7.471e-05	571	species	                Klebsiella oxytoca
0.0003225	2	2	6	3	0.0002942	1905288	species	                Klebsiella sp. LTGPAF-6F
0.0001612	1	1	2	1	9.506e-06	1134687	species	                Klebsiella michiganensis
0.0395	245	13	488	2.51	0.0002288	561	genus	              Escherichia
0.03596	223	210	427	2.5	0.0002551	562	species	                Escherichia coli
0.001451	9	0	50	3.02	0.002677	168807	no rank	                  Escherichia coli O127:H6
0.001451	9	9	50	3.02	0.002677	574521	no rank	                    Escherichia coli O127:H6 str. E2348/69
0.0001612	1	1	3	1	0.0002633	696406	no rank	                  Escherichia coli UMNK88
0.0001612	1	0	2	1	0.0007599	498388	no rank	                  Escherichia coli C
0.0001612	1	1	2	1	0.000771	481805	no rank	                    Escherichia coli ATCC 8739
0.0001612	1	1	1	2	0.0008628	741093	no rank	                  Escherichia coli Xuzhou21
0.0001612	1	0	1	1	0.0005666	1038927	no rank	                  Escherichia coli O104:H4
0.0001612	1	1	1	1	0.008475	1048254	no rank	                    Escherichia coli O104:H4 str. C227-11
0.001451	9	4	9	2.78	3.819e-05	208962	species	                Escherichia albertii
0.0008062	5	5	2	3.5	7.951e-05	1440052	no rank	                  Escherichia albertii KF1
0.01161	72	0	143	2.46	3.744e-05	547	genus	              Enterobacter
0.008868	55	3	118	2.31	4.096e-05	354276	species group	                Enterobacter cloacae complex
0.006611	41	39	74	2.58	6.847e-05	550	species	                  Enterobacter cloacae
0.0003225	2	0	3	2	5.947e-05	336306	subspecies	                    Enterobacter cloacae subsp. cloacae
0.0003225	2	2	3	2	0.0002044	1211025	no rank	                      Enterobacter cloacae subsp. cloacae ENHKU01
0.0008062	5	0	16	2	7.79e-05	158836	species	                  Enterobacter hormaechei
0.0008062	5	5	15	1.87	0.0003941	299766	subspecies	                    Enterobacter hormaechei subsp. steigerwaltii
0.000645	4	2	8	2.25	3.259e-05	1334193	species	                  Enterobacter lignolyticus
0.0003225	2	2	3	2.33	5.245e-05	701347	no rank	                    Enterobacter lignolyticus SCF1
0.0003225	2	2	5	1.4	0.0002265	208224	species	                  Enterobacter kobei
0.00129	8	8	7	4.71	0.0001723	1868135	species	                Enterobacter sp. HK169
0.0008062	5	5	9	2.67	0.0003882	1827481	species	                Enterobacter sp. ODB01
0.000645	4	4	5	2.6	2.418e-05	1692238	species	                Enterobacter sp. FY-07
0.01016	63	0	293	1.57	0.0001427	590	genus	              Salmonella
0.01016	63	22	271	1.61	0.0001509	28901	species	                Salmonella enterica
0.005966	37	20	87	2.03	0.0001155	59201	subspecies	                  Salmonella enterica subsp. enterica
0.000645	4	0	4	5.25	0.0003759	1242081	no rank	                    Salmonella enterica subsp. enterica serovar Hillingdon
0.000645	4	4	4	5.25	0.0003759	1242096	no rank	                      Salmonella enterica subsp. enterica serovar Hillingdon str. N1529-D3
0.000645	4	0	8	1.62	0.002695	29482	no rank	                    Salmonella enterica subsp. enterica serovar Abony
0.000645	4	4	8	1.62	0.002695	1029983	no rank	                      Salmonella enterica subsp. enterica serovar Abony str. 0014
0.0004837	3	3	4	4.25	0.000237	595	no rank	                    Salmonella enterica subsp. enterica serovar Infantis
0.0003225	2	0	4	1.25	0.0002665	192954	no rank	                    Salmonella enterica subsp. enterica serovar Mbandaka
0.0003225	2	2	4	1.25	0.0002665	984237	no rank	                      Salmonella enterica subsp. enterica serovar Mbandaka str. ATCC 51958
0.0001612	1	1	13	1	0.0004908	90371	no rank	                    Salmonella enterica subsp. enterica serovar Typhimurium
0.0001612	1	1	3	1.67	0.0001318	90370	no rank	                    Salmonella enterica subsp. enterica serovar Typhi
0.0001612	1	0	3	1	0.0001631	58712	no rank	                    Salmonella enterica subsp. enterica serovar Anatum
0.0001612	1	1	3	1	0.004127	1454584	no rank	                      Salmonella enterica subsp. enterica serovar Anatum str. USDA-ARS-USMARC-1727
0.0001612	1	0	1	1	0.0002009	58096	no rank	                    Salmonella enterica subsp. enterica serovar Bareilly
0.0001612	1	1	1	1	0.0002009	1173427	no rank	                      Salmonella enterica subsp. enterica serovar Bareilly str. CFSAN000189
0.000645	4	4	9	2.78	6.896e-05	59204	subspecies	                  Salmonella enterica subsp. diarizonae
0.004837	30	0	93	1.72	3.597e-05	544	genus	              Citrobacter
0.004515	28	1	84	1.7	6.718e-05	1344959	species group	                Citrobacter freundii complex
0.003709	23	20	67	1.7	0.0001214	546	species	                  Citrobacter freundii
0.0004837	3	3	3	3	2.708e-05	1333848	no rank	                    Citrobacter freundii CFNIH1
0.000645	4	4	10	1.4	3.472e-05	67827	species	                  Citrobacter werkmanii
0.0001612	1	1	4	2	2.428e-05	67824	species	                Citrobacter farmeri
0.0001612	1	0	2	1	1.001e-05	67825	species	                Citrobacter rodentium
0.0001612	1	1	2	1	1.001e-05	637910	no rank	                  Citrobacter rodentium ICC168
0.001612	10	0	30	2.63	0.0001301	579	genus	              Kluyvera
0.001612	10	10	30	2.63	0.0001301	61648	species	                Kluyvera intermedia
0.0004837	3	0	5	3.4	7.537e-06	158483	genus	              Cedecea
0.0004837	3	3	5	3.4	7.537e-06	158822	species	                Cedecea neteri
0.0001612	1	0	9	2.11	1.657e-05	160674	genus	              Raoultella
0.0001612	1	1	9	2.11	1.657e-05	54291	species	                Raoultella ornithinolytica
0.0001612	1	0	8	2.12	8.266e-06	1330547	genus	              Kosakonia
0.0001612	1	1	7	2.29	2.189e-05	208223	species	                Kosakonia cowanii
0.0001612	1	0	4	2.25	7.877e-06	1330545	genus	              Lelliottia
0.0001612	1	1	2	3	1.144e-05	1907578	species	                Lelliottia sp. PFL01
0.001129	7	0	31	1.97	4.594e-06	1903411	family	            Yersiniaceae
0.001129	7	0	21	2.05	5.788e-06	613	genus	              Serratia
0.0008062	5	3	14	2.21	1.352e-05	615	species	                Serratia marcescens
0.0003225	2	2	3	3	3.117e-05	1249634	no rank	                  Serratia marcescens FGI94
0.0003225	2	2	3	2	3.015e-05	61652	species	                Serratia rubidaea
0.0008062	5	0	15	2.13	4.554e-06	1903414	family	            Morganellaceae
0.000645	4	0	10	2.5	4.187e-05	581	genus	              Morganella
0.000645	4	4	10	2.5	4.187e-05	582	species	                Morganella morganii
0.0001612	1	0	3	1	3.021e-06	586	genus	              Providencia
0.0001612	1	0	2	1	1.278e-05	516075	species	                Providencia sneebia
0.0001612	1	1	2	1	1.278e-05	1141660	no rank	                  Providencia sneebia DSM 19967
0.00516	32	0	89	3.01	8.566e-06	135623	order	          Vibrionales
0.00516	32	0	89	3.01	8.566e-06	641	family	            Vibrionaceae
0.00516	32	0	89	3.01	1.047e-05	662	genus	              Vibrio
0.004676	29	29	77	3.19	0.0002948	674	species	                Vibrio mimicus
0.0004837	3	0	5	2.8	2.542e-05	29494	species	                Vibrio furnissii
0.0004837	3	3	5	2.8	2.542e-05	903510	no rank	                  Vibrio furnissii NCTC 11218
0.0003225	2	0	15	1.53	3.434e-07	72274	order	          Pseudomonadales
0.0001612	1	0	14	1.57	3.696e-07	135621	family	            Pseudomonadaceae
0.0001612	1	0	13	1.62	3.5e-07	286	genus	              Pseudomonas
0.0001612	1	0	2	1	6.142e-07	136845	species group	                Pseudomonas putida group
0.0001612	1	0	2	1	9.27e-07	303	species	                  Pseudomonas putida
0.0001612	1	1	1	1	0.000108	1193499	no rank	                    Pseudomonas putida SJTE-1
0.0001612	1	0	1	1	1.725e-07	468	family	            Moraxellaceae
0.0001612	1	1	1	1	2.676e-07	469	genus	              Acinetobacter
0.0001612	1	0	4	1.75	1.393e-06	135624	order	          Aeromonadales
0.0001612	1	0	4	1.75	1.393e-06	84642	family	            Aeromonadaceae
0.0001612	1	0	4	1.75	1.906e-06	642	genus	              Aeromonas
0.0001612	1	1	4	1.75	2.222e-05	652	species	                Aeromonas schubertii
0.0001612	1	0	2	1.5	4.568e-07	135613	order	          Chromatiales
0.0001612	1	0	2	1.5	1.046e-06	72276	family	            Ectothiorhodospiraceae
0.0001612	1	0	1	2	2.15e-06	1765964	genus	              Acidihalobacter
0.0001612	1	1	1	2	6.604e-06	1765967	species	                Acidihalobacter ferrooxidans
0.000645	4	0	18	1.17	2.332e-07	28211	class	        Alphaproteobacteria
0.000645	4	0	9	1	2.323e-07	356	order	          Rhizobiales
0.0001612	1	0	3	1	2.254e-07	82115	family	            Rhizobiaceae
0.0001612	1	0	2	1	5.277e-07	227292	no rank	              Sinorhizobium/Ensifer group
0.0001612	1	0	2	1	6.948e-07	28105	genus	                Sinorhizobium
0.0001612	1	1	2	1	2.433e-06	382	species	                  Sinorhizobium meliloti
0.0001612	1	1	2	1	2.89e-06	335928	family	            Xanthobacteraceae
0.0001612	1	0	1	1	2.362e-06	119042	no rank	            unclassified Rhizobiales
0.0001612	1	0	1	1	3.726e-06	1734920	genus	              Pseudorhodoplanes
0.0001612	1	1	1	1	3.726e-06	1235591	species	                Pseudorhodoplanes sinuspersici
0.0001612	1	0	1	1	1.02e-07	41294	family	            Bradyrhizobiaceae
0.0001612	1	0	1	1	1.659e-07	374	genus	              Bradyrhizobium
0.0001612	1	1	1	1	3.686e-06	335659	species	                Bradyrhizobium sp. S23321
0.1184	734	299	119	43.3	4.896e-07	1783272	no rank	      Terrabacteria group
0.06966	432	426	70	60.2	7.506e-07	1239	phylum	        Firmicutes
0.0008062	5	0	22	1.41	3.354e-07	91061	class	          Bacilli
0.0008062	5	0	17	1.35	9.025e-07	186826	order	            Lactobacillales
0.0004837	3	0	11	1.45	1.783e-06	1300	family	              Streptococcaceae
0.0004837	3	0	11	1.45	2.13e-06	1301	genus	                Streptococcus
0.0001612	1	0	4	1	2.393e-05	28037	species	                  Streptococcus mitis
0.0001612	1	1	4	1	7.833e-05	365659	no rank	                    Streptococcus mitis B6
0.0001612	1	1	2	1	9.108e-06	1311	species	                  Streptococcus agalactiae
0.0001612	1	1	1	2	4.203e-06	1304	species	                  Streptococcus salivarius
0.0001612	1	0	4	1	5.43e-07	33958	family	              Lactobacillaceae
0.0001612	1	0	4	1	5.817e-07	1578	genus	                Lactobacillus
0.0001612	1	1	3	1	3.172e-05	1601	species	                  Lactobacillus agilis
0.0001612	1	0	1	2	4.072e-07	81852	family	              Enterococcaceae
0.0001612	1	0	1	2	5.077e-07	1350	genus	                Enterococcus
0.0001612	1	1	1	2	2.989e-06	1352	species	                  Enterococcus faecium
0.0001612	1	0	20	1.35	8.374e-07	186801	class	          Clostridia
0.0001612	1	0	20	1.35	9.869e-07	186802	order	            Clostridiales
0.0001612	1	0	19	1.37	6.807e-06	186803	family	              Lachnospiraceae
0.0001612	1	0	19	1.37	0.0001273	186928	no rank	                unclassified Lachnospiraceae
0.0001612	1	0	19	1.37	0.0001273	39491	species	                  [Eubacterium] rectale
0.0001612	1	1	19	1.37	0.0001273	515619	no rank	                    [Eubacterium] rectale ATCC 33656
0.0004837	3	0	40	1.25	3.555e-07	201174	phylum	        Actinobacteria
0.0004837	3	0	40	1.25	3.66e-07	1760	class	          Actinobacteria
0.0003225	2	0	31	1.32	1.778e-06	85006	order	            Micrococcales
0.0003225	2	0	31	1.32	5.686e-06	1268	family	              Micrococcaceae
0.0001612	1	0	22	1.09	0.0002045	1269	genus	                Micrococcus
0.0001612	1	1	22	1.09	0.0002045	1270	species	                  Micrococcus luteus
0.0001612	1	0	9	1.89	2.656e-05	32207	genus	                Rothia
0.0001612	1	1	9	1.89	3.979e-05	43675	species	                  Rothia mucilaginosa
0.0001612	1	0	2	1	2.906e-06	1643682	order	            Geodermatophilales
0.0001612	1	0	2	1	2.906e-06	85030	family	              Geodermatophilaceae
0.0001612	1	0	1	1	4.337e-06	1860	genus	                Geodermatophilus
0.0001612	1	0	1	1	4.337e-06	1861	species	                  Geodermatophilus obscurus
0.0001612	1	1	1	1	4.337e-06	526225	no rank	                    Geodermatophilus obscurus DSM 43160
0.0001612	1	0	13	1.46	2.83e-07	1783270	no rank	      FCB group
0.0001612	1	0	13	1.46	2.874e-07	68336	no rank	        Bacteroidetes/Chlorobi group
0.0001612	1	0	12	1.5	2.779e-07	976	phylum	          Bacteroidetes
0.0001612	1	0	9	1.67	1.181e-06	200643	class	            Bacteroidia
0.0001612	1	0	8	1.75	1.191e-06	171549	order	              Bacteroidales
0.0001612	1	0	8	1.75	6.025e-06	171552	family	                Prevotellaceae
0.0001612	1	0	8	1.75	6.025e-06	838	genus	                  Prevotella
0.0001612	1	1	8	1.75	3.294e-05	28131	species	                    Prevotella intermedia
