#File	1-SAT_S1_mixed_with_10%_10-KPN_S9_R1.fastq.gz
#Total	1463824
#Matched	1123470	76.74898%
#Name	Reads	ReadsPct
NZ_CP011394.1 Salmonella enterica subsp. enterica serovar Enteritidis str. 18569, complete genome	562418	38.42115%
NC_003198.1 Salmonella enterica subsp. enterica serovar Typhi str. CT18, complete genome	560569	38.29484%
NC_003384.1 Salmonella enterica subsp. enterica serovar Typhi str. CT18 plasmid pHCM1, complete sequence	325	0.02220%
NC_002946.2 Neisseria gonorrhoeae FA 1090 chromosome, complete genome	158	0.01079%
