name	taxID	taxRank	genomeSize	numReads	numUniqueReads	abundance
Shewanella	22	genus	5140018	2	0	0.0
Pseudomonas fragi	296	species	10253943	1	0	9.99701e-165
Ralstonia solanacearum	305	species	5757294	1	1	0.0
Pseudomonas syringae	317	species	9277206	1	0	0.0
Ralstonia pickettii	329	species	5505543	1	0	0.0
Xanthomonas oryzae	347	species	38998012	1	0	0.0
Sinorhizobium meliloti	382	species	7082772	3	0	0.0
Acetobacteraceae	433	family	3826783	1	0	0.0
Moraxellaceae	468	family	3802099	368	0	0.0
Acinetobacter	469	genus	4001637	164	0	0.0
Acinetobacter baumannii	470	species	3995919	7	0	0.0
Moraxella catarrhalis	480	species	1863286	2	0	7.43338e-180
Neisseriaceae	481	family	2245252	369	0	0.0
Neisseria	482	genus	2223194	403	16	0.0
Neisseria cinerea	483	species	1832904	132	0	2.51665e-124
Neisseria gonorrhoeae	485	species	2209297	711757	434208	0.232742
Neisseria lactamica	486	species	2220606	2040	91	7.22088e-06
Neisseria meningitidis	487	species	2222288	14279	938	7.68676e-05
Neisseria mucosa	488	species	2688408	61	3	1.96598e-143
Neisseria polysaccharea	489	species	2024930	1397	93	1.88677e-06
Neisseria sicca	490	species	2783943	53	7	2.58831e-145
Neisseria elongata	495	species	2253031	45	2	2.77311e-138
Eikenella corrodens	539	species	2192577	47	0	1.02359e-149
Enterobacteriaceae	543	family	8974696	365	0	0.0
Citrobacter	544	genus	5356580	7	1	0.0
Citrobacter koseri	545	species	4735357	1	0	3.70912e-77
Citrobacter freundii	546	species	5371331	28	3	9.78477e-46
Enterobacter	547	genus	8075228	6	0	0.0
Klebsiella aerogenes	548	species	5435727	15	2	5.09277e-55
Enterobacter cloacae	550	species	5160721	17	2	0
Escherichia	561	genus	7248177	1	0	0.0
Escherichia coli	562	species	7295430	235	47	0.00109341
Hafnia alvei	569	species	4712721	1	0	8.80216e-148
Klebsiella	570	genus	10431961	26	0	0.0
Klebsiella oxytoca	571	species	6684898	101	3	4.84221e-06
Klebsiella pneumoniae	573	species	12022929	5350	4637	0.0588498
Klebsiella pneumoniae subsp. ozaenae	574	subspecies	5651305	3	0	1.91826e-63
Raoultella planticola	575	species	5823931	5	1	5.65075e-89
Morganella	581	genus	3799539	5	0	0.0
Morganella morganii	582	species	3799539	4	0	1.02103e-134
Proteus	583	genus	3973324	339	0	0.0
Proteus mirabilis	584	species	3973324	2	0	5.48362e-37
Providencia rettgeri	587	species	13861830	1	0	5.14237e-168
Serratia	613	genus	5337459	7	0	0.0
Serratia marcescens	615	species	5201904	7	0	1.51863e-87
Yersinia	629	genus	5888768	4	0	0.0
Vibrionaceae	641	family	5361384	369	0	0.0
Aeromonas	642	genus	4922242	1	0	0.0
Vibrio	662	genus	5428754	79	0	0.0
Vibrio cholerae	666	species	4899596	4	0	0.0
Pasteurellaceae	712	family	2311789	368	0	0.0
Haemophilus	724	genus	1907846	335	0	0.0
Haemophilus haemolyticus	726	species	7646594	17	0	4.68271e-179
Haemophilus influenzae	727	species	1910832	60	4	1.8408e-134
Haemophilus parainfluenzae	729	species	2086875	8	0	4.95662e-139
Rhodospirillum	1081	genus	4371641	1	0	0.0
Gammaproteobacteria	1236	class	7010314	247	0	0.0
Firmicutes	1239	phylum	3844509	239	0	0.0
Staphylococcus	1279	genus	4881238	2	0	0.0
Staphylococcus aureus	1280	species	5646514	1	0	0.0
Staphylococcus haemolyticus	1283	species	2697861	4	0	5.65591e-20
Streptococcus	1301	genus	2223762	223	0	0.0
Streptococcus agalactiae	1311	species	2111259	18	1	0.0
Streptococcus pneumoniae	1313	species	2114217	216	108	1.20262e-17
Streptococcus pyogenes	1314	species	1944914	46	4	0.0
Streptococcus anginosus	1328	species	2089210	31	0	0.0
Enterococcus	1350	genus	3026330	1	0	0.0
Enterococcus faecium	1352	species	2979896	34	31	0.0
Bacillales	1385	order	4938247	396	0	0.0
Bacillus subtilis	1423	species	8099068	7	5	0.0
Clostridioides difficile	1496	species	5577066	91	89	1.306e-05
Lactobacillus agilis	1601	species	2187209	1	1	0.0
Corynebacterium diphtheriae	1717	species	2464936	1	0	0.0
Actinobacteria	1760	class	4813989	2	0	0.0
Mycolicibacterium smegmatis	1772	species	14041927	2	2	0.0
Streptomyces actuosus	1885	species	8145579	1	1	0.0
Mycoplasmatales	2085	order	986199	16	0	0.0
Mycoplasmataceae	2092	family	986199	12	0	0.0
Mycoplasma hominis	2098	species	690305	230	0	1.11532e-16
Homo sapiens	9606	species	3257319537	48	24	6.1955e-08
Azoarcus	12960	genus	0	1	0	0.0
Streptococcus mitis	28037	species	2146611	79	0	0
Cronobacter sakazakii	28141	species	4439412	2	0	8.60524e-15
Neisseria subflava	28449	species	2321871	27	5	3.98243e-140
Burkholderia pseudomallei	28450	species	7741335	1	1	0.0
Euryarchaeota	28890	phylum	2854526	1	0	0.0
Salmonella enterica	28901	species	10337520	45	19	0.629496
Mollicutes	31969	class	1031504	223	0	0.0
Clostridiaceae	31979	family	4483183	68	0	0.0
Burkholderia	32008	genus	8293702	1	0	0.0
Parvimonas micra	33033	species	3288872	238	0	3.2523e-06
Lactobacillus johnsonii	33959	species	1907846	1	0	0
Citrobacter amalonaticus	35703	species	5875351	1	0	8.15227e-86
Sphingomonadaceae	41297	family	4153184	1	0	0.0
Polynucleobacter	44013	genus	1859979	1	0	0.0
Pantoea	53335	genus	4926392	7	0	0.0
Raoultella ornithinolytica	54291	species	5398151	8	1	1.21056e-92
Salmonella enterica subsp. houtenae serovar Houten	58100	leaf	4624613	1	0	1.31392e-119
Salmonella enterica subsp. enterica	59201	subspecies	142069846	8	0	3.19254e-06
Enterobacter asburiae	61645	species	4787018	3	0	2.12685e-05
Citrobacter werkmanii	67827	species	15089488	2	1	5.32193e-07
Moritella yayanosii	69539	species	4433651	1	0	0.0
Caulobacter mirabilis	69666	species	4577265	1	0	0.0
Klebsiella pneumoniae subsp. pneumoniae	72407	subspecies	172715673	59	16	3.90882e-06
Dechloromonas	73029	genus	4501104	1	0	0.0
Pseudomonas mosselii	78327	species	6247860	1	1	0.0
Burkholderiales	80840	order	6713841	2	0	0.0
Moritella viscosa	80854	species	5093989	1	0	0.0
Comamonadaceae	80864	family	5402391	1	0	0.0
Obesumbacterium	82982	genus	0	1	0	0.0
Obesumbacterium proteus	82983	species	5011796	1	0	0.0
gamma proteobacterium HdN1	83406	species	4587455	1	0	3.13747e-218
Propionibacteriales	85009	order	3144263	1	0	0.0
Neisseria elongata subsp. glycolytica	88719	subspecies	2249415	13	0	2.26701e-140
Salmonella enterica subsp. enterica serovar Typhi	90370	leaf	505801019	3	0	6.96415e-06
Salmonella enterica subsp. enterica serovar Typhimurium	90371	leaf	150109640	39	0	8.02755e-06
Staphylococcaceae	90964	family	4837607	34	0	0.0
Bacilli	91061	class	3878588	36	0	0.0
Enterobacterales	91347	order	8015187	397	0	0.0
Ramlibacter tataouinensis	94132	species	4070193	1	0	0.0
Salmonella enterica subsp. enterica serovar Dublin	98360	leaf	35415966	3	0	2.97448e-07
Ralstonia mannitolilytica	105219	species	9915295	4	2	2.02048e-05
Salmonella enterica subsp. enterica serovar Newport	108619	leaf	24036368	3	0	1.05767e-06
Burkholderiaceae	119060	family	7900732	1	0	0.0
Neisseria meningitidis MC58	122586	leaf	2272360	55	1	2.93907e-141
Neisseria meningitidis Z2491	122587	leaf	2184406	89	6	3.17555e-91
Erysipelotrichaceae	128827	family	1770425	345	0	0.0
Pseudomonas amygdali pv. morsprunorum	129138	leaf	6445963	1	0	0.0
Pseudomonadaceae	135621	family	6675755	1	0	0.0
Vibrionales	135623	order	5361384	2	0	0.0
Salmonella enterica subsp. enterica serovar Enteritidis	149539	leaf	208834451	10	2	1.67136e-06
Enterobacter hormaechei	158836	species	11512864	6	0	5.87661e-18
Escherichia coli O127:H6	168807	leaf	9641111	3	0	6.2074e-84
Clostridia	186801	class	3819022	1	0	0.0
Clostridiales	186802	order	4169569	406	0	0.0
Lachnospiraceae	186803	family	3982220	2	0	0.0
Peptostreptococcaceae	186804	family	4343449	59	0	0.0
Bacillaceae	186817	family	5737603	22	0	0.0
Lactobacillales	186826	order	2681416	442	0	0.0
Ralstonia insidiosa	190721	species	12164766	2	0	7.9168e-66
Haemophilus aegyptius	197575	species	1993258	2	0	3.98548e-138
Dickeya dadantii 3937	198628	leaf	4922802	1	1	0.0
Fusobacteriia	203490	class	2917471	23	0	0.0
Fusobacteriaceae	203492	family	2924149	1	0	0.0
Sphingomonadales	204457	order	4098145	1	0	0.0
Neisseriales	206351	order	2372285	2	0	0.0
Rhodocyclales	206389	order	4186782	1	0	0.0
Enterobacter kobei	208224	species	10094268	18	0	6.42303e-81
Streptococcus agalactiae 2603V/R	208435	leaf	2160267	46	46	0.0
Escherichia albertii	208962	species	4701875	9	0	9.75947e-06
Neisseria gonorrhoeae FA 1090	242231	leaf	2153922	29436	3276	0.000774446
Klebsiella variicola	244366	species	5458505	127	0	3.31353e-06
Haemophilus pittmaniae	249188	species	2181355	16	0	5.08882e-140
Aeromonas virus 65	260149	species	235229	2	2	0.0
Haemophilus influenzae R2846	262727	leaf	1819370	2	0	0.0
Pseudomonas savastanoi pv. phaseolicola 1448A	264730	leaf	6112448	1	0	0.0
Klebsiella pneumoniae subsp. pneumoniae MGH 78578	272620	leaf	5694894	4	2	8.72805e-63
Neisseria meningitidis FAM18	272831	leaf	2194961	44	0	3.75576e-135
Enterobacter hormaechei subsp. oharae	301102	subspecies	14941448	1	0	1.18676e-119
Yangia pacifica	311180	species	5165968	1	1	0.0
Salmonella enterica subsp. enterica serovar Choleraesuis str. SC-B67	321314	leaf	4944000	1	1	8.8469e-07
Xanthomonas vasicola pv. vasculorum	325776	leaf	4909766	1	0	0.0
Neisseria zoodegmatis	326523	species	2552522	2	0	2.37423e-146
Ramlibacter tataouinensis TTB310	365046	leaf	4070193	1	0	0.0
Neisseria meningitidis 053442	374833	leaf	2153416	339	11	1.24199e-06
Ralstonia pickettii 12J	402626	leaf	5325729	18	14	0.000177607
Cronobacter	413496	genus	4479995	1	0	0.0
Methylobacterium sp. 4-46	426117	species	7737025	1	1	0.0
Ralstonia pickettii 12D	428406	leaf	5685358	15	11	5.91596e-05
Phytobacter	447792	genus	0	5	0	0.0
Actinoplanes teichomyceticus ATCC 31121	457423	leaf	8287152	1	1	0.0
Erwinia tasmaniensis Et1/99	465817	leaf	4067864	1	0	0.0
Steroidobacter	469322	genus	0	1	0	0.0
Neisseria lactamica 020-06	489653	leaf	2220606	1131	42	5.70673e-35
Klebsiella pneumoniae 342	507522	leaf	5920257	5	1	0.0
Streptococcus pneumoniae G54	512566	leaf	2078953	4	0	0.0
Streptococcus pneumoniae CGSP14	516950	leaf	2209198	65	61	0.00010072
Neisseria gonorrhoeae NCCP11945	521006	leaf	2236178	35951	2987	0.00100418
Erysipelotrichales	526525	order	1770425	26	0	0.0
Neisseria gonorrhoeae MS11	528354	leaf	2237793	81765	14419	0.014748
Variovorax paradoxus S110	543728	leaf	6754997	1	0	0.0
Neisseria elongata subsp. glycolytica ATCC 29315	546263	leaf	2256647	13	0	1.80116e-140
Streptococcus suis BM407	568814	leaf	2170808	4	0	0.0
Escherichia coli O127:H6 str. E2348/69	574521	leaf	5069678	2	0	3.51127e-74
Escherichia coli LF82	591946	leaf	4773108	1	1	5.94513e-06
Neisseria meningitidis 8013	604162	leaf	2277550	169	12	2.14312e-83
Neisseria meningitidis alpha710	630588	leaf	2242947	278	2	1.39361e-95
Citrobacter rodentium ICC168	637910	leaf	5444283	1	1	0.0
Klebsiella variicola At-22	640131	leaf	5458505	3	0	1.49363e-06
Simonsiella muelleri ATCC 29453	641147	leaf	2469862	69	68	0.0
Neisseria sp. KEM232	655307	species	2371912	3	0	3.99413e-143
Neisseria meningitidis alpha14	662598	leaf	2145295	329	9	4.99958e-07
Mixta calida	665913	species	4308453	1	0	1.16486e-149
Mixta gaviniae	665914	species	4527605	1	0	0.0
Rothia mucilaginosa DY-18	680646	leaf	2264603	1	1	0.0
Phaeobacter sp. LSS9	681157	species	4038237	1	0	0.0
Pseudomonas savastanoi pv. savastanoi NCPPB 3335	693985	leaf	6016828	1	0	0.0
[Enterobacter] lignolyticus SCF1	701347	leaf	4814049	1	1	8.4883e-127
Sinorhizobium meliloti SM11	707241	leaf	7173736	1	0	0.0
Thioalkalivibrio paradoxus ARh 1	713585	leaf	3756729	1	1	0.0
Pseudomonas fulva 12-X	743720	leaf	4920769	1	0	0.0
Pseudogulbenkiania sp. NH8B	748280	species	4332995	1	0	0.0
Thiocystis violascens DSM 198	765911	leaf	5017071	1	0	0.0
Streptococcus anginosus C238	862971	leaf	2233640	31	0	0.0
Neisseria meningitidis H44/76	909420	leaf	2240883	38	0	9.16841e-140
Negativicutes	909932	class	2939259	1	0	0.0
Klebsiella aerogenes EA1509E	935296	leaf	5591105	5	0	4.99313e-60
Neisseria meningitidis M01-240355	935588	leaf	2287777	218	10	7.01163e-07
Neisseria meningitidis NZ-05/33	935589	leaf	2248966	112	0	2.51668e-66
Neisseria meningitidis M0579	935590	leaf	2324822	239	23	1.15117e-06
Neisseria meningitidis M01-240149	935591	leaf	2223518	108	2	1.12361e-73
Neisseria meningitidis M04-240196	935593	leaf	2250449	226	5	7.08794e-104
Neisseria meningitidis G2136	935599	leaf	2184862	93	2	1.78798e-136
Haemophilus influenzae F3047	935897	leaf	2007018	3	1	2.4348e-138
Neisseria meningitidis WUE 2594	942513	leaf	2227255	255	29	2.67935e-44
Salmonella enterica subsp. enterica serovar Pullorum str. ATCC 9120	1029979	leaf	4781492	1	0	3.9342e-18
Klebsiella pneumoniae KCTC 2242	1049565	leaf	5462423	3	0	6.74208e-06
Sulfuritalea	1054211	genus	3802648	1	0	0.0
Streptococcus pseudopneumoniae IS7493	1054460	leaf	2195458	27	2	2.4957e-17
Streptococcus oralis subsp. tigurinus	1077464	subspecies	1889005	81	0	0.000159053
Neisseria meningitidis M7124	1095685	leaf	2179483	1	1	0.0
Klebsiella pneumoniae subsp. pneumoniae Kp13	1123862	leaf	5739888	2	1	9.44707e-07
Klebsiella pneumoniae subsp. pneumoniae HS11286	1125630	leaf	5682322	5	4	0.0
Klebsiella michiganensis	1134687	species	6150064	22	0	1.05238e-47
Blastococcus saxobsidens DD2	1146883	leaf	4875340	1	1	0.0
Kosakonia radicincitans DSM 16656	1177180	leaf	6122453	1	1	2.27045e-135
Klebsiella pneumoniae subsp. pneumoniae 1084	1193292	leaf	5386705	19	16	8.76793e-06
Haemophilus influenzae 2019	1232659	leaf	1969659	1	0	1.95999e-138
Klebsiella pneumoniae CG43	1244085	leaf	5166857	2	1	6.93403e-61
Burkholderia thailandensis H0587	1249663	leaf	6768375	1	1	0.0
Klebsiella pneumoniae UHKPC33	1284802	leaf	5663117	1	0	0.0
Haemophilus influenzae CGSHiCZ412602	1295140	leaf	1811802	2	0	0.0
Klebsiella pneumoniae 500_1420	1304922	leaf	5547643	1	1	0.0
Salinivirga cyanobacteriivorans	1307839	species	4812386	1	1	0.0
Escherichia coli ACN001	1311757	leaf	4936576	2	1	9.50126e-109
Klebsiella pneumoniae subsp. pneumoniae KPNIH27	1328324	leaf	6132443	4	3	9.71682e-07
Citrobacter freundii CFNIH1	1333848	leaf	5371331	5	0	3.86643e-39
[Enterobacter] lignolyticus	1334193	species	4814049	1	0	1.77007e-127
Enterobacter cloacae P101	1354030	leaf	5369929	1	0	0.0
Klebsiella pneumoniae KP-1	1365186	leaf	5375667	3	2	1.4138e-06
Klebsiella pneumoniae JM45	1380908	leaf	5603174	2	2	2.80753e-06
Neisseria meningitidis LNP21362	1386087	leaf	2139957	34	0	4.24667e-139
Klebsiella pneumoniae HK787	1392500	leaf	5329385	1	0	8.69895e-62
Sinorhizobium meliloti RU11/001	1401243	leaf	7692912	1	0	0.0
Candidatus Walczuchella monophlebidarum	1415657	species	309299	1	1	0.0
Klebsiella pneumoniae 30660/NJST258_1	1420012	leaf	5540936	1	1	0.0
Enterobacter asburiae L1	1421338	leaf	4561905	1	0	0.0
Escherichia albertii KF1	1440052	leaf	4701875	3	1	4.76439e-06
Escherichia coli str. Sanji	1441627	leaf	5428586	1	0	8.94654e-125
Yersinia enterocolitica LC20	1443113	leaf	4850874	1	0	0.0
Escherichia coli O6:H16	1446746	leaf	15266711	2	0	3.05702e-75
Klebsiella quasipneumoniae subsp. similipneumoniae	1463164	subspecies	5514898	1	0	3.61459e-59
Klebsiella quasipneumoniae	1463165	species	5528721	67	1	1.90014e-37
Citrobacter pasteurii	1563222	species	4654874	1	0	1.49046e-80
Peptoniphilaceae	1570339	family	1992686	418	0	0.0
Phaeobacter piscinae	1580596	species	29607336	1	0	0.0
Candidatus Filomicrobium marinum	1608628	species	7939883	16	0	0.0
Pararhodospirillum	1612157	genus	3876289	1	0	0.0
Aeromonas sp. ASNIH2	1636607	species	4864532	1	1	0.0
Aeromonas sp. ASNIH4	1636609	species	5480196	1	0	0.0
Klebsiella quasipneumoniae subsp. quasipneumoniae	1667327	subspecies	5542544	3	0	6.30815e-61
Enterobacter sp. FY-07	1692238	species	5138701	2	2	2.08182e-05
Citrobacter sp. FDAARGOS_156	1702170	species	4727498	1	0	1.79554e-79
Citrobacter sp. CRE-46	1703250	species	6081860	2	0	1.39908e-87
Tissierellales	1737405	order	2364540	35	0	0.0
Streptomyces sp. 4F	1751294	species	8047771	1	1	0.0
Rhodoferax koreense	1842727	species	5895641	1	1	0.0
Neisseria sp. 10022	1853276	species	2511904	5	2	2.99074e-145
Neisseria sp. 10023	1853278	species	2496444	1	1	0.0
Amycolatopsis sp. AA4	1896961	species	9172799	1	1	0.0
Klebsiella sp. LTGPAF-6F	1905288	species	6790399	2	0	5.93408e-68
Enterobacteriaceae bacterium ENNIH2	1920109	species	6262406	3	0	1.73885e-18
Citrobacter sp. CFNIH10	1920110	species	5738233	4	0	3.49649e-74
Leclercia sp. LSNIH1	1920114	species	5411940	2	1	1.74161e-128
Enterobacteriaceae bacterium ENNIH3	1920128	species	6079128	3	0	1.23461e-06
Sedimentisphaera cyanobacteriorum	1940790	species	2951611	1	0	0.0
Sedimentisphaera salicampi	1941349	species	3192293	1	0	0.0
Phytobacter ursingii	1972431	species	6166452	2	1	5.25176e-05
Citrobacter sp. 86	2013114	species	5048670	1	0	4.70044e-82
Shewanella bicestrii	2018305	species	5004414	2	0	1.69526e-165
Citrobacter sp. 92	2019568	species	5109913	1	0	2.02793e-82
Klebsiella quasivariicola	2026240	species	5946706	59	1	1.36179e-34
Providencia sp. WCHPr000369	2027290	species	4799915	1	0	0.0
Enterobacter cloacae complex sp.	2027919	species	10167193	9	0	4.36199e-21
Gemella sp. ND 6198	2040624	species	1797925	238	0	0
Escherichia coli O128:H27	2048776	leaf	5130625	1	1	8.64856e-72
Enterobacter sp. CRENT-193	2051905	species	5196641	1	0	1.5798e-81
Enterobacteriaceae bacterium S05	2052938	species	5157054	19	0	1.19035e-81
Planococcus sp. MB-3u-03	2058136	species	3614431	1	1	0.0
Chromobacterium sp. ATCC 53434	2059672	species	5138981	1	0	0.0
Gordonia sp. YC-JH1	2059875	species	4193324	1	1	0.0
Citrobacter freundii complex sp. CFNIH2	2066049	species	5340584	1	0	2.25443e-83
Enterobacteriaceae bacterium ENNIH1	2066051	species	5666332	1	0	0.0
Enterobacter cloacae complex sp. FDA-CDC-AR_0164	2077136	species	4849791	1	0	0.0
Citrobacter freundii complex sp. CFNIH3	2077147	species	5634842	3	0	5.29208e-83
Citrobacter freundii complex sp. CFNIH4	2077148	species	5629494	1	0	1.18626e-85
Citrobacter freundii complex sp. CFNIH9	2077149	species	5688355	2	0	8.40384e-86
Clostridiaceae bacterium 14S0207	2082193	species	3151275	2	0	7.30019e-19
Mixta	2100764	genus	0	1	0	0.0
Plantactinospora sp. BC1	2108470	species	8333965	1	1	0.0
Luteimonas sp. 83-4	2172536	species	2592821	1	1	0.0
Enterobacteriaceae bacterium w17	2282309	species	5125645	1	1	9.17909e-114
