name	taxID	taxRank	genomeSize	numReads	numUniqueReads	abundance
Bacteria	2	superkingdom	0	1	1	0.0
Buchnera aphidicola	9	species	599772	2	2	0.0
Shewanella	22	genus	5140018	288	1	0.0
Shewanella putrefaciens	24	species	4749735	9	0	0.0
Cystobacter fuscus	43	species	12349744	1	0	0.0
Archangium gephyra	48	species	12489432	1	1	0.0
Chondromyces crocatus	52	species	11388132	1	1	0.0
Vitreoscilla filiformis	63	species	3787551	2	2	0.0
Gemmata	113	genus	0	1	0	0.0
Planctomyces	118	genus	0	1	0	0.0
Spirochaetales	136	order	1881166	1	0	0.0
Leptospira	171	genus	4873231	1	0	0.0
Helicobacter	209	genus	1718496	1	0	0.0
Elizabethkingia meningoseptica	238	species	15625789	1	1	0.0
Comamonas	283	genus	5695231	67	0	0.0
Pseudomonas	286	genus	6735709	146	0	0.0
Pseudomonas aeruginosa	287	species	6508174	4	1	1.99217e-50
Burkholderia cepacia	292	species	10707163	4	0	0.0
Pseudomonas fluorescens	294	species	6526868	10	0	0.0
Pseudomonas fragi	296	species	10253943	9	0	0
Hydrogenophilus thermoluteolus	297	species	2288780	2	2	0.0
Ralstonia solanacearum	305	species	5757294	6	0	0.0
Pseudomonas syringae	317	species	9277206	2	0	0.0
Pseudomonas syringae pv. syringae	321	leaf	17996541	3	0	0.0
Pseudomonas syringae pv. tomato	323	leaf	6523367	1	0	0.0
Ralstonia pickettii	329	species	5505543	11	2	0.0
Xanthomonas campestris pv. campestris	340	leaf	19971072	2	0	0.0
Azotobacter chroococcum	353	species	5192286	2	0	0.0
Azotobacter vinelandii	354	species	5351632	1	0	0.0
Rhizobium leguminosarum	384	species	9732818	1	0	0.0
Rhizobium phaseoli	396	species	6665454	4	2	0.0
Methylobacillus	404	genus	2971517	1	0	0.0
Methylobacillus flagellatus	405	species	2971517	1	0	0.0
Methylomonas	416	genus	5051681	1	0	0.0
Acetobacter aceti	435	species	3725037	1	1	0.0
Moraxellaceae	468	family	3802099	2	0	0.0
Acinetobacter	469	genus	4001637	54	0	0.0
Acinetobacter baumannii	470	species	3995919	75	1	0.0
Moraxella	475	genus	1863286	1	0	0.0
Moraxella bovis	476	species	2911207	1	0	0.0
Neisseriaceae	481	family	2245252	359	0	0.0
Neisseria	482	genus	2223194	81	0	0.0
Neisseria gonorrhoeae	485	species	2209297	8	3	0.10504
Neisseria lactamica	486	species	2220606	2	0	3.5887e-06
Neisseria polysaccharea	489	species	2024930	1	1	7.76076e-07
Psychrobacter	497	genus	2875899	2	0	0.0
Alcaligenaceae	506	family	4001103	1	0	0.0
Ochrobactrum anthropi	529	species	5205777	1	0	0.0
Enterobacteriaceae	543	family	8974696	872	28	0.0
Citrobacter	544	genus	5356580	307	44	0.0
Citrobacter koseri	545	species	4735357	234	4	2.95535e-215
Citrobacter freundii	546	species	5371331	436	23	1.67029e-98
Enterobacter	547	genus	8075228	264	7	0.0
Klebsiella aerogenes	548	species	5435727	106	17	2.298e-144
Pantoea agglomerans	549	species	10099709	6	4	0.0
Enterobacter cloacae	550	species	5160721	520	57	0
Erwinia	551	genus	4250482	9	0	0.0
Erwinia amylovora	552	species	3869718	13	0	0.0
Pantoea ananatis	553	species	4838981	6	2	0.0
Pectobacterium carotovorum	554	species	8172380	12	1	0.0
Escherichia	561	genus	7248177	205	0	0.0
Escherichia coli	562	species	7295430	9979	575	0.00113595
Shimwellia blattae	563	species	4158725	2	0	0.0
Escherichia fergusonii	564	species	4643861	1	0	0.0
Hafnia	568	genus	4712721	19	0	0.0
Hafnia alvei	569	species	4712721	8	0	0
Klebsiella	570	genus	10431961	662	1	0.0
Klebsiella oxytoca	571	species	6684898	1606	32	6.52563e-06
Klebsiella pneumoniae	573	species	12022929	93235	75103	0.0787054
Klebsiella pneumoniae subsp. ozaenae	574	subspecies	5651305	26	0	6.26423e-167
Raoultella planticola	575	species	5823931	126	2	1.63108e-254
Morganella	581	genus	3799539	243	0	0.0
Morganella morganii	582	species	3799539	168	0	0
Proteus	583	genus	3973324	131	0	0.0
Proteus mirabilis	584	species	3973324	234	4	1.47966e-71
Proteus vulgaris	585	species	3961988	10	0	0.0
Providencia	586	genus	4402109	44	0	0.0
Providencia rettgeri	587	species	13861830	15	1	0
Providencia stuartii	588	species	4402109	9	2	0.0
Salmonella	590	genus	10241433	127	0	0.0
Salmonella enterica subsp. enterica serovar Infantis	595	leaf	34245189	476	180	1.21238e-06
Salmonella enterica subsp. enterica serovar Thompson	600	leaf	23736161	360	123	1.95626e-07
Salmonella enterica subsp. enterica serovar Pullorum	605	leaf	4882929	123	9	7.26892e-06
Salmonella enterica subsp. enterica serovar Heidelberg	611	leaf	97441747	231	1	0
Serratia	613	genus	5337459	210	2	0.0
Serratia liquefaciens	614	species	5282719	6	0	0.0
Serratia marcescens	615	species	5201904	101	5	2.94589e-237
Shigella	620	genus	4694865	6	0	0.0
Shigella dysenteriae	622	species	4560911	10	0	0
Shigella flexneri	623	species	4828820	27	0	0.0
Xenorhabdus nematophila	628	species	4586662	3	0	0.0
Yersinia	629	genus	5888768	23	2	0.0
Yersinia enterocolitica	630	species	4744476	6	0	0
Yersinia intermedia	631	species	9820399	3	1	0.0
Yersinia pestis	632	species	5868073	1	0	1.79784e-133
Yersinia pseudotuberculosis	633	species	7671089	1	0	0.0
Edwardsiella	635	genus	3906392	16	0	0.0
Edwardsiella tarda	636	species	3766483	13	0	0.0
Vibrionaceae	641	family	5361384	367	0	0.0
Aeromonas	642	genus	4922242	44	0	0.0
Aeromonas hydrophila	644	species	4976268	2	2	0.0
Aeromonas schubertii	652	species	4400034	2	0	0.0
Aeromonas veronii	654	species	4551783	3	1	0.0
Photobacterium	657	genus	5287613	28	0	0.0
Vibrio	662	genus	5428754	77	3	0.0
Vibrio alginolyticus	663	species	5146637	1	0	0.0
Vibrio cholerae	666	species	4899596	1	1	0.0
Vibrio parahaemolyticus	670	species	5172800	2	1	0.0
Vibrio vulnificus	672	species	5071151	6	1	0.0
Vibrio mimicus	674	species	8922712	5	1	0
Vibrio fluvialis	676	species	14546945	7	0	0.0
Vibrio mediterranei	689	species	5812176	1	1	0.0
Vibrio natriegens	691	species	10343839	2	0	0.0
Plesiomonas	702	genus	0	2	0	0.0
Plesiomonas shigelloides	703	species	7376338	5	0	0.0
Pasteurellaceae	712	family	2311789	499	0	0.0
Actinobacillus	713	genus	2346381	2	0	0.0
Aggregatibacter actinomycetemcomitans	714	species	2207232	1	0	0.0
Haemophilus	724	genus	1907846	1	0	0.0
[Haemophilus] ducreyi	730	species	1698955	2	2	0.0
Histophilus somni	731	species	2138367	1	1	0.0
Aggregatibacter aphrophilus	732	species	4626291	2	1	0.0
Glaesserella parasuis	738	species	2310879	4	0	0.0
Prevotella	838	genus	3023914	1	0	0.0
Wolinella succinogenes	844	species	2110355	1	0	0.0
Rhodobacter sphaeroides	1063	species	4596850	2	0	0.0
Prosthecochloris aestuarii	1102	species	2579695	1	0	0.0
Chloroflexus aurantiacus	1108	species	5263745	1	0	0.0
Oscillatoriales	1150	order	7831139	1	0	0.0
Gammaproteobacteria	1236	class	7010314	42	1	0.0
Piscirickettsia salmonis	1238	species	3507509	1	0	0.0
Staphylococcus aureus	1280	species	5646514	3	0	0.0
Streptococcus salivarius	1304	species	2213879	1	0	1.84501e-13
Enterococcus gallinarum	1353	species	3821476	1	0	0.0
Lactococcus lactis subsp. lactis	1360	subspecies	35794971	1	1	0.0
Bacillales	1385	order	4938247	2	0	0.0
Bacillus anthracis	1392	species	5891714	1	0	0.0
Bacillus cereus	1396	species	6207801	1	1	0.0
Bacillus thuringiensis	1428	species	6489886	1	0	0.0
Corynebacterium	1716	genus	2724394	1	0	0.0
Corynebacterium diphtheriae	1717	species	2464936	1	0	0.0
Acidipropionibacterium acidipropionici	1748	species	3656170	3	0	0.0
Mycobacterium avium	1764	species	13457953	1	0	0.0
Mycobacterium tuberculosis	1773	species	5425114	1	1	0.0
Mycolicibacterium thermoresistibile	1797	species	4950685	1	1	0.0
Streptomyces actuosus	1885	species	8145579	1	1	0.0
Streptomyces albus	1888	species	6841649	1	1	0.0
Streptomyces reticuli	1926	species	9336224	5	5	0.0
Nocardiopsis dassonvillei	2014	species	6543312	2	0	0.0
Tsukamurella	2060	genus	4479724	1	0	0.0
Mycoplasmatales	2085	order	986199	1	0	0.0
Mycoplasma gallisepticum	2096	species	969960	1	0	0.0
Mycoplasma genitalium	2097	species	579782	1	0	0.0
Mycoplasma pneumoniae	2104	species	866945	1	0	0.0
Saccharolobus solfataricus	2287	species	2830609	1	1	0.0
Candidatus Sodalis pierantonius str. SOPE	2342	leaf	4513140	28	2	0.0
Homo sapiens	9606	species	3257319537	20	15	8.66891e-08
Myoviridae	10662	family	137496	16	0	0.0
Escherichia virus P2	10679	species	33593	7	0	9.12404e-215
Siphoviridae	10699	family	52152	2	0	0.0
Sphingomonas	13687	genus	5816412	1	1	0.0
Burkholderia gladioli	28095	species	17543424	2	0	0.0
Alteromonas macleodii	28108	species	4602757	1	1	0.0
Prevotella intermedia	28131	species	2686803	2	0	0.0
Cronobacter sakazakii	28141	species	4439412	129	2	2.52535e-14
Salmonella enterica subsp. enterica serovar Derby	28144	leaf	9935604	3605	99	0.000554772
Salmonella enterica subsp. enterica serovar Oranienburg	28147	leaf	4651134	55	1	1.24448e-37
Salmonella enterica subsp. enterica serovar Senftenberg	28150	leaf	20218480	433	124	3.10652e-06
Yersinia kristensenii	28152	species	4496569	2	1	0.0
Vibrio nigripulchritudo	28173	species	6322155	1	1	0.0
Alphaproteobacteria	28211	class	3938269	1	0	0.0
Betaproteobacteria	28216	class	5503525	1	0	0.0
Marinomonas	28253	genus	4292128	1	0	0.0
Burkholderia pseudomallei	28450	species	7741335	1	1	0.0
Salmonella enterica	28901	species	10337520	574196	552002	0.765938
Lactobacillus delbrueckii subsp. lactis	29397	subspecies	8524041	12	0	0.0
Methylorubrum zatmanii	29429	species	5612218	1	0	2.20556e-06
Pectobacterium atrosepticum	29471	species	5064019	4	0	0.0
Yersinia frederiksenii	29484	species	4550894	3	0	0.0
Yersinia rohdei	29485	species	4372253	2	2	0.0
Yersinia ruckeri	29486	species	18859102	3	1	0.0
Brachyspira	29521	genus	2938286	1	0	0.0
Nitrosomonadales	32003	order	3061161	1	0	0.0
Burkholderia gladioli pv. gladioli	32009	leaf	26034550	1	0	0.0
Methylophilaceae	32011	family	2915241	2	0	0.0
Zymobacter palmae	33074	species	3028543	1	0	0.0
Leuconostoc mesenteroides subsp. mesenteroides	33967	subspecies	8181583	1	1	0.0
Rahnella	34037	genus	5656799	1	0	0.0
Rahnella aquatilis	34038	species	5656799	6	0	0.0
Streptobacillus moniliformis	34105	species	1673280	1	0	0.0
Citrobacter amalonaticus	35703	species	5875351	86	9	2.26004e-242
Mycobacteroides abscessus	36809	species	5035139	1	1	0.0
Desulfitobacterium	36853	genus	4425788	1	0	0.0
Sinomonas atrocyanea	37927	species	4492204	1	0	0.0
Photobacterium damselae	38293	species	4418880	1	1	0.0
Photobacterium damselae subsp. piscicida	38294	subspecies	4293175	1	1	0.0
Shewanella algae	38313	species	4919337	4	3	0.0
Mesorhizobium ciceri	39645	species	6785241	1	1	0.0
Stenotrophomonas maltophilia	40324	species	4684682	1	0	0.0
Xenorhabdus bovienii	40576	species	4225498	4	1	0.0
Sphingomonadaceae	41297	family	4153184	9	0	0.0
Salmonella enterica subsp. arizonae serovar 62:z4,z23:-	41514	leaf	4600800	113	9	1.17917e-06
Pseudoalteromonas rubra	43658	species	5913780	1	1	0.0
Shewanella benthica	43661	species	4353505	1	1	0.0
Jonesia denitrificans	43674	species	2749646	1	1	0.0
Rothia mucilaginosa	43675	species	2264603	1	1	0.0
Vibrio scophthalmi	45658	species	9728927	1	0	0.0
Staphylococcus aureus subsp. aureus	46170	subspecies	103787154	4	2	0.0
Pseudomonas avellanae	46257	species	6576340	1	0	0.0
Salmonella enterica subsp. enterica serovar Give	46626	leaf	9538123	108	12	6.74672e-59
Borrelia miyamotoi	47466	species	937966	1	1	0.0
Pseudomonas azotoformans	47878	species	13440913	1	0	0.0
Pseudomonas taetrolens	47884	species	4843871	2	0	0.0
Serratia fonticola	47917	species	18051695	28	15	0.0
Acinetobacter pittii	48296	species	3862530	31	0	0.0
Pantoea	53335	genus	4926392	117	0	0.0
Enterococcus mundtii	53346	species	3351060	1	0	0.0
Raoultella ornithinolytica	54291	species	5398151	169	20	9.45357e-267
Salmonella enterica subsp. enterica serovar Paratyphi A	54388	leaf	13799394	139	2	1.33388e-06
Streptomyces venezuelae	54571	species	26469547	1	0	0.0
Salmonella bongori	54736	species	4524275	30	0	0.0
Erwinia persicina	55211	species	5070450	4	0	0.0
Enterobacteria phage SfV	55884	species	37074	536	13	0.0221569
Syntrophus aciditrophicus SB	56780	leaf	3179300	2	1	0.0
Citrobacter braakii	57706	species	10079064	47	4	1.39223e-296
Salmonella enterica subsp. enterica serovar Weltevreden	57743	leaf	20446954	487	39	3.69977e-06
Burkholderia thailandensis	57975	species	7411824	2	1	0.0
Salmonella enterica subsp. houtenae serovar Houten	58100	leaf	4624613	147	27	0
Salmonella enterica subsp. enterica serovar Waycross	58101	leaf	4812886	111	51	2.22428e-05
Salmonella enterica subsp. enterica serovar Anatum	58712	leaf	19533469	101	34	3.01127e-06
Salmonella enterica subsp. enterica	59201	subspecies	142069846	6044	522	1.74931e-06
Salmonella enterica subsp. salamae	59202	subspecies	10002039	216	30	3.10826e-07
Salmonella enterica subsp. diarizonae	59204	subspecies	24824988	397	5	6.23472e-07
Burkholderia vietnamiensis	60552	species	6930496	5	0	0.0
Enterobacter asburiae	61645	species	4787018	1327	828	1.28696e-05
Lelliottia amnigena	61646	species	9085730	34	6	0.0
Pluralibacter gergoviae	61647	species	10897762	68	8	0
Serratia ficaria	61651	species	5209973	5	4	0.0
Serratia rubidaea	61652	species	9918189	5	1	0.0
Azoarcus sp. BH72	62928	species	4376040	1	1	0.0
Acinetobacter sp. ADP1	62977	species	3598621	1	1	0.0
Sodalis glossinidius	63612	species	4292502	2	0	0.0
Acetobacter pomorum	65959	species	6161139	1	1	0.0
Shigella phage SfII	66284	species	41475	159	1	7.23227e-148
Edwardsiella ictaluri	67780	species	3812301	20	6	0
Citrobacter farmeri	67824	species	5715629	39	6	1.07089e-230
Citrobacter rodentium	67825	species	5444283	2	0	0.0
Citrobacter werkmanii	67827	species	15089488	180	41	7.19743e-07
Actinobacillus succinogenes	67854	species	2319663	2	0	0.0
Streptomyces fungicidicus	68203	species	7667496	1	1	0.0
Enterobacter cancerogenus	69218	species	4796512	8	3	0.0
Lelliottia nimipressuralis	69220	species	4826854	27	0	0
Moritella yayanosii	69539	species	4433651	3	0	0.0
Pseudomonas plecoglossicida	70775	species	11758774	1	0	0.0
Salmonella enterica subsp. enterica serovar Minnesota	70803	leaf	5004825	55	4	0
Pseudomonadales	72274	order	6135410	1	0	0.0
Campylobacteraceae	72294	family	2371300	2	0	0.0
Klebsiella pneumoniae subsp. pneumoniae	72407	subspecies	172715673	694	179	5.27747e-06
Paraburkholderia caribensis	75105	species	9482704	1	0	0.0
Prevotella enoeca	76123	species	2861432	1	1	0.0
Roseateles depolymerans	76731	species	5681722	1	0	0.0
Pseudomonas orientalis	76758	species	5986236	1	0	0.0
Pseudomonas monteilii	76759	species	5972603	1	0	0.0
Pseudomonas mosselii	78327	species	6247860	1	1	0.0
Denitrobacterium detoxificans	79604	species	2446250	1	1	0.0
Erwinia pyrifoliae	79967	species	4072846	11	0	0.0
Burkholderiales	80840	order	6713841	19	0	0.0
Moritella viscosa	80854	species	5093989	3	0	0.0
Comamonadaceae	80864	family	5402391	8	0	0.0
Leminorella	82980	genus	0	1	0	0.0
Obesumbacterium	82982	genus	0	1	0	0.0
Obesumbacterium proteus	82983	species	5011796	4	1	0.0
Pragia	82984	genus	0	1	0	0.0
Pragia fontium	82985	species	4094629	3	2	0.0
Tatumella	82986	genus	0	2	0	0.0
Tatumella ptyseos	82987	species	3588228	2	1	0.0
Serratia plymuthica	82996	species	5447150	4	0	0.0
Aminobacter aminovorans	83263	species	6890726	1	1	0.0
Escherichia coli K-12	83333	leaf	65191842	1	0	0.0
Escherichia coli O157:H7	83334	leaf	78215862	21	0	0
gamma proteobacterium HdN1	83406	species	4587455	12	0	0
Leclercia	83654	genus	0	4	0	0.0
Leclercia adecarboxylata	83655	species	4803917	52	0	0
Sodalis	84565	genus	4402821	2	0	0.0
Aeromonadaceae	84642	family	4831557	13	0	0.0
Micrococcales	85006	order	3661464	1	0	0.0
Microbacteriaceae	85023	family	4049029	1	0	0.0
Salmonella enterica subsp. enterica serovar Typhimurium str. DT104	85569	leaf	5027665	2	2	0.0
Achromobacter xylosoxidans	85698	species	7359146	4	0	0.0
Burkholderia multivorans	87883	species	10170089	4	0	2.20606e-06
Salmonella enterica subsp. enterica serovar Saintpaul	90105	leaf	29368410	285	122	1.47717e-06
Salmonella enterica subsp. enterica serovar Typhi	90370	leaf	505801019	500	121	1.00241e-05
Salmonella enterica subsp. enterica serovar Typhimurium	90371	leaf	150109640	21438	2780	5.62497e-06
Gallionellaceae	90627	family	3127780	2	0	0.0
Enterobacterales	91347	order	8015187	378	0	0.0
Edwardsiella hoshinae	93378	species	3811650	9	0	0.0
Shewanella japonica	93973	species	4975677	1	1	0.0
Shewanella sp. ANA-3	94122	species	5251146	258	0	0
Ramlibacter tataouinensis	94132	species	4070193	1	0	0.0
Burkholderia stabilis	95485	species	16249051	1	0	0.0
Burkholderia cenocepacia	95486	species	7744804	4	0	3.77567e-22
Thauera chlorobenzoica	96773	species	3735506	1	1	0.0
Vitreoscilla sp. C1	96942	species	2610419	1	0	0.0
Salmonella enterica subsp. enterica serovar Dublin	98360	leaf	35415966	91	28	1.87624e-07
Salmonella enterica subsp. enterica serovar Typhimurium str. LT2	99287	leaf	4951383	3	0	0.0
Burkholderia ubonensis	101571	species	7189071	8	0	0.0
Escherichia virus Wphi	103216	species	32684	6	0	9.26651e-222
Pseudomonas syringae pv. actinidiae	103796	leaf	39958995	3	0	0.0
Bordetella hinzii	103855	species	14686667	3	0	0.0
Pseudomonas frederiksbergensis	104087	species	18923076	1	1	0.0
Serratia sp. ATCC 39006	104623	species	9943513	6	0	0.0
Ralstonia mannitolilytica	105219	species	9915295	31	15	2.45821e-05
Nitrosococcus watsonii C-113	105559	leaf	3373286	1	0	0.0
Cupriavidus necator	106590	species	7948767	1	0	0.0
Salmonella enterica subsp. enterica serovar Newport	108619	leaf	24036368	240	27	5.95336e-07
Halomonas hydrothermalis	115561	species	3933432	1	1	0.0
Salmonella enterica subsp. enterica serovar Montevideo	115981	leaf	4694373	15	0	1.23037e-17
Burkholderiaceae	119060	family	7900732	1	0	0.0
Salmonella enterica subsp. enterica serovar Choleraesuis	119912	leaf	4751585	187	37	0
Pectobacterium	122277	genus	6614713	2	0	0.0
Providencia alcalifaciens	126385	species	8033032	7	2	0.0
Pseudomonas amygdali pv. morsprunorum	129138	leaf	6445963	1	0	0.0
Citrobacter youngae	133448	species	4945156	31	0	1.18665e-228
Salmonella enterica subsp. enterica serovar Bredeney	134047	leaf	4627083	45	1	0
Actinoplanes sp. SE50/110	134676	species	18480017	2	0	0.0
Ureaplasma parvum	134821	species	743562	1	0	0.0
Pseudomonadaceae	135621	family	6675755	19	0	0.0
P2virus	140410	genus	0	40	0	0.0
Photorhabdus laumondii subsp. laumondii	141679	subspecies	16913200	4	0	0.0
Salmonella enterica subsp. enterica serovar Tennessee	143221	leaf	24316845	68	0	5.80262e-07
Paracoccus yeei	147645	species	14118684	11	3	8.76715e-07
Salmonella enterica subsp. enterica serovar Braenderup	149391	leaf	4734880	79	48	5.74278e-06
Salmonella enterica subsp. enterica serovar Enteritidis	149539	leaf	208834451	4430	1227	1.85874e-06
Burkholderia ambifaria	152480	species	11349840	1	0	0.0
Kushneria marisflavi	157779	species	3667185	2	0	0.0
Cedecea	158483	genus	0	1	0	0.0
Cedecea neteri	158822	species	19970488	38	8	0.0
Enterobacter hormaechei	158836	species	11512864	254	1	0
Leminorella richardii	158841	species	3976274	1	0	0.0
Raoultella	160674	genus	5398151	11	0	0.0
Paenibacillus borealis	160799	species	8156808	1	1	0.0
Streptomyces puniciscabiei	164348	species	9698948	1	1	0.0
Laribacter	168470	genus	3169329	1	0	0.0
Escherichia coli O127:H6	168807	leaf	9641111	20	2	1.52108e-214
Paraburkholderia terricola	169427	species	7118039	1	1	0.0
Prevotellaceae	171552	family	3023914	1	0	0.0
Salmonella virus ST64T	173443	species	40679	1	0	0
Salmonella phage ST64B	175950	species	40149	650	0	6.31942e-38
Pseudoalteromonas agarivorans	176102	species	4544962	5	0	0.0
Salinisphaera	180541	genus	0	1	0	0.0
Pectobacterium carotovorum subsp. brasiliense	180957	subspecies	14811458	5	0	0.0
Candidatus Baumannia cicadellinicola	186490	species	686194	1	1	0.0
Clostridiales	186802	order	4169569	2	0	0.0
Sneathia amnii	187101	species	1330224	1	0	0.0
Thalassolituus oleivorans	187493	species	3842190	1	1	0.0
Ralstonia insidiosa	190721	species	12164766	14	5	2.16907e-167
Vibrio coralliilyticus	190893	species	23103305	4	0	0.0
Chlorobiaceae	191412	family	2624804	1	0	0.0
Salmonella enterica subsp. enterica serovar Stanley	192953	leaf	4791042	118	74	1.66009e-05
Salmonella enterica subsp. enterica serovar Mbandaka	192954	leaf	9505961	118	96	0.0
Salmonella enterica subsp. enterica serovar Kentucky	192955	leaf	4900326	165	107	1.14304e-05
Sinorhizobium americanum	194963	species	6853050	1	0	0.0
Nocardioides sp. JS614	196162	species	5293685	1	0	0.0
Aeromonas salmonicida subsp. masoucida	197700	subspecies	4917535	1	1	0.0
Shigella flexneri 2a str. 301	198214	leaf	4828820	133	5	3.77434e-06
Pseudomonas koreensis	198620	species	19791180	1	1	0.0
Dickeya dadantii 3937	198628	leaf	4922802	5	1	0.0
Escherichia coli CFT073	199310	leaf	5231428	4	1	4.17554e-311
Flavobacteriales	200644	order	2863420	1	0	0.0
Sulfurimonas	202746	genus	2177379	2	0	0.0
Dickeya	204037	genus	4822257	5	1	0.0
Dickeya dadantii	204038	species	4922802	3	0	0.0
Dickeya dianthicola	204039	species	4720132	2	1	0.0
Dickeya zeae	204042	species	4675379	5	0	0.0
Sphingomonadales	204457	order	4098145	2	0	0.0
Pseudomonas syringae pv. syringae B728a	205918	leaf	6093698	1	0	0.0
Pseudomonas fluorescens Pf0-1	205922	leaf	6438405	3	2	0.0
Neisseriales	206351	order	2372285	30	0	0.0
Rhodocyclales	206389	order	4186782	7	0	0.0
Kosakonia cowanii	208223	species	4857324	9	0	0.0
Enterobacter kobei	208224	species	10094268	206	0	1.14596e-227
Escherichia albertii	208962	species	4701875	1544	28	1.17168e-05
Salmonella enterica subsp. enterica serovar Typhi str. Ty2	209261	leaf	4791961	1	0	4.85394e-24
Desulfovibrionales	213115	order	3511273	1	0	0.0
Erwinia sp. Ejp617	215689	species	3957675	12	1	0.0
Roseovarius mucosus	215743	species	4381426	1	1	0.0
Escherichia coli 042	216592	leaf	5355323	2	0	0.0
Rhizobium leguminosarum bv. viciae 3841	216596	leaf	7751309	1	0	0.0
Salmonella enterica subsp. enterica serovar Typhimurium str. SL1344	216597	leaf	5067450	10	0	0
Vibrio vulnificus CMCP6	216895	leaf	5126696	1	0	0.0
Achromobacter spanius	217203	species	12765991	1	0	0.0
Achromobacter insolitus	217204	species	13385742	1	0	0.0
Pectobacterium atrosepticum SCRI1043	218491	leaf	5064019	2	0	0.0
Salmonella bongori NCTC 12419	218493	leaf	4460105	437	3	0
Salmonella enterica subsp. enterica serovar Typhi str. CT18	220341	leaf	5133713	4	0	0.00948289
Pseudomonas protegens Pf-5	220664	leaf	7074893	1	0	0.0
Oceanobacillus iheyensis HTE831	221109	leaf	3630528	1	1	0.0
[Mannheimia] succiniciproducens MBEL55E	221988	leaf	2314078	1	1	0.0
Mycobacterium chimaera	222805	species	49908161	18	17	0.0
Aquifex aeolicus VF5	224324	leaf	1590791	1	1	0.0
Salmonella enterica subsp. enterica serovar Java	224729	leaf	4756780	75	46	7.33138e-06
Bradyrhizobium diazoefficiens USDA 110	224911	leaf	18211892	2	0	0.0
Oceanisphaera	225143	genus	0	1	0	0.0
Shewanella piezotolerans WP3	225849	leaf	5396476	1	0	0.0
Yersinia virus L413C	227940	species	30728	77	1	7.64272e-156
Photorhabdus thracensis	230089	species	5147098	1	1	0.0
Candidatus Portiera	235572	genus	709276	1	0	0.0
Methylococcus capsulatus str. Bath	243233	leaf	3304561	1	0	0.0
Photorhabdus laumondii subsp. laumondii TTO1	243265	leaf	5688987	2	0	0.0
Klebsiella variicola	244366	species	5458505	1668	12	4.50179e-06
Yoonia vestfoldensis	245188	species	3987360	1	0	0.0
Prevotella intermedia 17	246198	leaf	2699437	1	0	0.0
Pseudomonas syringae group genomosp. 3	251701	species	6530813	1	0	0.0
Microbulbifer thermotolerans	252514	species	3938396	1	1	0.0
Salmonella enterica subsp. enterica serovar Aberdeen	260367	leaf	4644636	77	17	2.68174e-16
Buchnera aphidicola (Cinara tujafilina)	261317	leaf	444925	1	0	0.0
Streptomyces hygroscopicus subsp. limoneus	264445	subspecies	10537932	1	0	0.0
Methylobacillus flagellatus KT	265072	leaf	2971517	1	1	0.0
Cupriavidus metallidurans CH34	266264	leaf	6913352	1	1	0.0
Paraburkholderia xenovorans LB400	266265	leaf	19434089	2	2	0.0
Mesorhizobium japonicum MAFF 303099	266835	leaf	7596297	1	0	0.0
Shewanellaceae	267890	family	5140018	8	0	0.0
Nitratiruptor	269258	genus	0	2	0	0.0
Ehrlichia canis str. Jake	269484	leaf	1315030	1	1	0.0
Rhodospirillum rubrum ATCC 11170	269796	leaf	4406557	1	0	0.0
Methanosarcina barkeri str. Fusaro	269797	leaf	4873766	1	0	0.0
Bacillus cereus G9241	269801	leaf	5720073	1	0	0.0
Gluconacetobacter diazotrophicus PA1 5	272568	leaf	7914538	2	0	0.0
Klebsiella pneumoniae subsp. pneumoniae MGH 78578	272620	leaf	5694894	86	18	9.52906e-167
Methylorubrum extorquens AM1	272630	leaf	13003629	1	0	0.0
Mycoplasma penetrans HF-2	272633	leaf	1358633	1	0	0.0
Pasteurella multocida subsp. multocida str. Pm70	272843	leaf	2257487	1	0	0.0
Collimonas pratensis	279113	species	11315924	2	0	0.0
Leifsonia xyli subsp. xyli str. CTCB07	281090	leaf	2584158	1	1	0.0
Kosakonia radicincitans	283686	species	6122453	82	13	0
Idiomarina loihiensis L2TR	283942	leaf	2839318	1	0	0.0
Sulfuricurvum	286130	genus	2819357	2	0	0.0
Salmonella enterica subsp. enterica serovar Indiana	286783	leaf	5119391	166	2	0
Bradyrhizobium sp. BTAi1	288000	species	8493513	1	1	0.0
Beggiatoa leptomitoformis	288004	species	8531582	1	0	0.0
Thermodesulfobacterium commune DSM 2178	289377	leaf	1764045	1	0	0.0
Citrobacter koseri ATCC BAA-895	290338	leaf	4735357	81	17	1.7096e-226
Cronobacter sakazakii ATCC BAA-894	290339	leaf	4530777	7	0	0.0
Photorhabdus asymbiotica	291112	species	5094138	4	3	0.0
Candidatus Blochmannia pennsylvanicus str. BPEN	291272	leaf	791654	3	0	0.0
Salmonella enterica subsp. enterica serovar Paratyphi A str. ATCC 9150	295319	leaf	4585229	25	2	1.15311e-21
Salmonella enterica subsp. salamae serovar Greenside	297361	leaf	4732250	93	22	5.13598e-06
Enterobacter hormaechei subsp. steigerwaltii	299766	subspecies	20496016	10	3	0
Enterobacter ludwigii	299767	species	4952770	9	1	0.0
Shigella dysenteriae Sd197	300267	leaf	4560911	8	3	0.0
Enterobacter hormaechei subsp. oharae	301102	subspecies	14941448	11	0	0
Enterobacter hormaechei subsp. hormaechei	301105	subspecies	5063734	5	0	1.23081e-245
Haloferax volcanii DS2	309800	leaf	4012900	1	1	0.0
Aliivibrio fischeri ES114	312309	leaf	4273718	1	1	0.0
Alteromonas mediterranea	314275	species	4576285	1	0	0.0
Xanthomonas campestris pv. campestris str. 8004	314565	leaf	5148708	1	0	0.0
Rickettsia felis URRWXCal2	315456	leaf	1587240	1	0	0.0
Streptomyces peucetius subsp. caesius ATCC 27952	316280	leaf	8023114	1	1	0.0
Escherichia coli ETEC H10407	316401	leaf	5325888	194	0	1.01038e-295
Escherichia coli Nissle 1917	316435	leaf	10513529	1	0	0.0
Paracoccus denitrificans PD1222	318586	leaf	5236194	1	1	0.0
Shewanella putrefaciens CN-32	319224	leaf	4659220	285	0	0
Salmonella enterica subsp. enterica serovar Choleraesuis str. SC-B67	321314	leaf	4944000	178	25	3.02116e-06
Synechococcus sp. JA-3-3Ab	321327	species	2932766	1	1	0.0
Azotobacter vinelandii DJ	322710	leaf	5365318	2	0	0.0
Nitrosococcus oceani ATCC 19707	323261	leaf	3522111	3	0	0.0
Alcaligenes aquatilis	323284	species	4323879	1	0	0.0
Pontibacter actiniarum	323450	species	4974797	1	1	0.0
Shewanella loihica PV-4	323850	leaf	4602594	2	1	0.0
Chloroflexus aurantiacus J-10-fl	324602	leaf	5258541	1	0	0.0
Marinobacter psychrophilus	330734	species	3998597	1	0	0.0
Escherichia coli O139:H28 str. E24377A	331111	leaf	5249288	7	0	0
Escherichia coli HS	331112	leaf	4643538	5	0	4.6016e-262
Burkholderia cenocepacia HI2424	331272	leaf	7702840	1	0	0.0
Providencia heimbachae	333962	species	4286000	2	0	0.0
Bradyrhizobium sp. S23321	335659	species	7231841	1	1	0.0
Vibrio campbellii ATCC BAA-1116	338187	leaf	12090206	1	1	0.0
Erwinia tasmaniensis	338565	species	4067864	1	0	0.0
Rhodoferax ferrireducens T118	338969	leaf	4969784	1	0	0.0
Actinobacillus succinogenes 130Z	339671	leaf	2319663	2	1	0.0
Salmonella enterica subsp. enterica serovar Cerro	340188	leaf	4602439	102	10	0
Salmonella enterica subsp. enterica serovar Manhattan	340189	leaf	4802602	82	11	3.67137e-06
Sodalis glossinidius str. 'morsitans'	343509	leaf	4292502	5	1	0.0
Streptococcus salivarius JIM8777	347253	leaf	2210574	1	0	1.95462e-05
Zobellella denitrificans	347534	species	4174222	3	1	0.0
Yersinia pestis Angola	349746	leaf	9361624	1	0	0.0
Burkholderia dolosa AU0158	350701	leaf	6409095	2	0	0.0
Marinobacter hydrocarbonoclasticus VT8	351348	leaf	4779762	1	1	0.0
Xenorhabdus doucetiae	351671	species	4203651	8	1	0.0
Xenorhabdus hominickii	351679	species	4522699	2	1	0.0
Leptospira biflexa serovar Patoc strain 'Patoc 1 (Ames)'	355278	leaf	3956089	1	0	0.0
Psychromonas ingrahamii 37	357804	leaf	4559598	3	1	0.0
Acidovorax sp. KKS102	358220	species	5196935	2	1	0.0
Yersinia pestis Antiqua	360102	leaf	9764232	1	0	0.0
Escherichia coli UTI89	364106	leaf	5179971	1	0	0.0
Ramlibacter tataouinensis TTB310	365046	leaf	4070193	1	0	0.0
Sulfurospirillum cavolei	366522	species	2698323	1	0	0.0
Caulobacter sp. K31	366602	species	5889399	1	1	0.0
Buchnera aphidicola BCc	372461	leaf	422434	1	1	0.0
Baumannia cicadellinicola str. Hc (Homalodisca coagulata)	374463	leaf	686194	2	1	0.0
Flavobacterium johnsoniae UW101	376686	leaf	6096872	1	1	0.0
Pseudomonas protegens	380021	species	6923588	1	0	0.0
Cupriavidus necator H16	381666	leaf	7416678	1	0	0.0
Roseiflexus castenholzii DSM 13941	383372	leaf	5723298	1	0	0.0
Yersinia pestis Pestoides F	386656	leaf	9454180	1	1	0.0
Moraxella bovoculi	386891	species	15802199	1	0	0.0
Shewanella woodyi ATCC 51908	392500	leaf	5935403	2	0	0.0
Francisella tularensis subsp. holarctica OSU18	393011	leaf	3791454	2	0	0.0
Burkholderia multivorans ATCC 17616	395019	leaf	14017432	1	0	0.0
Rhizobium leguminosarum bv. trifolii WSM1325	395491	leaf	7418122	1	0	0.0
Rhizobium leguminosarum bv. trifolii WSM2304	395492	leaf	6872702	1	1	0.0
Delftia acidovorans SPH-1	398578	leaf	6767514	1	0	0.0
Shewanella pealeana ATCC 700345	398579	leaf	5174581	1	0	0.0
Serratia proteamaculans 568	399741	leaf	5495657	1	0	0.0
Enterobacter sp. 638	399742	species	4676461	17	3	0.0
Ralstonia pickettii 12J	402626	leaf	5325729	101	66	0.000219494
Escherichia coli APEC O1	405955	leaf	5497653	12	3	0
Xenorhabdus bovienii SS-2004	406818	leaf	4225498	2	0	0.0
Cronobacter	413496	genus	4479995	16	0	0.0
Cronobacter muytjensii	413501	species	4364114	2	0	0.0
Cronobacter turicensis	413502	species	4599092	1	0	0.0
Cronobacter malonaticus	413503	species	4473761	15	0	0
Enterobacteria phage cdtI	414970	species	47021	61	0	6.70024e-05
Burkholderia sp. KJ006	416344	species	6629912	1	0	0.0
Methylobacterium phyllosphaerae	418223	species	6316624	1	0	0.0
Yersinia massiliensis	419257	species	5164900	1	0	0.0
Salmonella enterica subsp. enterica serovar Newport str. SL254	423368	leaf	5007719	1	0	0.0
Shewanella sediminis HAW-EB3	425104	leaf	5517674	1	1	0.0
Methylobacterium sp. 4-46	426117	species	7737025	1	1	0.0
Ralstonia pickettii 12D	428406	leaf	5685358	111	75	6.93789e-05
Escherichia coli SE15	431946	leaf	4839683	1	0	0.0
Mycobacterium avium subsp. hominissuis	439334	subspecies	31569362	2	0	0.0
Salmonella enterica subsp. enterica serovar Schwarzengrund str. CVM19633	439843	leaf	4823887	4943	2765	0.00273487
Salmonella enterica subsp. enterica serovar Dublin str. CT_02021853	439851	leaf	4917459	10	3	0.0
Escherichia coli SMS-3-5	439855	leaf	5215377	36	1	0
Methylorubrum extorquens CM4	440085	leaf	6180732	1	0	0.0
Nocardiopsis dassonvillei subsp. dassonvillei DSM 43111	446468	leaf	6543312	1	0	0.0
Nostoc sphaeroides	446679	species	6684490	1	0	0.0
Phytobacter	447792	genus	0	161	0	0.0
Salmonella enterica subsp. enterica serovar Agona str. SL483	454166	leaf	4836638	77	0	3.77734e-26
Glaesserella parasuis 29755	456298	leaf	2352603	1	0	0.0
Leptospira biflexa serovar Patoc strain 'Patoc 1 (Paris)'	456481	leaf	3951448	1	0	0.0
Shewanella halifaxensis HAW-EB4	458817	leaf	5226917	2	0	0.0
Methylobacterium nodulans ORS 2060	460265	leaf	8839022	1	1	0.0
Bordetella flabilis	463014	species	5954318	1	0	0.0
Micrococcus luteus NCTC 2665	465515	leaf	4996790	2	0	0.0
Steroidobacter denitrificans	465721	species	3467246	1	1	0.0
Erwinia tasmaniensis Et1/99	465817	leaf	4067864	7	2	0.0
Fusobacterium gonidiaformans ATCC 25563	469615	leaf	1678881	1	1	0.0
Pantoea vagans	470934	species	4888338	15	4	0.0
Nitrosococcus halophilus Nc 4	472759	leaf	4145260	1	0	0.0
Halomonas beimenensis	475662	species	4053030	2	0	0.0
Salmonella enterica subsp. enterica serovar Paratyphi C str. RKS4594	476213	leaf	4888494	241	106	3.3862e-05
Candidatus Ishikawaella capsulata Mpkobe	476281	leaf	754729	2	1	0.0
Chloroflexus aurantiacus Y-400-fl	480224	leaf	5268950	1	0	0.0
Methylacidiphilum infernorum V4	481448	leaf	2287145	1	1	0.0
Escherichia coli ATCC 8739	481805	leaf	9493136	26	0	0.0
Myxococcus fulvus HW-1	483219	leaf	9003593	1	0	0.0
Salmonella enterica subsp. enterica serovar Concord	483687	leaf	5277621	140	0	0
Klebsiella pneumoniae subsp. pneumoniae NTUH-K2044	484021	leaf	5472672	11	2	0.0
Sphingobium sp. YBL2	484429	species	5427419	1	1	0.0
Serratia sp. SCBI	488142	species	5101896	1	0	0.0
Burkholderia latens	488446	species	6614478	1	0	0.0
Burkholderia seminalis	488731	species	7648944	2	0	0.0
Neisseria lactamica 020-06	489653	leaf	2220606	1	0	6.34947e-107
Marinobacter sp. BSs20148	490759	species	4063864	1	0	0.0
Rhizobium etli CIAT 652	491916	leaf	6448048	1	0	0.0
Bacillus velezensis	492670	species	4031426	5	1	0.0
Kosakonia oryzae	497725	species	5303342	40	1	0.0
Haliangium ochraceum DSM 14365	502025	leaf	9446314	1	1	0.0
Eggerthella sp. YY7918	502558	species	3123671	1	0	0.0
Kushneria	504090	genus	0	1	0	0.0
Klebsiella pneumoniae 342	507522	leaf	5920257	28	1	0.0
Oceanimonas sp. GK1	511062	species	3527244	5	3	0.0
Pseudomonas yamanorum	515393	species	6856835	2	2	0.0
[Eubacterium] rectale ATCC 33656	515619	leaf	3449685	1	1	9.81306e-06
Rhodothermus marinus DSM 4252	518766	leaf	3386737	1	0	0.0
Streptobacillus moniliformis DSM 12112	519441	leaf	1673280	1	0	0.0
Alicyclobacillus acidocaldarius subsp. acidocaldarius DSM 446	521098	leaf	3205686	1	1	0.0
Candidatus Accumulibacter phosphatis clade IIA str. UW-1	522306	leaf	5306133	1	1	0.0
Campylobacter avium LMG 24591	522484	leaf	1738633	1	1	0.0
Kangiella koreensis DSM 16069	523791	leaf	2852073	1	0	0.0
Geodermatophilus obscurus DSM 43160	526225	leaf	5322497	1	1	2.32561e-06
Neisseria gonorrhoeae MS11	528354	leaf	2237793	1	0	0.00656781
Clostridium carboxidivorans P7	536227	leaf	5752782	1	1	0.0
Chryseobacterium taklimakanense	536441	species	2764880	1	1	0.0
Treponema primitia ZAS-2	545694	leaf	4059867	1	0	0.0
Salmonella enterica subsp. enterica serovar Gallinarum str. 287/91	550538	leaf	4658697	66	2	0
Ferrimonas balearica DSM 9799	550540	leaf	4279159	3	1	0.0
Vibrio breoganii	553239	species	4492180	1	1	0.0
Salmonella enterica subsp. enterica serovar Paratyphi A str. AKU_12601	554290	leaf	4581797	24	0	2.70644e-06
Mycobacterium kansasii ATCC 12478	557599	leaf	6577228	1	1	0.0
Pectobacterium carotovorum subsp. carotovorum PC1	561230	leaf	4862913	2	0	0.0
Chitinophagaceae	563835	family	7619458	1	0	0.0
Ureaplasma urealyticum serovar 10 str. ATCC 33699	565575	leaf	874478	1	0	0.0
Escherichia coli W	566546	leaf	10014211	6	0	0.0
Salmonella enterica subsp. enterica serovar Typhimurium str. D23580	568708	leaf	4879400	40	0	0.0
Salmonella enterica subsp. enterica serovar Typhimurium str. DT2	568709	leaf	4908645	86	78	1.10509e-06
Escherichia coli NU14	569579	leaf	5076615	1	0	1.52658e-07
Desulfovibrio magneticus RS-1	573370	leaf	5315620	1	1	0.0
Escherichia coli O127:H6 str. E2348/69	574521	leaf	5069678	9	0	3.41261e-185
Polynucleobacter necessarius	576610	species	1560469	6	4	0.0
Hirschia baltica ATCC 49814	582402	leaf	3540114	1	1	0.0
Escherichia coli S88	585035	leaf	5166121	15	0	0
Escherichia fergusonii ATCC 35469	585054	leaf	4643861	140	40	0
Escherichia coli IAI39	585057	leaf	5132068	4	2	2.11411e-06
Escherichia coli O103:H2 str. 12009	585395	leaf	5524860	2	0	0.0
Escherichia coli O111:H- str. 11128	585396	leaf	5766081	107	0	0
Salmonella enterica subsp. enterica serovar Typhimurium str. 14028S	588858	leaf	4964097	28	20	0.0
Dickeya zeae Ech586	590409	leaf	4818394	3	0	0.0
Escherichia coli LF82	591946	leaf	4773108	5	3	7.63798e-06
Pantoea sp. At-9b	592316	species	6312783	5	4	0.0
Salmonella enterica subsp. enterica serovar Corvallis	593905	leaf	5359100	76	47	6.97362e-06
Tolumonas auensis DSM 9187	595494	leaf	3471292	3	1	0.0
Escherichia coli KO11FL	595495	leaf	10056495	2	0	0.0
Methylosinus trichosporium OB3b	595536	leaf	5183433	1	1	0.0
Nautilia profundicola AmH	598659	leaf	1676444	2	2	0.0
Hydrogenobacter thermophilus TK-6	608538	leaf	3486067	6	0	0.0
Shimwellia blattae DSM 4481 = NBRC 105725	630626	leaf	4158725	13	4	0.0
Erwinia pyrifoliae Ep1/96	634499	leaf	4072846	11	2	0.0
Erwinia billingiae Eb661	634500	leaf	5372268	6	3	0.0
Edwardsiella ictaluri 93-146	634503	leaf	3812301	10	0	0
Citrobacter rodentium ICC168	637910	leaf	5444283	40	27	0.0
Azospira oryzae PS	640081	leaf	3806980	1	0	0.0
Klebsiella variicola At-22	640131	leaf	5458505	74	4	2.01972e-06
Burkholderia sp. CCGE1002	640511	species	7884858	1	1	0.0
Burkholderia sp. CCGE1003	640512	species	7043595	1	0	0.0
Enterobacter asburiae LF7a	640513	leaf	5012132	9	5	0.0
Marivirga tractuosa DSM 4126	643867	leaf	4516490	1	1	0.0
Altererythrobacter namhicola	645517	species	2591679	1	1	0.0
Desulfurispirillum indicum S5	653733	leaf	2928377	1	1	0.0
Arthrobacter alpinus	656366	species	12838388	1	1	0.0
Photobacterium gaetbulicola Gung47	658445	leaf	5909413	1	1	0.0
Pantoea stewartii subsp. stewartii DC283	660596	leaf	5314092	4	2	0.0
Arcobacter bivalviorum	663364	species	2684688	1	0	0.0
Arcobacter suis CECT 7833	663365	leaf	2639269	1	1	0.0
Azospirillum sp. TSH58	664962	species	7244074	1	1	0.0
Erwinia amylovora CFBP1430	665029	leaf	3833832	4	0	0.0
Mixta calida	665913	species	4308453	22	1	0
Mixta gaviniae	665914	species	4527605	11	0	0.0
Methylotenera versatilis 301	666681	leaf	3059871	1	1	0.0
Thermodesulfatator indicus DSM 15286	667014	leaf	2322224	1	0	0.0
Edwardsiella anguillarum ET080813	667120	leaf	4329652	7	2	0.0
Oceanithermus profundus DSM 14977	670487	leaf	2439291	1	1	0.0
Propionibacterium sp. oral taxon 193	671223	species	2649207	1	1	6.18613e-06
Serratia sp. FGI94	671990	species	4858216	5	1	0.0
Candidatus Hamiltonella defensa (Bemisia tabaci)	672795	leaf	1739504	1	1	0.0
Vibrio casei	673372	species	4140771	2	2	0.0
Bacillus anthracis str. A16R	673518	leaf	5410560	1	1	0.0
Agarivorans gilvus	680279	species	4416600	1	0	0.0
Serratia plymuthica 4Rx13	682634	leaf	5403731	5	0	0.0
Salmonella enterica subsp. enterica serovar Gallinarum str. 9184	685040	leaf	4609911	70	6	4.86729e-06
Salmonella enterica subsp. enterica serovar Dublin str. ATCC 39184	687860	leaf	4917142	80	53	3.57943e-06
Cronobacter turicensis z3032	693216	leaf	4599092	16	5	0.0
Enterobacteriaceae bacterium strain FGI 57	693444	species	4762179	19	4	0
Staphylococcus phage SA1	694060	species	147303	4	0	0.0
Escherichia coli UMNK88	696406	leaf	5666764	70	24	1.05291e-244
Vibrio owensii	696485	species	24994462	28	28	0.0
Acinetobacter baumannii 1656-2	696749	leaf	4023106	1	1	0.0
Salmonella enterica subsp. enterica serovar Enteritidis str. 18569	696867	leaf	4745329	1	1	0.0
Kushneria konosiri	698828	species	3584631	1	0	0.0
Mycobacterium marseillense	701042	species	5285642	1	0	0.0
[Enterobacter] lignolyticus SCF1	701347	leaf	4814049	22	6	0
Salmonella enterica subsp. enterica serovar Saintpaul str. SARA26	702982	leaf	4686793	139	58	1.54033e-05
Pantoea ananatis LMG 20103	706191	leaf	4703373	6	1	0.0
Mycoplasma gallisepticum str. F	708616	leaf	977612	1	0	0.0
Pantoea vagans C9-1	712898	leaf	4888338	1	0	0.0
Escherichia coli IHE3034	714962	leaf	5108383	11	0	1.55907e-301
Alteromonas naphthalenivorans	715451	species	4972148	2	2	0.0
Erwinia amylovora ATCC 49946	716540	leaf	3905604	10	0	0.0
Enterobacter cloacae subsp. cloacae ATCC 13047	716541	leaf	5598796	43	9	2.68035e-253
Ensifer sojae CCBAU 05684	716928	leaf	6094027	1	0	0.0
Salmonella enterica subsp. enterica serovar Typhimurium str. T000240	718274	leaf	5069994	49	41	6.57208e-06
Rahnella sp. Y9602	741091	species	5614252	6	0	0.0
Escherichia coli Xuzhou21	741093	leaf	5516736	1	1	0.0
Salmonella enterica subsp. enterica serovar Montevideo str. 531954	745022	leaf	4694397	3	0	0.0
Escherichia coli 1303	745156	leaf	5156928	1	0	0
Salmonella enterica subsp. enterica serovar Senftenberg str. 361154004	749965	leaf	5114779	4	0	0.0
Actinobacillus pleuropneumoniae serovar 8	754345	leaf	2337633	1	0	0.0
Methylophaga nitratireducenticrescens	754476	species	3137100	1	0	0.0
Methylophaga frappieri	754477	species	2745290	1	1	0.0
Acinetobacter indicus	756892	species	3157380	2	1	0.0
Burkholderia insecticola	758793	species	6964487	2	0	0.0
Escherichia coli ECC-1470	758831	leaf	4903812	17	0	0
Streptococcus parasanguinis ATCC 15912	760570	leaf	2153652	1	0	0.0
Rhodothermus marinus SG0.5JP17-172	762570	leaf	3334122	1	0	0.0
Frateuria aurantia DSM 6220	767434	leaf	3603458	1	0	0.0
Halomonas elongata DSM 2581	768066	leaf	4061825	2	0	0.0
Serratia sp. AS12	768490	species	5443009	1	0	0.0
Serratia sp. AS13	768493	species	5442549	1	0	0.0
Cytophagales	768507	order	4660290	1	0	0.0
Thermodesulfobacterium geofontis OPF15	795359	leaf	1634377	1	0	0.0
Salmonella enterica subsp. enterica serovar Newport str. CVM 22425	796730	leaf	4991133	88	45	5.98474e-17
Salmonella enterica subsp. enterica serovar Newport str. CVM 21538	796731	leaf	4875940	238	117	6.35939e-06
Salmonella enterica subsp. enterica serovar Newport str. CVM 22513	796732	leaf	4951115	48	0	0.0
Salmonella enterica subsp. enterica serovar Newport str. CVM 21550	796733	leaf	4978519	1	0	0.0
Methylomonas methanica MC09	857087	leaf	5051681	1	0	0.0
Salmonella enterica subsp. enterica serovar Newport str. CVM N18486	858306	leaf	4755838	1	1	0.0
Salmonella enterica subsp. enterica serovar Newport str. CVM N1543	858307	leaf	4946544	1	0	0.0
Bacillus kochii	859143	species	4694375	1	1	0.0
Salmonella enterica subsp. enterica serovar Montevideo str. 507440-20	859199	leaf	4694375	13	4	0.0
Candidatus Blochmannia vafer str. BVAF	859654	leaf	722585	1	0	0.0
Escherichia coli DSM 30083 = JCM 1649 = ATCC 11775	866789	leaf	5034833	5	2	0.0
Salmonella enterica subsp. enterica serovar 4,[5],12:i:- str. 08-1736	866913	leaf	4822189	8	2	0.0
Escherichia coli UM146	869729	leaf	5107563	5	2	0.0
Salmonella enterica subsp. enterica serovar Newport str. USMARC-S3124.1	877468	leaf	4915960	1	0	0.0
Caldithrix abyssi DSM 13497	880073	leaf	4978541	1	1	0.0
Lactobacillus helveticus R0052	880633	leaf	2129206	1	1	0.0
Enterobacter bugandensis	881260	species	4717613	6	2	2.64295e-06
Escherichia coli str. 'clone D i14'	885275	leaf	5038386	1	0	0.0
Escherichia coli str. 'clone D i2'	885276	leaf	5038386	1	0	0.0
Muricauda ruestringensis DSM 13258	886377	leaf	3842422	1	1	0.0
Acetomicrobium mobile DSM 13181	891968	leaf	2160700	1	1	0.0
Plautia stali symbiont	891974	species	4092852	4	2	0.0
Salmonella enterica subsp. enterica serovar Typhimurium str. ST4/74	909946	leaf	5067451	10	0	0
Salmonella enterica subsp. enterica serovar Gaminara	913070	leaf	5030148	17	4	2.08432e-39
Arcobacter ellisii	913109	species	2799949	1	1	0.0
Vibrio vulnificus MO6-24/O	914127	leaf	5007768	1	0	0.0
Kangiella geojedonensis	914150	species	2495242	1	0	0.0
Methylobacterium sp. AMS5	925818	species	5599206	1	0	0.0
Streptococcus oralis Uo5	927666	leaf	1958690	1	1	0.0
Gibbsiella quercinecans	929813	species	5548506	24	2	0.0
Salmonella phage RE-2010	929814	species	34117	9	0	1.17144e-42
Escherichia coli O157:H16	930406	leaf	5104557	47	0	1.57389e-17
Salmonella enterica subsp. enterica serovar Newport str. Levine 1	930778	leaf	4841916	144	39	1.22982e-05
Salmonella enterica subsp. enterica serovar Newport str. Levine 15	930779	leaf	4883715	143	72	3.19245e-06
Halioglobus pacificus	930806	species	5003575	1	0	0.0
Pantoea ananatis AJ13355	932677	leaf	4877279	1	0	0.0
Salmonella enterica subsp. enterica serovar Bardo	932733	leaf	4849139	196	5	4.59078e-06
Salmonella enterica subsp. enterica serovar Thompson str. ATCC 8391	935705	leaf	4690430	14	0	0.0
Salmonella enterica subsp. enterica serovar Sloterdijk str. ATCC 15791	938141	leaf	4817791	61	38	1.42857e-06
Salmonella enterica subsp. enterica serovar Choleraesuis str. ATCC 10708	938142	leaf	4801679	159	7	1.15182e-06
Salmonella enterica subsp. enterica serovar Rubislaw str. ATCC 10717	938143	leaf	4769795	38	9	2.59958e-06
Salmonella enterica subsp. enterica serovar Inverness str. ATCC 10720	941187	leaf	4989883	175	88	3.68368e-06
Salmonella enterica subsp. enterica serovar Pomona str. ATCC 10729	941188	leaf	4678025	52	14	7.24005e-06
Salmonella enterica subsp. enterica serovar Paratyphi A str. ATCC 11511	941189	leaf	4580689	90	9	1.09309e-05
Salmonella enterica subsp. enterica serovar Chester str. ATCC 11997	941190	leaf	4660922	183	53	6.15774e-06
Escherichia coli O25b:H4	941280	leaf	5483091	13	0	2.59413e-313
Cronobacter sakazakii SP291	956149	leaf	4518784	7	2	0.0
Glaciecola sp. 4H-3-7+YE-5	983545	species	5393591	18	18	0.0
Salmonella enterica subsp. enterica serovar Anatum str. ATCC BAA-1592	984211	leaf	4706101	1	0	0.0
Salmonella enterica subsp. enterica serovar Mbandaka str. ATCC 51958	984237	leaf	4905181	135	79	1.03813e-05
Burkholderia multivorans ATCC BAA-247	985079	leaf	6322746	1	0	0.0
Marinovum algicola DG 898	988812	leaf	5252390	1	0	0.0
Salmonella enterica subsp. enterica serovar Typhimurium str. UK-1	990282	leaf	4911145	13	1	0
Escherichia coli O121:H19	991915	leaf	5479471	1	0	0.0
Salmonella enterica subsp. enterica serovar Typhimurium str. L-3553	996633	leaf	5184452	1687	71	2.54726e-05
Salmonella enterica subsp. enterica serovar Oranienburg str. 0250	997333	leaf	4648879	54	0	2.45695e-37
Salmonella enterica subsp. enterica serovar Newport str. WA_14882	997339	leaf	4712541	61	4	5.26245e-06
Salmonella enterica subsp. enterica serovar Enteritidis str. RM2968	998822	leaf	4792035	63	0	1.90973e-31
Burkholderia gladioli BSR3	999541	leaf	9052299	1	0	0.0
Escherichia coli PCN033	1001989	leaf	5156873	33	2	0
Salmonella enterica subsp. enterica serovar Tennessee str. TXSC_TXSC08-19	1003191	leaf	4864410	23	14	0
Alteromonas mediterranea DE1	1004786	leaf	4947126	1	0	0.0
Buchnera aphidicola str. Ak (Acyrthosiphon kondoi)	1005090	leaf	653223	1	1	0.0
Klebsiella michiganensis KCTC 1686	1006551	leaf	5974109	2	2	0.0
Salmonella enterica subsp. enterica serovar Typhimurium str. 798	1008297	leaf	4970096	307	213	6.8674e-06
Salmonella enterica subsp. enterica serovar Paratyphi B str. SPB7	1016998	leaf	4858887	146	99	1.05585e-05
Klebsiella aerogenes KCTC 2190	1028307	leaf	5280350	7	1	9.34806e-157
Pseudomonas sp. StFLB209	1028989	species	6332373	1	0	0.0
Salmonella enterica subsp. enterica serovar Typhimurium str. SARA13	1029978	leaf	4913633	191	84	4.97603e-06
Salmonella enterica subsp. enterica serovar Pullorum str. ATCC 9120	1029979	leaf	4781492	132	5	0
Salmonella enterica subsp. enterica serovar Abony str. 0014	1029983	leaf	4737447	142	73	5.82634e-06
Salmonella enterica subsp. enterica serovar Heidelberg str. SARA35	1029997	leaf	4751206	160	58	4.25648e-27
Ralstonia solanacearum Po82	1031711	leaf	5430263	3	0	0.0
Yersinia pestis A1122	1035377	leaf	9332976	1	1	0.0
Rhodospirillum rubrum F11	1036743	leaf	4352825	1	0	0.0
Cupriavidus necator N-1	1042878	leaf	8480857	1	0	0.0
Escherichia coli O157	1045010	leaf	17268079	1	1	0.0
Pseudoxanthomonas spadix BD-a59	1045855	leaf	3452554	1	1	0.0
Enterobacter cloacae EcWSU1	1045856	leaf	4798091	2	0	0.0
Escherichia coli O104:H4 str. C227-11	1048254	leaf	5446006	2	2	0.0
Candidatus Moranella	1048757	genus	538248	1	0	0.0
Klebsiella pneumoniae KCTC 2242	1049565	leaf	5462423	61	15	9.10092e-06
Escherichia coli O103 str. RM8385	1055540	leaf	5732806	2	0	0
Escherichia coli O111 str. RM9322	1055542	leaf	5284381	2	2	0.0
Escherichia coli O121 str. RM8352	1055543	leaf	5474275	1	0	0.0
Escherichia coli O91 str. RM7190	1055545	leaf	5030336	63	0	7.48802e-307
Salmonella enterica subsp. enterica serovar Thompson str. RM6836	1064551	leaf	4707648	92	0	0
Escherichia coli O7:K1 str. CE10	1072459	leaf	5378729	2	0	0
Salmonella enterica subsp. enterica serovar Agona str. 392869-2	1072590	leaf	4798530	83	12	8.07497e-06
Cronobacter condimenti 1330	1073999	leaf	4499482	16	5	0.0
Cronobacter universalis NCTC 9529	1074000	leaf	4436873	10	1	0.0
Pantoea rwandensis	1076550	species	4327607	11	3	0.0
Salmonella enterica subsp. enterica serovar Fresno	1077085	leaf	4822167	204	93	2.00054e-05
Paracoccus zhejiangensis	1077935	species	4637247	1	1	0.0
Lonsdalea	1082702	genus	0	1	0	0.0
Lonsdalea britannica	1082704	species	4015569	2	1	0.0
Klebsiella pneumoniae subsp. pneumoniae KPNIH1	1087440	leaf	5766615	1	0	0.0
Dickeya solani	1089444	species	4920704	12	1	0.0
Methylomicrobium alcaliphilum 20Z	1091494	leaf	4796711	1	0	0.0
Klebsiella pneumoniae subsp. pneumoniae KPNIH10	1094170	leaf	5767822	1	0	0.0
Pantoea ananatis PA13	1095774	leaf	4867131	3	0	0.0
Idiomarina piscisalsi	1096243	species	2587498	2	0	0.0
Burkholderia sp. YI23	1097668	species	8896411	1	1	0.0
Enterobacter cloacae subsp. dissolvens SDM	1104326	leaf	4968248	9	8	0.0
Brenneria goodwinii	1109412	species	5360730	15	9	0.0
Streptococcus parasanguinis FW213	1114965	leaf	2171609	1	0	0.0
Vibrio sp. EJY3	1116375	species	5452646	1	0	0.0
Pseudoalteromonas spongiae UST010723-006	1117319	leaf	4752413	1	0	0.0
Halomonas sp. GFAJ-1	1118153	species	3650492	1	1	0.0
Campylobacter cuniculorum DSM 23162 = LMG 24588	1121267	leaf	1937768	1	1	0.0
Thalassospira xiamenensis M-5 = DSM 17429	1123366	leaf	4768950	1	1	0.0
Pseudomonas stutzeri DSM 10701	1123519	leaf	4174118	2	2	0.0
Klebsiella pneumoniae subsp. pneumoniae Kp13	1123862	leaf	5739888	29	9	1.3687e-06
Pantoea ananatis LMG 5342	1123863	leaf	4908144	3	0	0.0
Salmonella enterica subsp. enterica serovar Agona str. 460004 2-1	1124917	leaf	4797171	77	0	4.67508e-34
Salmonella enterica subsp. enterica serovar Heidelberg str. 41578	1124936	leaf	4951478	1888	42	0.000365348
Salmonella enterica subsp. enterica serovar Minnesota str. ATCC 49284	1124956	leaf	4592393	91	37	2.27763e-06
Salmonella enterica subsp. enterica serovar Muenster str. 0315	1124958	leaf	4972820	102	1	4.27141e-50
Salmonella enterica subsp. enterica serovar Muenster str. 420	1124959	leaf	4756014	72	0	3.66683e-06
Salmonella enterica subsp. enterica serovar Panama str. ATCC 7378	1124961	leaf	4555576	26	3	2.0948e-06
Salmonella enterica subsp. enterica serovar Poona str. ATCC BAA-1673	1124962	leaf	5091833	1481	36	0.000163147
Pseudomonas protegens CHA0	1124983	leaf	6867980	1	0	0.0
Morganella morganii subsp. morganii KT	1124991	leaf	3799539	2	2	0.0
Klebsiella pneumoniae subsp. pneumoniae HS11286	1125630	leaf	5682322	30	22	0.0
Salmonella phage SPN9CC	1127357	species	40128	1	0	3.82979e-128
Salmonella enterica subsp. enterica serovar Nitra	1129117	leaf	4691807	194	135	3.31136e-06
Candidatus Uzinura diaspidicola str. ASNER	1133592	leaf	263431	1	1	0.0
Streptomyces hygroscopicus subsp. jinggangensis 5008	1133850	leaf	10383684	1	0	0.0
Escherichia coli O104:H4 str. 2011C-3493	1133852	leaf	5437407	1	0	0.0
Klebsiella michiganensis	1134687	species	6150064	424	2	6.09269e-121
Cronobacter sakazakii ES15	1138308	leaf	4268675	11	1	0.0
Corallococcus coralloides DSM 2259	1144275	leaf	10080619	1	0	0.0
Kangiella sediminilitoris	1144748	species	2496140	1	0	0.0
Blastococcus saxobsidens DD2	1146883	leaf	4875340	1	1	0.0
Salmonella phage SPN3UB	1147140	species	47355	205	0	4.34304e-112
Enterobacteria phage mEp235	1147150	species	37595	3	2	0.0
Enterobacteria phage mEp460	1147152	species	44510	62	0	1.1521e-16
Rahnella aquatilis HX2	1151116	leaf	5656799	8	2	0.0
Serratia plymuthica PRI-2C	1154756	leaf	5474685	6	1	0.0
Providencia stuartii MRSN 2154	1157951	leaf	4402109	1	0	0.0
Kosakonia sacchari	1158459	species	4902027	46	5	0
Cronobacter malonaticus LMG 23826	1159491	leaf	4473761	13	0	0.0
Cronobacter dublinensis subsp. dublinensis LMG 23823	1159554	leaf	4628405	15	4	0
Cronobacter muytjensii ATCC 51329	1159613	leaf	4364114	12	5	0.0
Salmonella enterica subsp. enterica serovar Heidelberg str. B182	1160717	leaf	4788046	373	342	6.44854e-06
Enterobacter sp. R4-368	1166130	species	5155034	46	1	0.0
Salmonella phage vB_SemP_Emek	1168548	species	39783	1	0	0
Salmonella enterica subsp. enterica serovar Typhimurium str. U288	1171376	leaf	5017059	73	48	1.54453e-06
Catenovulum	1172191	genus	0	2	0	0.0
Salmonella enterica subsp. enterica serovar Bareilly str. CFSAN000189	1173427	leaf	4808805	80	4	1.2607e-05
Salmonella enterica subsp. enterica serovar Bareilly str. CFSAN000191	1173457	leaf	4723270	73	7	5.80198e-46
Salmonella phage FSL SP-004	1173769	species	29742	32	0	1.70347e-185
Salmonella enterica subsp. enterica serovar Albany str. ATCC 51960	1173798	leaf	4805448	69	46	2.39784e-06
Salmonella enterica subsp. enterica serovar Weltevreden str. 1655	1173939	leaf	5129059	99	9	6.88031e-07
Pectobacterium wasabiae CFBP 3304	1175631	leaf	5043228	5	1	0
Kosakonia radicincitans DSM 16656	1177180	leaf	6122453	67	28	0
Ferriphaselus amnicola	1188319	species	2717229	1	1	0.0
Klebsiella michiganensis E718	1191061	leaf	6561678	26	0	8.43607e-182
Flammeovirga sp. MY04	1191459	species	7327614	1	1	0.0
Klebsiella pneumoniae subsp. pneumoniae 1084	1193292	leaf	5386705	283	228	1.16808e-05
Pseudomonas putida SJTE-1	1193499	leaf	6077201	1	1	0.0
Gilliamella	1193503	genus	0	3	0	0.0
Salmonella enterica subsp. enterica serovar Bredeney str. CFSAN001080	1194154	leaf	4603849	29	1	1.4814e-05
Salmonella enterica subsp. enterica serovar Stanleyville str. CFSAN000624	1194159	leaf	5102976	33	28	2.42958e-06
Gilliamella apicola	1196095	species	3139412	3	0	0.0
Salmonella bongori N268-08	1197719	leaf	4773537	712	5	0
Granulicella tundricola MP5ACTX9	1198114	leaf	5503984	1	1	0.0
Streptomyces hygroscopicus subsp. jinggangensis TL01	1203460	leaf	10077952	1	0	0.0
Celeribacter indicus	1208324	species	4969388	1	0	0.0
Salmonella enterica subsp. enterica serovar Abaetetuba str. ATCC 35640	1208611	leaf	4547600	56	21	0
Enterobacter cloacae subsp. cloacae ENHKU01	1211025	leaf	4726582	19	15	0.0
Pseudomonas putida HB3267	1215088	leaf	5956110	2	0	0.0
Pectobacterium carotovorum subsp. carotovorum PCC21	1218933	leaf	4842771	1	1	0.0
Vibrio natriegens NBRC 15636 = ATCC 14048 = DSM 759	1219067	leaf	10343839	1	0	0.0
Pseudomonas mendocina S5.2	1225174	leaf	5372474	1	1	0.0
Salmonella enterica subsp. enterica serovar Gallinarum/pullorum str. CDC1983-67	1225522	leaf	4623089	75	1	5.36113e-07
Enterobacteria phage SfI	1225789	species	38389	126	1	0.000211895
Dickeya solani D s0432-1	1231725	leaf	4919812	5	0	0.0
Nocardiopsis gilva YIM 90087	1235441	leaf	6142152	1	1	0.0
Kosakonia sacchari SP1	1235834	leaf	4902027	17	0	0
Candidatus Pantoea carbekii	1235990	species	2348022	4	0	0.0
Sodalis praecaptivus	1239307	species	5159425	29	2	0.0
Candidatus Blochmannia chromaiodes str. 640	1240471	leaf	791219	3	0	0.0
Orbaceae	1240483	family	0	392	0	0.0
Salmonella enterica subsp. enterica serovar Blegdam str. S-1824	1240694	leaf	4693979	3	0	0.0
Salmonella enterica subsp. enterica serovar Bergen str. ST350	1240708	leaf	4801835	112	31	1.05299e-05
Salmonella enterica subsp. enterica serovar Antsalova str. S01-0511	1242087	leaf	4648086	60	15	3.57666e-06
Salmonella enterica subsp. enterica serovar Apapa str. SA20060561	1242088	leaf	4801658	82	31	7.6031e-06
Salmonella enterica subsp. enterica serovar Borreze str. SA20041063	1242089	leaf	4777558	79	2	5.39168e-20
Salmonella enterica subsp. enterica serovar Crossness str. 1422-74	1242090	leaf	4847468	44	4	2.5712e-06
Salmonella enterica subsp. enterica serovar Djakarta str. S-1087	1242091	leaf	4668861	129	86	1.36537e-05
Salmonella enterica subsp. enterica serovar Gaminara str. SA20063285	1242094	leaf	4957986	18	4	9.38156e-07
Salmonella enterica subsp. enterica serovar Hillingdon str. N1529-D3	1242096	leaf	4618056	97	40	1.12441e-05
Salmonella enterica subsp. enterica serovar Hvittingfoss str. SA20014981	1242097	leaf	4940239	230	110	1.04186e-05
Salmonella enterica subsp. enterica serovar Johannesburg str. ST203	1242101	leaf	4651794	30	7	4.33167e-06
Salmonella enterica subsp. enterica serovar Kentucky str. SA20030505	1242102	leaf	4850980	122	42	2.87078e-06
Salmonella enterica subsp. enterica serovar Koessen str. S-1501	1242105	leaf	4566169	26	4	1.3197e-20
Salmonella enterica subsp. enterica serovar Krefeld str. SA20030536	1242106	leaf	4942273	126	72	8.78516e-06
Salmonella enterica subsp. enterica serovar Macclesfield str. S-1643	1242107	leaf	5268613	489	273	2.14029e-05
Salmonella enterica subsp. enterica serovar Manchester str. ST278	1242108	leaf	4532753	268	63	1.1222e-05
Salmonella enterica subsp. enterica serovar Milwaukee str. SA19950795	1243578	leaf	5102439	66	21	3.03933e-06
Salmonella enterica subsp. enterica serovar Moscow str. S-1843	1243579	leaf	4690402	129	121	1.98275e-06
Salmonella enterica subsp. enterica serovar Onderstepoort str. SA20060086	1243584	leaf	5005424	118	46	4.8934e-06
Salmonella enterica subsp. enterica serovar Ouakam str. SA20034636	1243586	leaf	4874915	80	48	9.21629e-06
Salmonella enterica subsp. enterica serovar Quebec str. S-1267	1243591	leaf	4645312	99	15	1.88815e-21
Salmonella enterica subsp. enterica serovar Wandsworth str. SA20092095	1243595	leaf	4916040	153	109	2.5585e-05
Salmonella enterica subsp. enterica serovar Yovokome str. S-1850	1243600	leaf	4640929	58	3	5.5699e-25
Salmonella enterica subsp. salamae serovar 55:k:z39 str. 1315K	1243602	leaf	5051440	175	87	2.76121e-06
Salmonella enterica subsp. diarizonae serovar 50:k:z str. MZ0080	1243612	leaf	5076950	66	2	0.0
Salmonella enterica subsp. diarizonae serovar 65:c:z str. SA20044251	1243616	leaf	5066092	51	4	0
Salmonella bongori serovar 66:z41:- str. SA19983605	1243617	leaf	4468959	407	44	0
Salmonella enterica subsp. enterica serovar Enteritidis str. EC20110354	1243619	leaf	4711160	20	0	0.0
Salmonella enterica subsp. enterica serovar Enteritidis str. EC20110355	1243620	leaf	4681839	1	1	8.60328e-09
Salmonella enterica subsp. enterica serovar Enteritidis str. EC20110356	1243621	leaf	4682805	6	2	7.57529e-10
Klebsiella pneumoniae CG43	1244085	leaf	5166857	43	10	1.11098e-158
Salmonella enterica subsp. enterica serovar Enteritidis str. EC20110357	1244111	leaf	4678418	3	1	0.0
Salmonella enterica subsp. enterica serovar Enteritidis str. EC20110358	1244112	leaf	4678687	4	0	0
Salmonella enterica subsp. enterica serovar Enteritidis str. EC20110359	1244113	leaf	4711474	1	0	0.0
Salmonella enterica subsp. enterica serovar Enteritidis str. EC20110361	1244119	leaf	4682911	2	2	0.0
Salmonella enterica subsp. enterica serovar Enteritidis str. EC20111095	1244120	leaf	4679953	1	0	0.0
Salmonella enterica subsp. enterica serovar Enteritidis str. EC20111174	1244122	leaf	4683803	1	1	0.0
Escherichia coli O145:H28 str. RM12761	1248903	leaf	5559014	12	0	0
Escherichia coli O145:H28 str. RM13516	1248915	leaf	5559008	12	0	0
Burkholderia ubonensis MSMB22	1249668	leaf	7189071	1	0	0.0
Pelagibaca abyssi	1250539	species	5259072	1	1	0.0
Thioalkalivibrio nitratireducens DSM 14787	1255043	leaf	4002350	1	0	0.0
Citrobacter amalonaticus Y19	1261127	leaf	5875351	24	11	8.34808e-246
Yersinia enterocolitica (type O:5) str. YE53/03	1262462	leaf	4940199	1	0	0.0
Edwardsiella piscicida	1263550	species	3857040	1	0	0.0
Frischella perrara	1267021	species	2692351	4	1	0.0
Cupriavidus gilardii CR3	1267562	leaf	5578743	1	1	0.0
Salmonella enterica subsp. enterica serovar Javiana str. CFSAN001992	1267753	leaf	4675267	57	15	4.87453e-06
Altererythrobacter atlanticus	1267766	species	3475106	1	1	0.0
Salmonella enterica subsp. enterica serovar Typhimurium var. 5- str. CFSAN001921	1271862	leaf	5089224	129	22	9.13561e-07
Salmonella enterica subsp. enterica serovar Cubana str. CFSAN002050	1271863	leaf	5267011	210	45	1.59494e-05
Escherichia coli APEC O78	1274814	leaf	4798435	189	10	9.6604e-06
Pseudomonas sp. URMO17WK12:I11	1283291	species	11209782	1	1	0.0
Azotobacter vinelandii CA	1283330	leaf	5366370	2	0	0.0
Azotobacter vinelandii CA6	1283331	leaf	5323210	2	0	0.0
Klebsiella pneumoniae UHKPC33	1284802	leaf	5663117	12	3	0.0
Raoultella ornithinolytica B6	1286170	leaf	5398151	10	0	0.0
Enterococcus faecalis DENG1	1287066	leaf	2961043	1	1	0.0
Melittangium boletus DSM 14713	1294270	leaf	9910441	1	0	0.0
Enterobacter hormaechei subsp. xiangfangensis	1296536	subspecies	20054814	15	0	0.0
Salmonella enterica subsp. enterica serovar Heidelberg str. CFSAN002064	1299044	leaf	4821559	4	0	0.0
Kosakonia cowanii JCM 10956 = DSM 18146	1300165	leaf	4857324	79	58	0
Alteromonas mediterranea UM7	1300258	leaf	4931660	1	0	0.0
Dokdonella koreensis DS-123	1300342	leaf	4446619	1	0	0.0
Isoptericola dokdonensis DS-3	1300344	leaf	3826972	1	1	0.0
Rhizobium sp. IE4771	1301032	species	7057405	1	0	0.0
Pasteurella multocida subsp. multocida OH4807	1304873	leaf	2079121	1	1	0.0
Klebsiella pneumoniae 500_1420	1304922	leaf	5547643	6	6	0.0
Dickeya dianthicola RNS04.9	1306405	leaf	4720132	1	0	0.0
Salinispira pacifica	1307761	species	3782798	1	1	0.0
Salinivirga cyanobacteriivorans	1307839	species	4812386	1	1	0.0
Klebsiella michiganensis HKOPL1	1308980	leaf	5914407	16	2	0.0
Ralstonia pseudosolanacearum	1310165	species	11622205	3	1	0.0
Escherichia coli ACN001	1311757	leaf	4936576	13	1	1.19554e-319
Pseudoalteromonas translucida KMM 520	1315283	leaf	4147593	1	1	0.0
Idiomarina loihiensis GSL 199	1321370	leaf	2839759	1	0	0.0
Escherichia coli ATCC 25922	1322345	leaf	5203440	1	0	0.0
Acinetobacter equi	1324350	species	3054269	1	0	0.0
Pseudomonas syringae pv. syringae B301D	1324931	leaf	6094819	1	0	0.0
Serratia sp. FS14	1327989	species	5249875	3	0	0.0
Klebsiella pneumoniae subsp. pneumoniae KPNIH27	1328324	leaf	6132443	39	9	1.27981e-06
Klebsiella pneumoniae subsp. pneumoniae KPR0928	1328325	leaf	5436785	1	0	0.0
Escherichia coli O157:H7 str. SS17	1328859	leaf	5655941	4	2	0.0
Escherichia coli APEC IMT5155	1329907	leaf	5126057	35	34	0
Escherichia coli O157:H7 str. SS52	1330457	leaf	5583430	1	0	0.0
Lelliottia	1330545	genus	0	3	0	0.0
Pluralibacter	1330546	genus	4814049	7	0	0.0
Kosakonia	1330547	genus	5293934	3	0	0.0
Citrobacter freundii CFNIH1	1333848	leaf	5371331	86	0	1.41207e-75
Enterobacter hormaechei subsp. hoffmannii ECR091	1333849	leaf	4959888	6	0	5.30222e-243
Enterobacter hormaechei subsp. hoffmannii ECNIH3	1333851	leaf	5061388	2	0	0.0
Klebsiella oxytoca KONIH1	1333852	leaf	6684898	13	0	1.40392e-181
[Enterobacter] lignolyticus	1334193	species	4814049	23	5	0
Frischella	1335631	genus	0	2	0	0.0
Escherichia coli LY180	1335916	leaf	4835601	1	1	0.0
Serratia liquefaciens ATCC 27592	1346614	leaf	5282719	1	0	0.0
Bacillus megaterium NBRC 15308 = ATCC 14581	1348623	leaf	5746640	1	1	0.0
Serratia plymuthica S13	1348660	leaf	5467306	1	0	0.0
Enterobacter cloacae P101	1354030	leaf	5369929	4	0	0.0
Aeromonas hydrophila 4AK4	1354302	leaf	4527993	1	1	0.0
Xenorhabdus poinarii G6	1354304	leaf	3659523	5	2	0.0
Escherichia coli JJ1886	1355100	leaf	5308284	1	1	0.0
Bradyrhizobium diazoefficiens	1355477	species	18211892	3	0	0.0
Pseudomonas syringae CC1557	1357279	leaf	5811653	1	0	0.0
Enterobacteria phage fiAA91-ss	1357825	species	33628	19	0	8.76819e-202
Escherichia coli PCN061	1358422	leaf	4901825	8189	1414	6.11984e-241
Klebsiella pneumoniae KP-1	1365186	leaf	5375667	76	12	1.90199e-06
Klebsiella pneumoniae JM45	1380908	leaf	5603174	12	10	3.78703e-06
Salmonella bongori serovar 48:z41:-- str. RKS3044	1382510	leaf	4394500	506	19	0
Salmonella enterica subsp. arizonae serovar 62:z36:- str. RKS2983	1386967	leaf	4574846	89	12	0.0
Sphingomonas sp. LK11	1390395	species	3938206	1	1	0.0
Klebsiella pneumoniae subsp. pneumoniae 1158	1392499	leaf	5341039	14	4	1.05855e-20
Klebsiella pneumoniae HK787	1392500	leaf	5329385	14	2	1.49163e-161
Xylella fastidiosa MUL0034	1401256	leaf	2666577	1	1	0.0
Escherichia coli APEC O18	1401688	leaf	5006568	3	0	0
Sulfitobacter pseudonitzschiae	1402135	species	5121602	1	1	0.0
Klebsiella pneumoniae subsp. pneumoniae PittNDM01	1406314	leaf	5812304	3	0	0.0
Salmonella enterica subsp. enterica serovar Agona str. 24249	1406860	leaf	4762840	78	1	8.06945e-23
Shigella phage SfIV	1407493	species	39758	567	2	0.00405583
Pseudomonas aeruginosa LES431	1408272	leaf	6550070	1	0	0.0
Salmonella enterica subsp. enterica serovar Cerro str. CFSAN001588	1410916	leaf	4768236	112	21	9.19775e-06
Celeribacter manganoxidans	1411902	species	3956796	1	0	0.0
Salmonella enterica subsp. enterica serovar Enteritidis str. SA19992322	1412452	leaf	4685849	2	1	0.0
Salmonella enterica subsp. enterica serovar Enteritidis str. EC20090641	1412453	leaf	4712309	20	0	0.0
Salmonella enterica subsp. enterica serovar Enteritidis str. EC20090698	1412454	leaf	4680996	2	0	0.0
Salmonella enterica subsp. enterica serovar Enteritidis str. EC20120005	1412468	leaf	4679291	1	0	0.0
Salmonella enterica subsp. enterica serovar Enteritidis str. EC20120008	1412470	leaf	4711924	2	1	0.0
Salmonella enterica subsp. enterica serovar Enteritidis str. SA19981522	1412485	leaf	4685848	1	1	0.0
Salmonella enterica subsp. enterica serovar Enteritidis str. SA19981857	1412486	leaf	4685848	1	0	0.0
Salmonella enterica subsp. enterica serovar Enteritidis str. SA20082034	1412488	leaf	4685659	1	1	0.0
Salmonella enterica subsp. enterica serovar Enteritidis str. EC20120200	1412529	leaf	4685848	1	0	0.0
Salmonella enterica subsp. enterica serovar Enteritidis str. EC20121175	1412592	leaf	4679953	1	0	0.0
Paenibacillus polymyxa SQR-21	1413214	leaf	5828436	1	0	0.0
Candidatus Walczuchella monophlebidarum	1415657	species	309299	1	1	0.0
Oceanisphaera profunda	1416627	species	3508860	1	0	0.0
Klebsiella pneumoniae 30660/NJST258_1	1420012	leaf	5540936	1	1	0.0
Klebsiella pneumoniae 30684/NJST258_2	1420013	leaf	5417216	1	0	0.0
Pseudomonas protegens Cab57	1420599	leaf	6827892	1	0	0.0
Enterobacter asburiae L1	1421338	leaf	4561905	4	0	0.0
Dickeya zeae EC1	1427366	leaf	4532364	3	0	0.0
Rhizobium etli bv. phaseoli str. IE4803	1432049	leaf	6997434	1	0	0.0
Methylocaldum marinum	1432792	species	6088916	2	1	0.0
Methanosarcina barkeri str. Wiesmoor	1434109	leaf	4907186	1	0	0.0
Vibrio tritonius	1435069	species	5221926	1	1	0.0
Pasteurella multocida subsp. multocida str. HN07	1436299	leaf	2325026	1	0	0.0
Xenorhabdus nematophila AN6/1	1437823	leaf	4586662	4	0	0.0
Castellaniella defragrans 65Phen	1437824	leaf	3952818	1	0	0.0
Escherichia albertii KF1	1440052	leaf	4701875	168	2	6.43369e-06
Nitrospirillum amazonense CBAmc	1441467	leaf	7382386	1	1	0.0
Escherichia coli str. Sanji	1441627	leaf	5428586	14	0	0
Chania multitudinisentens RB-25	1441930	leaf	5488183	3	2	0.0
Yersinia enterocolitica LC20	1443113	leaf	4850874	2	1	0.0
Gynuella sunshinyii	1445505	species	6475959	1	0	0.0
Gynuella sunshinyii YC6258	1445510	leaf	6475959	1	0	0.0
Escherichia coli O169:H41	1446701	leaf	10379449	53	0	9.10894e-273
Escherichia coli O25:NM	1446707	leaf	5042926	4	0	0
Escherichia coli O6:H16	1446746	leaf	15266711	23	2	3.55256e-188
Hafnia alvei FB1	1453496	leaf	4712721	3	1	0.0
Yersinia frederiksenii Y225	1454377	leaf	4550894	3	0	0.0
Salmonella enterica subsp. enterica serovar Anatum str. USDA-ARS-USMARC-1783	1454583	leaf	4804699	35	35	0.0
Salmonella enterica subsp. enterica serovar Anatum str. USDA-ARS-USMARC-1727	1454584	leaf	4980540	684	49	8.18347e-14
Salmonella enterica subsp. enterica serovar Anatum str. USDA-ARS-USMARC-1735	1454585	leaf	4945533	135	1	4.33537e-83
Salmonella enterica subsp. enterica serovar Anatum str. USDA-ARS-USMARC-1736	1454586	leaf	4864598	133	6	1.77561e-82
Salmonella enterica subsp. enterica serovar Anatum str. USDA-ARS-USMARC-1676	1454587	leaf	4676958	1308	8	2.38967e-05
Salmonella enterica subsp. enterica serovar Anatum str. USDA-ARS-USMARC-1677	1454588	leaf	4836393	30	1	4.92459e-06
Salmonella enterica subsp. enterica serovar Anatum str. USDA-ARS-USMARC-1728	1454589	leaf	4783492	40	4	0
Salmonella enterica subsp. enterica serovar Anatum str. USDA-ARS-USMARC-1175	1454590	leaf	4731596	24	19	1.22506e-20
Salmonella enterica subsp. enterica serovar Anatum str. CDC 06-0532	1454592	leaf	4667713	1	0	2.65654e-06
Salmonella enterica subsp. enterica serovar Anatum str. USDA-ARS-USMARC-1765	1454593	leaf	4954715	698	10	1.34801e-15
Salmonella enterica subsp. enterica serovar Anatum str. USDA-ARS-USMARC-1766	1454594	leaf	4751034	10	10	0.0
Salmonella enterica subsp. enterica serovar Anatum str. USDA-ARS-USMARC-1781	1454596	leaf	4635697	1	0	0.0
Salmonella enterica subsp. enterica serovar Montevideo str. USDA-ARS-USMARC-1901	1454598	leaf	4587202	10	2	0.0
Salmonella enterica subsp. enterica serovar Montevideo str. USDA-ARS-USMARC-1903	1454603	leaf	4565462	308	15	3.33717e-06
Salmonella enterica subsp. enterica serovar Montevideo str. CDC 07-0954	1454607	leaf	4773383	6	3	0
Salmonella enterica subsp. enterica serovar Montevideo str. CDC 08-1942	1454608	leaf	4700953	8	0	0
Salmonella enterica subsp. enterica serovar Montevideo str. CDC 2009K-0792	1454609	leaf	4597370	1	0	0.0
Salmonella enterica subsp. enterica serovar Montevideo str. CDC 2011K-1674	1454610	leaf	4693862	6	2	0
Salmonella enterica subsp. enterica serovar Montevideo str. CDC 2012K-1544	1454611	leaf	4726140	3	0	0.0
Salmonella enterica subsp. enterica serovar Montevideo str. CDC 2013K-0218	1454612	leaf	4655223	32	25	9.98879e-07
Salmonella enterica subsp. enterica serovar Montevideo str. CDC 2010K-0257	1454613	leaf	4814175	47	27	1.88835e-15
Salmonella enterica subsp. enterica serovar Newport str. USDA-ARS-USMARC-1927	1454620	leaf	4695514	62	23	1.72518e-14
Salmonella enterica subsp. enterica serovar Newport str. CDC 2010K-2159	1454627	leaf	4790388	79	58	6.03774e-06
Salmonella enterica subsp. enterica serovar Typhimurium str. USDA-ARS-USMARC-1808	1454630	leaf	5030908	27	0	0.0
Salmonella enterica subsp. enterica serovar Typhimurium str. USDA-ARS-USMARC-1880	1454634	leaf	4815208	95	56	1.60939e-06
Salmonella enterica subsp. enterica serovar Typhimurium str. USDA-ARS-USMARC-1896	1454636	leaf	5003736	474	275	1.83988e-06
Salmonella enterica subsp. enterica serovar Typhimurium str. USDA-ARS-USMARC-1898	1454638	leaf	5010079	87	38	1.53712e-241
Salmonella enterica subsp. enterica serovar Typhimurium str. USDA-ARS-USMARC-1899	1454639	leaf	4856438	47	46	7.81895e-06
Salmonella enterica subsp. enterica serovar Typhimurium str. CDC H2662	1454640	leaf	4978429	95	68	0.0
Salmonella enterica subsp. enterica serovar Typhimurium str. CDC 2010K-1587	1454641	leaf	5016195	97	2	9.26883e-07
Salmonella enterica subsp. enterica serovar Typhimurium str. CDC 2011K-0870	1454642	leaf	4769471	85	48	2.32594e-22
Salmonella enterica subsp. enterica serovar Typhimurium str. CDC 2011K-1702	1454643	leaf	5000337	30	3	0.0
Salmonella enterica subsp. enterica serovar Typhimurium str. CDC 2009K-1640	1454644	leaf	5027726	57	6	1.88569e-20
Salmonella enterica subsp. enterica serovar Typhimurium str. CDC 2009K-2059	1454645	leaf	4823793	34	0	0.0
Salmonella enterica subsp. enterica serovar Typhimurium str. USDA-ARS-USMARC-1810	1454647	leaf	4927145	2226	459	0.000451914
Comamonadaceae bacterium A1	1458425	species	2574013	1	0	0.0
Klebsiella quasipneumoniae subsp. similipneumoniae	1463164	subspecies	5514898	48	0	3.11904e-156
Klebsiella quasipneumoniae	1463165	species	5528721	1086	15	1.94234e-88
Pantoea sp. PSNIH2	1484157	species	4967343	9	0	0
Pantoea sp. PSNIH1	1484158	species	4410683	3	1	0.0
Paracoccus mutanolyticus	1499308	species	3592357	2	0	0.0
Chromobacteriaceae	1499392	family	3960204	1	0	0.0
Escherichia marmotae	1499973	species	4896291	26	1	0
Burkholderia stagnalis	1503054	species	7583807	3	2	0.0
Halomonas sp. KO116	1504981	species	5168360	1	1	0.0
Lacimicrobium alkaliphilum	1526571	species	4378835	1	0	0.0
Pseudomonas sp. DR 5-09	1534110	species	6427864	1	0	0.0
Treponema sp. OMZ 838	1539298	species	2708067	1	0	0.0
Woeseia oceani	1548547	species	4059891	1	0	0.0
Sphingomonas taxi	1549858	species	4061902	1	1	0.0
Blastomonas fulva	1550728	species	4123210	1	0	0.0
Enterobacter sp. E20	1560339	species	4763114	3	0	1.70806e-240
Kangiella profundi	1561924	species	2653010	1	0	0.0
Citrobacter pasteurii	1563222	species	4654874	22	0	1.31577e-223
Rhodococcus sp. B7740	1564114	species	5341557	1	1	0.0
Edwardsiella sp. EA181011	1578828	species	3934167	2	1	0.0
Halocynthiibacter arcticus	1579316	species	4376120	1	0	0.0
Lentzea guizhouensis	1586287	species	9997872	1	1	0.0
Tessaracoccus flavus	1610493	species	3222890	1	0	0.0
Paenibacillus bovis	1616788	species	5517199	1	1	0.0
Erwinia gerundensis	1619313	species	4481256	18	3	0.0
Candidatus Nitrosoglobus terrae	1630141	species	2018309	3	0	0.0
Aeromonas sp. ASNIH2	1636607	species	4864532	2	2	0.0
Aeromonas sp. ASNIH4	1636609	species	5480196	1	0	0.0
Burkholderia sp. NRF60-BP8	1637853	species	7079943	1	0	0.0
Devosia sp. H5989	1643450	species	4594249	1	1	0.0
Salmonella phage SEN22	1647458	species	41338	1	0	0.0
Salmonella phage SEN34	1647463	species	40740	6	0	0
Erythrobacter atlanticus	1648404	species	3226359	1	0	0.0
Escherichia phage pro147	1649239	species	32675	14	0	2.97804e-211
Escherichia phage pro483	1649240	species	29237	14	0	1.13635e-188
Edwardsiella sp. LADL05-105	1650654	species	4142037	5	0	0
Mitsuaria sp. 7	1658665	species	6085092	1	1	0.0
Arsenicicoccus sp. oral taxon 190	1658671	species	3525271	1	1	0.0
Methylophilus sp. TWE2	1662285	species	3079044	1	1	0.0
Magnetospirillum sp. XM-1	1663591	species	4992477	1	1	0.0
Klebsiella quasipneumoniae subsp. quasipneumoniae	1667327	subspecies	5542544	43	2	2.20699e-161
Sulfurifustis variabilis	1675686	species	3958814	1	1	0.0
Hungateiclostridium saccincola	1677857	species	3604547	1	0	0.0
Caulobacter flavus	1679497	species	5659202	1	0	0.0
Herbinix luporum	1679721	species	2609352	1	1	0.0
Enterobacter sp. FY-07	1692238	species	5138701	46	27	2.74319e-05
Oblitimonas alkaliphila	1697053	species	14141857	1	1	0.0
Citrobacter sp. FDAARGOS_156	1702170	species	4727498	19	2	1.50868e-222
Negativicoccus massiliensis	1702287	species	1360589	1	1	0.0
Citrobacter sp. CRE-46	1703250	species	6081860	70	9	2.99095e-248
Methylovulum psychrotolerans	1704499	species	4923400	1	0	0.0
Burkholderia sp. IDO3	1705310	species	8003806	1	0	4.07235e-14
Massilia sp. WG5	1707785	species	6216151	1	0	0.0
Salmonella enterica subsp. salamae serovar 57:z29:z42	1710356	leaf	4719375	188	32	1.31687e-05
Psychrobacter sp. AntiMn-1	1720344	species	3138120	1	1	0.0
Burkholderia sp. Bp7605	1740163	species	5705688	1	0	0.0
Phytobacter sp. SCO41	1756993	species	5599325	27	0	0.0
Achromobacter sp. AONIH1	1758194	species	6648943	1	0	0.0
Serratia sp. SSNIH1	1758196	species	5388594	11	0	0
Serinicoccus sp. JLT9	1758689	species	3597394	1	1	0.0
Serratia sp. YD25	1759437	species	5117644	2	1	0.0
Isosphaeraceae	1763524	family	7642495	1	0	0.0
Thalassotalea crassostreae	1763536	species	3861670	1	1	0.0
Microbulbifer aggregans	1769779	species	3864326	1	1	0.0
Salinicola tamaricis	1771309	species	4276240	1	0	0.0
Candidatus Hoaglandella endobia	1778263	species	636713	1	0	0.0
Candidatus Mikella endobia	1778264	species	352837	1	0	0.0
Dickeya fangzhongdai	1778540	species	10011670	4	0	0.0
Pseudomonas versuta	1788301	species	5149788	1	0	0.0
Bosea sp. PAMC 26642	1792307	species	5510355	1	1	0.0
Muribaculum intestinale	1796646	species	3306457	1	1	0.0
Rahnella sp. ERMR1:05	1805933	species	5530672	4	2	0.0
Immundisolibacter cernigliae	1810504	species	3243537	1	0	0.0
Enterobacter roggenkampii	1812935	species	10176893	22	2	0.0
Salmonella phage 118970_sal3	1813771	species	77375	3444	1	3.2081e-13
Shigella sp. PAMC 28760	1813821	species	4558287	17	0	0
Colwellia sp. PAMC 21821	1816219	species	4884300	1	0	0.0
Synechococcus sp. NIES-970	1827144	species	3123859	1	1	0.0
Enterobacter sp. ODB01	1827481	species	4534036	18	0	9.18667e-235
secondary endosymbiont of Trabutina mannipara	1835721	species	298471	2	2	0.0
Yersinia sp. FDAARGOS_228	1839800	species	4963041	2	0	0.0
Gordonibacter massiliensis	1841863	species	3948172	1	0	0.0
Blastomonas sp. RAC04	1842535	species	4403499	1	0	0.0
Bosea sp. RAC05	1842539	species	5620120	1	1	0.0
Hafnia sp. CBA7124	1848580	species	4585298	4	0	0.0
Arcobacter sp. LPB0137	1850254	species	2866429	1	0	0.0
Pseudomonas silesiensis	1853130	species	6823539	4	1	0.0
Luteitalea pratensis	1855912	species	7480314	1	1	0.0
Sphingopyxis sp. MG	1866325	species	4222860	1	1	0.0
Enterobacter sp. HK169	1868135	species	4551186	6	0	1.14323e-233
Acinetobacter defluvii	1871111	species	3812088	2	0	0.0
Marinobacter salinus	1874317	species	4121005	1	1	0.0
Buchnera aphidicola (Cinara confinis)	1878935	leaf	451961	1	0	0.0
Candidatus Fukatsuia symbiotica	1878942	species	3131594	3	2	0.0
Pseudomonas sp. TMW 2.1634	1886807	species	5666948	2	1	0.0
Pantoea alhagi	1891675	species	4316301	5	3	0.0
Amycolatopsis sp. AA4	1896961	species	9172799	1	1	0.0
Halomonas aestuarii	1897729	species	3543891	1	1	0.0
Rhodocyclaceae bacterium	1898103	species	3192379	1	1	0.0
Erwiniaceae	1903409	family	1800752	2	0	0.0
Pectobacteriaceae	1903410	family	5483315	1	0	0.0
Yersiniaceae	1903411	family	5752198	9	0	0.0
Morganellaceae	1903414	family	5691351	204	0	0.0
Oceanisphaera avium	1903694	species	2902896	2	0	0.0
Klebsiella sp. LTGPAF-6F	1905288	species	6790399	18	0	8.97433e-183
Pectobacterium parmentieri	1905730	species	5063892	14	0	0.0
Candidatus Hoaglandella	1906659	genus	0	1	0	0.0
Hyphomonas sp. Mor2	1906738	species	3628091	1	1	0.0
Lelliottia jeotgali	1907578	species	4603334	22	9	0
Salmonella enterica subsp. enterica serovar Hayindogo	1911681	leaf	4765719	2	1	0.0
Enterobacter sp. SA187	1914861	species	4429597	11	5	0.0
Enterobacter cloacae complex sp. ECNIH7	1915310	species	5388828	12	1	4.29527e-247
Enterobacteriaceae bacterium ENNIH2	1920109	species	6262406	100	3	1.06211e-55
Citrobacter sp. CFNIH10	1920110	species	5738233	103	4	1.97309e-205
Leclercia sp. LSNIH1	1920114	species	5411940	33	6	0
Leclercia sp. LSNIH3	1920116	species	5389886	60	0	0
Enterobacteriaceae bacterium ENNIH3	1920128	species	6079128	75	4	1.6613e-06
Delftia sp. HK171	1920191	species	6430384	1	0	0.0
Candidatus Erwinia sp. ErCipseudotaxifoliae	1922217	species	1094672	1	0	0.0
Erythrobacter sp. Alg231-14	1922225	species	3137103	1	0	0.0
Sodalis endosymbiont of Henestaris halophilus	1929246	species	1622395	2	2	0.0
Klebsiella sp. M5al	1934254	species	5800138	11	0	0.0
Sphingomonas sp. LM7	1938607	species	4155514	1	1	0.0
Escherichia coli APEC O2-211	1954351	leaf	5318341	38	0	0
Colwellia beringensis	1967665	species	4661274	1	0	0.0
Phytobacter ursingii	1972431	species	6166452	130	36	7.12149e-05
Leptolyngbya boryana NIES-2135	1973484	leaf	7233668	1	1	0.0
Enterobacter sp. Crenshaw	1977566	species	4630785	4	0	0.0
Cellvibrio sp. PSBB006	1987723	species	5257074	1	1	0.0
Acinetobacter sp. WCHA55	2004646	species	3967361	1	1	0.0
Stenotrophomonas sp. WZN-1	2005046	species	4512703	1	0	0.0
Tannerellaceae	2005525	family	3740210	1	0	0.0
Sterolibacteriaceae	2008793	family	3802648	1	0	0.0
Sagittula sp. P11	2009329	species	5576178	1	1	0.0
Citrobacter sp. 86	2013114	species	5048670	61	2	4.33564e-230
Pseudomonas sp. FDAARGOS_380	2018067	species	6499364	1	1	0.0
Shewanella bicestrii	2018305	species	5004414	16	0	0
Citrobacter sp. 92	2019568	species	5109913	40	0	2.98339e-231
Plantactinospora sp. KBS50	2024580	species	6689726	1	1	0.0
Herbaspirillum sp. meg3	2025949	species	5465798	1	0	0.0
Klebsiella quasivariicola	2026240	species	5946706	859	15	2.23147e-79
Providencia sp. WCHPr000369	2027290	species	4799915	6	0	0.0
Enterobacter cloacae complex sp.	2027919	species	10167193	90	3	0
Serratia sp. MYb239	2033438	species	4986519	2	0	0.0
Actinoplanes sp. SE50	2033844	species	9239482	1	0	0.0
Dickeya sp. Secpp 1600	2037915	species	5108113	1	0	0.0
Nostoc flagelliforme CCNUN1	2038116	leaf	10231233	1	0	0.0
Pectobacterium polaris	2042057	species	9835240	3	1	0.0
Nocardioides sp. 78	2045452	species	3840802	1	0	0.0
Escherichia coli O114:H49	2048775	leaf	5145656	2	0	0
Escherichia coli O128:H27	2048776	leaf	5130625	56	3	3.72745e-191
Escherichia coli O15:H11	2048777	leaf	5181145	1	0	0
Escherichia coli O178:H19	2048778	leaf	5307783	6	0	0.0
Enterobacter sp. CRENT-193	2051905	species	5196641	56	0	4.47233e-230
Dietzia sp. JS16-p6b	2052657	species	3720309	1	1	0.0
Enterobacteriaceae bacterium S05	2052938	species	5157054	370	0	2.13157e-231
Idiomarina sp. X4	2055892	species	2616716	2	0	0.0
Spirosoma pollinicola	2057025	species	8794837	1	1	0.0
Enterococcus sp. CR-Ec1	2057791	species	3889849	1	0	0.0
Planococcus sp. MB-3u-03	2058136	species	3614431	1	1	0.0
Enterococcus sp. FDAARGOS_375	2060307	species	3549293	1	0	0.0
Paracoccus sp. CBA4604	2065379	species	3299166	1	1	0.0
Citrobacter freundii complex sp. CFNIH2	2066049	species	5340584	57	5	7.81161e-232
Enterobacteriaceae bacterium ENNIH1	2066051	species	5666332	24	1	0.0
Pseudomonas sp. NC02	2067572	species	6890566	1	1	0.0
Azoarcus sp. SY39	2067960	species	3225512	1	0	0.0
Clostridium sp. JN500901	2068654	species	2819963	1	0	0.0
Pseudomonas sp. XWY-1	2069256	species	6297253	1	0	0.0
Enterobacter cloacae complex sp. FDA-CDC-AR_0164	2077136	species	4849791	7	0	0.0
Enterobacter cloacae complex sp. FDA-CDC-AR_0132	2077137	species	4971441	3	0	0.0
Citrobacter freundii complex sp. CFNIH3	2077147	species	5634842	37	1	6.80496e-234
Citrobacter freundii complex sp. CFNIH4	2077148	species	5629494	22	0	1.72858e-240
Citrobacter freundii complex sp. CFNIH9	2077149	species	5688355	39	0	8.50082e-242
Idiomarina sp. OT37-5b	2100422	species	2893517	2	0	0.0
Mixta	2100764	genus	0	50	0	0.0
Plantactinospora sp. BC1	2108470	species	8333965	1	1	0.0
Melaminivora sp. SC2-9	2109913	species	3754020	12	0	0.0
Lelliottia sp. WB101	2153385	species	4734070	16	6	0.0
Saccharospirillum mangrovi	2161747	species	3686911	2	0	0.0
Gammaproteobacteria bacterium DM2	2169539	species	5112152	2	1	0.0
Methyloceanibacter sp. wino2	2170729	species	3209973	1	1	0.0
Catenovulum sp. CCB-QB4	2172099	species	5871129	1	0	0.0
Limnobaculum	2172100	genus	0	1	0	0.0
Limnobaculum parvum	2172103	species	3841771	4	2	0.0
Methylobacterium sp. 17Sr1-1	2202826	species	6542583	1	0	0.0
Pseudomonas sp. R2A2	2213057	species	4559447	1	0	0.0
Nocardia sp. Y48	2213200	species	7310115	1	1	0.0
Planococcus sp. Y42	2213202	species	4149733	1	1	0.0
Photorhabdus laumondii	2218628	species	11301093	7	0	0.0
Sphingomonas sp. FARSPH	2219696	species	3761538	1	1	0.0
Raoultella sp. X13	2259647	species	5448479	16	0	0.0
Enterobacteriaceae bacterium w17	2282309	species	5125645	63	2	0
Enterobacteriaceae bacterium w6	2282310	species	4945486	30	1	0.0
Achromobacter sp. B7	2282475	species	6236552	1	0	0.0
Gallaecimonas sp. HK-28	2291597	species	4071977	1	1	0.0
Chryseolinea sp. KIS68-18	2321403	species	8241389	1	0	0.0
Serratia sp. 3ACOL1	2448483	species	5876609	7	0	0.0
Buttiauxella sp. 3AFRM03	2479367	species	5498356	17	16	0.0
Pseudomonas sp. LTGT-11-2Z	2479393	species	6073276	1	0	0.0
Vibrio sp. HBUAS61001	2479546	species	4009379	1	0	0.0
Serratia sp. LS-1	2485839	species	5129267	1	0	0.0
