# KrakenUniq v0.5.7 DATE:2019-04-15T15:11:57Z DB:/home/biouser/SAM/DBDIR/LIBRARY_MINIKRAKEN/minikraken_20171019_8GB DB_SIZE:8053064728 WD:/home/biouser/SAM
# CL:perl /home/biouser/miniconda3/bin/krakenuniq --db /home/biouser/SAM/DBDIR/LIBRARY_MINIKRAKEN/minikraken_20171019_8GB -paired /home/biouser/SAM/data/1-SAT_S1_mixed_with_25%_7-GC_S7_R1.fastq.gz /home/biouser/SAM/data/1-SAT_S1_mixed_with_25%_7-GC_S7_R2.fastq.gz --report-file /home/biouser/SAM/data/1-SAT_S1_mixed_with_25%_7-GC_S7.krakenuniq.report.tsv

%	reads	taxReads	kmers	dup	cov	taxID	rank	taxName
0.4272	6254	6254	18643163	23	2.172	0	no rank	unclassified
99.57	1457570	1564	328324	60.6	0.0004956	1	no rank	root
99.47	1456004	3	327253	60.6	0.0005009	131567	no rank	  cellular organisms
99.47	1456001	1703	327253	60.6	0.0005182	2	superkingdom	    Bacteria
99.31	1453678	2597	326452	60.4	0.001027	1224	phylum	      Proteobacteria
74.57	1091597	1072	225127	66.7	0.001473	1236	class	        Gammaproteobacteria
74.5	1090496	3782	223727	66.7	0.005324	91347	order	          Enterobacterales
74.24	1086690	25214	218420	66.5	0.01049	543	family	            Enterobacteriaceae
72.5	1061331	12751	194939	66.8	0.09495	590	genus	              Salmonella
71.63	1048572	569741	179230	66.5	0.09979	28901	species	                Salmonella enterica
32.66	478116	213668	32905	62.2	0.0437	59201	subspecies	                  Salmonella enterica subsp. enterica
17.98	263129	259442	11812	67.7	0.5189	90370	no rank	                    Salmonella enterica subsp. enterica serovar Typhi
0.2517	3685	3685	120	67.7	0.2256	220341	no rank	                      Salmonella enterica subsp. enterica serovar Typhi str. CT18
6.831e-05	1	1	3	1	0.004184	527001	no rank	                      Salmonella enterica subsp. enterica serovar Typhi str. Ty21a
6.831e-05	1	1	1	1	0.02632	1132507	no rank	                      Salmonella enterica subsp. enterica serovar Typhi str. P-stx-12
0.00772	113	88	93	5.45	0.005697	90105	no rank	                    Salmonella enterica subsp. enterica serovar Saintpaul
0.001708	25	25	40	1.1	0.005157	702982	no rank	                      Salmonella enterica subsp. enterica serovar Saintpaul str. SARA26
0.007583	111	0	205	1.13	0.004453	1242085	no rank	                    Salmonella enterica subsp. enterica serovar Macclesfield
0.007583	111	111	205	1.13	0.004453	1242107	no rank	                      Salmonella enterica subsp. enterica serovar Macclesfield str. S-1643
0.006353	93	75	150	1.18	0.005664	90371	no rank	                    Salmonella enterica subsp. enterica serovar Typhimurium
0.0003416	5	5	10	1.2	0.0128	568709	no rank	                      Salmonella enterica subsp. enterica serovar Typhimurium str. DT2
0.0002733	4	4	3	1.33	0.01515	1008297	no rank	                      Salmonella enterica subsp. enterica serovar Typhimurium str. 798
0.0001366	2	2	4	1.25	0.04124	1454647	no rank	                      Salmonella enterica subsp. enterica serovar Typhimurium str. USDA-ARS-USMARC-1810
0.0001366	2	2	5	1	0.007236	568708	no rank	                      Salmonella enterica subsp. enterica serovar Typhimurium str. D23580
6.831e-05	1	1	3	2	0.01145	718274	no rank	                      Salmonella enterica subsp. enterica serovar Typhimurium str. T000240
6.831e-05	1	1	3	1.33	0.008499	1029978	no rank	                      Salmonella enterica subsp. enterica serovar Typhimurium str. SARA13
6.831e-05	1	1	3	1	0.008174	1454639	no rank	                      Salmonella enterica subsp. enterica serovar Typhimurium str. USDA-ARS-USMARC-1899
6.831e-05	1	1	2	1	0.05	1454641	no rank	                      Salmonella enterica subsp. enterica serovar Typhimurium str. CDC 2010K-1587
6.831e-05	1	1	1	1	0.01316	1454636	no rank	                      Salmonella enterica subsp. enterica serovar Typhimurium str. USDA-ARS-USMARC-1896
0.004304	63	39	101	1.24	0.01427	149539	no rank	                    Salmonella enterica subsp. enterica serovar Enteritidis
0.0002049	3	3	3	1.67	0.04	1412594	no rank	                      Salmonella enterica subsp. enterica serovar Enteritidis str. EC20121177
0.0001366	2	2	4	1	0.06897	1412582	no rank	                      Salmonella enterica subsp. enterica serovar Enteritidis str. EC20121970
0.0001366	2	2	2	2	0.04082	1244119	no rank	                      Salmonella enterica subsp. enterica serovar Enteritidis str. EC20110361
0.0001366	2	2	3	1	0.1579	1412514	no rank	                      Salmonella enterica subsp. enterica serovar Enteritidis str. SA20093421
0.0001366	2	2	3	1	0.1429	1412571	no rank	                      Salmonella enterica subsp. enterica serovar Enteritidis str. EC20121812
6.831e-05	1	1	2	1.5	0.01626	1412600	no rank	                      Salmonella enterica subsp. enterica serovar Enteritidis str. EC20100325
6.831e-05	1	1	3	1	0.03125	1244111	no rank	                      Salmonella enterica subsp. enterica serovar Enteritidis str. EC20110357
6.831e-05	1	1	3	1	0.03704	1412580	no rank	                      Salmonella enterica subsp. enterica serovar Enteritidis str. EC20121986
6.831e-05	1	1	2	1	0.06452	1412569	no rank	                      Salmonella enterica subsp. enterica serovar Enteritidis str. EC20120994
6.831e-05	1	1	2	1	0.0339	1412555	no rank	                      Salmonella enterica subsp. enterica serovar Enteritidis str. EC20121765
6.831e-05	1	1	2	1	0.125	1412535	no rank	                      Salmonella enterica subsp. enterica serovar Enteritidis str. EC20111576
6.831e-05	1	1	2	1	0.06667	1412494	no rank	                      Salmonella enterica subsp. enterica serovar Enteritidis str. SA19943269
6.831e-05	1	1	1	1	1	1412523	no rank	                      Salmonella enterica subsp. enterica serovar Enteritidis str. SA20091739
6.831e-05	1	1	1	1	0.01515	1412495	no rank	                      Salmonella enterica subsp. enterica serovar Enteritidis str. SA20123395
6.831e-05	1	1	1	1	0.04	1412493	no rank	                      Salmonella enterica subsp. enterica serovar Enteritidis str. SA19942384
6.831e-05	1	1	1	1	0.01818	1412481	no rank	                      Salmonella enterica subsp. enterica serovar Enteritidis str. SA20100239
6.831e-05	1	1	1	1	0.125	1244122	no rank	                      Salmonella enterica subsp. enterica serovar Enteritidis str. EC20111174
6.831e-05	1	1	1	1	0.003185	926034	no rank	                      Salmonella enterica subsp. enterica serovar Enteritidis str. 77-1427
0.004031	59	59	93	1.25	0.006693	28150	no rank	                    Salmonella enterica subsp. enterica serovar Senftenberg
0.003826	56	55	13	16.4	0.0007456	70803	no rank	                    Salmonella enterica subsp. enterica serovar Minnesota
6.831e-05	1	1	2	1	0.002714	1124956	no rank	                      Salmonella enterica subsp. enterica serovar Minnesota str. ATCC 49284
0.003689	54	43	95	1.14	0.009313	54388	no rank	                    Salmonella enterica subsp. enterica serovar Paratyphi A
0.0004099	6	6	6	1.17	0.009375	941189	no rank	                      Salmonella enterica subsp. enterica serovar Paratyphi A str. ATCC 11511
0.0002049	3	3	4	1	0.04211	295319	no rank	                      Salmonella enterica subsp. enterica serovar Paratyphi A str. ATCC 9150
0.0001366	2	2	2	1	0.01418	554290	no rank	                      Salmonella enterica subsp. enterica serovar Paratyphi A str. AKU_12601
0.002596	38	0	55	1.24	0.004312	1242080	no rank	                    Salmonella enterica subsp. enterica serovar Djakarta
0.002596	38	38	55	1.24	0.004312	1242091	no rank	                      Salmonella enterica subsp. enterica serovar Djakarta str. S-1087
0.002528	37	20	66	1.09	0.002993	108619	no rank	                    Salmonella enterica subsp. enterica serovar Newport
0.0004099	6	6	9	1.22	0.002812	1454627	no rank	                      Salmonella enterica subsp. enterica serovar Newport str. CDC 2010K-2159
0.0002733	4	4	6	1.33	0.005464	1454620	no rank	                      Salmonella enterica subsp. enterica serovar Newport str. USDA-ARS-USMARC-1927
0.0002049	3	3	7	1	0.003091	930778	no rank	                      Salmonella enterica subsp. enterica serovar Newport str. Levine 1
0.0001366	2	2	2	1	0.001105	930779	no rank	                      Salmonella enterica subsp. enterica serovar Newport str. Levine 15
6.831e-05	1	1	2	1	0.2222	423368	no rank	                      Salmonella enterica subsp. enterica serovar Newport str. SL254
6.831e-05	1	1	2	1	0.01887	796731	no rank	                      Salmonella enterica subsp. enterica serovar Newport str. CVM 21538
0.002254	33	33	58	1.14	0.005119	119912	no rank	                    Salmonella enterica subsp. enterica serovar Choleraesuis
0.002186	32	0	50	1.18	0.005314	1242079	no rank	                    Salmonella enterica subsp. enterica serovar Apapa
0.002186	32	32	50	1.18	0.005314	1242088	no rank	                      Salmonella enterica subsp. enterica serovar Apapa str. SA20060561
0.001844	27	24	52	1.13	0.002953	57743	no rank	                    Salmonella enterica subsp. enterica serovar Weltevreden
0.0002049	3	3	5	1.2	0.00994	1173939	no rank	                      Salmonella enterica subsp. enterica serovar Weltevreden str. 1655
0.001776	26	0	46	1.15	0.004437	189201	no rank	                    Salmonella enterica subsp. enterica serovar Cubana
0.001776	26	26	46	1.15	0.004437	1271863	no rank	                      Salmonella enterica subsp. enterica serovar Cubana str. CFSAN002050
0.001708	25	23	42	1.52	0.005991	1243585	no rank	                    Salmonella enterica subsp. enterica serovar Ouakam
0.0001366	2	2	3	1	0.002076	1243586	no rank	                      Salmonella enterica subsp. enterica serovar Ouakam str. SA20034636
0.00164	24	18	50	1.1	0.01099	98360	no rank	                    Salmonella enterica subsp. enterica serovar Dublin
0.0002049	3	3	4	1.5	0.01717	687860	no rank	                      Salmonella enterica subsp. enterica serovar Dublin str. ATCC 39184
0.0001366	2	2	8	1	0.02332	439851	no rank	                      Salmonella enterica subsp. enterica serovar Dublin str. CT_02021853
6.831e-05	1	1	2	1	0.009569	909945	no rank	                      Salmonella enterica subsp. enterica serovar Dublin str. SD3246
0.00164	24	0	42	1.21	0.003947	1242081	no rank	                    Salmonella enterica subsp. enterica serovar Hillingdon
0.00164	24	24	42	1.21	0.003947	1242096	no rank	                      Salmonella enterica subsp. enterica serovar Hillingdon str. N1529-D3
0.00164	24	0	40	1.07	0.002665	192954	no rank	                    Salmonella enterica subsp. enterica serovar Mbandaka
0.00164	24	24	40	1.07	0.002665	984237	no rank	                      Salmonella enterica subsp. enterica serovar Mbandaka str. ATCC 51958
0.001571	23	23	57	1.09	0.006774	58101	no rank	                    Salmonella enterica subsp. enterica serovar Waycross
0.001503	22	0	46	1.2	0.006271	260368	no rank	                    Salmonella enterica subsp. enterica serovar Bergen
0.001503	22	22	46	1.2	0.006271	1240708	no rank	                      Salmonella enterica subsp. enterica serovar Bergen str. ST350
0.001503	22	0	41	1.15	0.007031	915158	no rank	                    Salmonella enterica subsp. enterica serovar Manchester
0.001503	22	22	41	1.15	0.007031	1242108	no rank	                      Salmonella enterica subsp. enterica serovar Manchester str. ST278
0.001503	22	12	38	1.16	0.002066	58712	no rank	                    Salmonella enterica subsp. enterica serovar Anatum
0.0001366	2	2	4	1.5	0.0008147	1454585	no rank	                      Salmonella enterica subsp. enterica serovar Anatum str. USDA-ARS-USMARC-1735
0.0001366	2	2	3	1	0.02521	1454583	no rank	                      Salmonella enterica subsp. enterica serovar Anatum str. USDA-ARS-USMARC-1783
6.831e-05	1	1	3	1.67	0.004127	1454584	no rank	                      Salmonella enterica subsp. enterica serovar Anatum str. USDA-ARS-USMARC-1727
6.831e-05	1	1	2	1	0.004193	1454596	no rank	                      Salmonella enterica subsp. enterica serovar Anatum str. USDA-ARS-USMARC-1781
6.831e-05	1	1	1	2	0.0008389	1454593	no rank	                      Salmonella enterica subsp. enterica serovar Anatum str. USDA-ARS-USMARC-1765
6.831e-05	1	1	1	1	0.004902	1454590	no rank	                      Salmonella enterica subsp. enterica serovar Anatum str. USDA-ARS-USMARC-1175
6.831e-05	1	1	1	1	0.0007013	1454589	no rank	                      Salmonella enterica subsp. enterica serovar Anatum str. USDA-ARS-USMARC-1728
6.831e-05	1	1	1	1	0.003049	1454586	no rank	                      Salmonella enterica subsp. enterica serovar Anatum str. USDA-ARS-USMARC-1736
0.001503	22	14	37	1.11	0.002192	595	no rank	                    Salmonella enterica subsp. enterica serovar Infantis
0.0005465	8	8	17	1.18	0.001709	596155	no rank	                      Salmonella enterica subsp. enterica serovar Infantis str. SARB27
0.001435	21	0	43	1.19	0.006032	1242084	no rank	                    Salmonella enterica subsp. enterica serovar Krefeld
0.001435	21	21	43	1.19	0.006032	1242106	no rank	                      Salmonella enterica subsp. enterica serovar Krefeld str. SA20030536
0.001435	21	0	42	1.12	0.005502	57045	no rank	                    Salmonella enterica subsp. enterica serovar Paratyphi B
0.0007515	11	11	17	1.24	0.005266	1016998	no rank	                      Salmonella enterica subsp. enterica serovar Paratyphi B str. SPB7
0.0006831	10	10	25	1.04	0.006064	224729	no rank	                      Salmonella enterica subsp. enterica serovar Java
0.001435	21	19	39	1.05	0.009161	594	no rank	                    Salmonella enterica subsp. enterica serovar Gallinarum
6.831e-05	1	1	1	1	0.004292	550538	no rank	                      Salmonella enterica subsp. enterica serovar Gallinarum str. 287/91
6.831e-05	1	1	1	1	0.007692	685040	no rank	                      Salmonella enterica subsp. enterica serovar Gallinarum str. 9184
0.001366	20	20	36	1.03	0.004066	340188	no rank	                    Salmonella enterica subsp. enterica serovar Cerro
0.001161	17	0	32	1.28	0.005218	211968	no rank	                    Salmonella enterica subsp. enterica serovar Albany
0.001161	17	17	32	1.28	0.005218	1173798	no rank	                      Salmonella enterica subsp. enterica serovar Albany str. ATCC 51960
0.001161	17	0	28	1.25	0.004604	363569	no rank	                    Salmonella enterica subsp. enterica serovar Javiana
0.001161	17	17	28	1.25	0.004604	1267753	no rank	                      Salmonella enterica subsp. enterica serovar Javiana str. CFSAN001992
0.001161	17	0	34	1.03	0.01022	57046	no rank	                    Salmonella enterica subsp. enterica serovar Paratyphi C
0.001161	17	17	34	1.03	0.01022	476213	no rank	                      Salmonella enterica subsp. enterica serovar Paratyphi C str. RKS4594
0.001093	16	12	38	1.03	0.00699	115981	no rank	                    Salmonella enterica subsp. enterica serovar Montevideo
0.0002049	3	3	13	1	0.005853	859199	no rank	                      Salmonella enterica subsp. enterica serovar Montevideo str. 507440-20
6.831e-05	1	1	1	1	0.1429	1454606	no rank	                      Salmonella enterica subsp. enterica serovar Montevideo str. USDA-ARS-USMARC-1921
0.001093	16	16	31	1.16	0.004021	143221	no rank	                    Salmonella enterica subsp. enterica serovar Tennessee
0.001093	16	16	32	1.06	0.02822	1129117	no rank	                    Salmonella enterica subsp. enterica serovar Nitra
0.001025	15	0	26	1.31	0.007857	1242078	no rank	                    Salmonella enterica subsp. enterica serovar Antsalova
0.001025	15	15	26	1.31	0.007857	1242087	no rank	                      Salmonella enterica subsp. enterica serovar Antsalova str. S01-0511
0.001025	15	0	27	1.26	0.003239	181798	no rank	                    Salmonella enterica subsp. enterica serovar Sloterdijk
0.001025	15	15	27	1.26	0.003239	938141	no rank	                      Salmonella enterica subsp. enterica serovar Sloterdijk str. ATCC 15791
0.001025	15	0	26	1.27	0.001748	1243583	no rank	                    Salmonella enterica subsp. Enterica serovar Onderstepoort
0.001025	15	15	26	1.27	0.001748	1243584	no rank	                      Salmonella enterica subsp. enterica serovar Onderstepoort str. SA20060086
0.0009564	14	0	24	1.12	0.008084	29482	no rank	                    Salmonella enterica subsp. enterica serovar Abony
0.0009564	14	14	24	1.12	0.008084	1029983	no rank	                      Salmonella enterica subsp. enterica serovar Abony str. 0014
0.0009564	14	0	22	1.14	0.004419	58096	no rank	                    Salmonella enterica subsp. enterica serovar Bareilly
0.0009564	14	14	22	1.14	0.004419	1173427	no rank	                      Salmonella enterica subsp. enterica serovar Bareilly str. CFSAN000189
0.0008198	12	0	22	1.18	0.001855	913074	no rank	                    Salmonella enterica subsp. enterica serovar Inverness
0.0008198	12	12	22	1.18	0.001855	941187	no rank	                      Salmonella enterica subsp. enterica serovar Inverness str. ATCC 10720
0.0007515	11	0	23	1.13	0.003289	913085	no rank	                    Salmonella enterica subsp. enterica serovar Wandsworth
0.0007515	11	11	23	1.13	0.003289	1243595	no rank	                      Salmonella enterica subsp. enterica serovar Wandsworth str. SA20092095
0.0006831	10	10	19	1.16	0.005436	600	no rank	                    Salmonella enterica subsp. enterica serovar Thompson
0.0006148	9	0	19	1.16	0.002629	82689	no rank	                    Salmonella enterica subsp. enterica serovar Muenster
0.0006148	9	9	19	1.16	0.002629	1124958	no rank	                      Salmonella enterica subsp. enterica serovar Muenster str. 0315
0.0005465	8	0	17	1	0.004303	1243590	no rank	                    Salmonella enterica subsp. enterica serovar Quebec
0.0005465	8	8	17	1	0.004303	1243591	no rank	                      Salmonella enterica subsp. enterica serovar Quebec str. S-1267
0.0004782	7	0	14	1.36	0.01923	604	no rank	                    Salmonella enterica subsp. enterica serovar Gallinarum/pullorum
0.0002733	4	4	8	1.38	0.01928	1081093	no rank	                      Salmonella enterica subsp. enterica serovar Gallinarum/pullorum str. RKS5078
0.0002049	3	3	6	1.33	0.02174	1225522	no rank	                      Salmonella enterica subsp. enterica serovar Gallinarum/pullorum str. CDC1983-67
0.0004782	7	0	16	1.19	0.002567	913076	no rank	                    Salmonella enterica subsp. enterica serovar Johannesburg
0.0004782	7	7	16	1.19	0.002567	1242101	no rank	                      Salmonella enterica subsp. enterica serovar Johannesburg str. ST203
0.0004099	6	0	16	1	0.005706	149386	no rank	                    Salmonella enterica subsp. enterica serovar Chester
0.0004099	6	6	16	1	0.005706	941190	no rank	                      Salmonella enterica subsp. enterica serovar Chester str. ATCC 11997
0.0004099	6	3	14	1.14	0.005269	611	no rank	                    Salmonella enterica subsp. enterica serovar Heidelberg
6.831e-05	1	1	3	1	0.01327	1124936	no rank	                      Salmonella enterica subsp. enterica serovar Heidelberg str. 41578
6.831e-05	1	1	1	2	0.005319	454169	no rank	                      Salmonella enterica subsp. enterica serovar Heidelberg str. SL476
6.831e-05	1	1	2	1	0.003802	1160717	no rank	                      Salmonella enterica subsp. enterica serovar Heidelberg str. B182
0.0003416	5	0	5	1.6	0.0004875	598	no rank	                    Salmonella enterica subsp. enterica serovar Rubislaw
0.0003416	5	5	5	1.6	0.0004875	938143	no rank	                      Salmonella enterica subsp. enterica serovar Rubislaw str. ATCC 10717
0.0003416	5	4	8	1	0.005413	605	no rank	                    Salmonella enterica subsp. enterica serovar Pullorum
6.831e-05	1	1	2	1	0.003937	1029979	no rank	                      Salmonella enterica subsp. enterica serovar Pullorum str. ATCC 9120
0.0002733	4	0	13	1.23	0.004115	340190	no rank	                    Salmonella enterica subsp. enterica serovar Schwarzengrund
0.0002733	4	4	13	1.23	0.004115	439843	no rank	                      Salmonella enterica subsp. enterica serovar Schwarzengrund str. CVM19633
0.0002733	4	0	7	1.71	0.007165	28146	no rank	                    Salmonella enterica subsp. enterica serovar Moscow
0.0002733	4	4	7	1.71	0.007165	1243579	no rank	                      Salmonella enterica subsp. enterica serovar Moscow str. S-1843
0.0002733	4	0	7	1.14	0.004162	1151172	no rank	                    Salmonella enterica subsp. enterica serovar Abaetetuba
0.0002733	4	4	7	1.14	0.004162	1208611	no rank	                      Salmonella enterica subsp. enterica serovar Abaetetuba str. ATCC 35640
0.0002733	4	0	7	1	0.004664	134047	no rank	                    Salmonella enterica subsp. enterica serovar Bredeney
0.0002733	4	4	7	1	0.004664	1194154	no rank	                      Salmonella enterica subsp. enterica serovar Bredeney str. CFSAN001080
0.0002733	4	0	7	1	0.0162	1243599	no rank	                    Salmonella enterica subsp. enterica serovar Yovokome
0.0002733	4	4	7	1	0.0162	1243600	no rank	                      Salmonella enterica subsp. enterica serovar Yovokome str. S-1850
0.0002049	3	0	6	1.17	0.02609	29472	no rank	                    Salmonella enterica subsp. enterica serovar Panama
0.0002049	3	3	6	1.17	0.02609	1124961	no rank	                      Salmonella enterica subsp. enterica serovar Panama str. ATCC 7378
0.0001366	2	1	3	1.67	0.002504	58095	no rank	                    Salmonella enterica subsp. enterica serovar Agona
6.831e-05	1	1	1	1	0.01515	1406860	no rank	                      Salmonella enterica subsp. enterica serovar Agona str. 24249
0.0001366	2	0	5	1	0.04	399583	no rank	                    Salmonella enterica subsp. enterica serovar Blegdam
0.0001366	2	2	5	1	0.04	1240694	no rank	                      Salmonella enterica subsp. enterica serovar Blegdam str. S-1824
6.831e-05	1	0	1	2	0.001368	1242083	no rank	                    Salmonella enterica subsp. enterica serovar Koessen
6.831e-05	1	1	1	2	0.001368	1242105	no rank	                      Salmonella enterica subsp. enterica serovar Koessen str. S-1501
0.01824	267	18	567	1.11	0.003337	59202	subspecies	                  Salmonella enterica subsp. salamae
0.009837	144	0	321	1.12	0.003276	1243601	no rank	                    Salmonella enterica subsp. salamae serovar 55:k:z39
0.009837	144	144	321	1.12	0.003276	1243602	no rank	                      Salmonella enterica subsp. salamae serovar 55:k:z39 str. 1315K
0.007173	105	105	210	1.1	0.003156	1710356	no rank	                    Salmonella enterica subsp. salamae serovar 57:z29:z42
0.01182	173	116	362	1.07	0.002475	59203	subspecies	                  Salmonella enterica subsp. arizonae
0.002596	38	0	73	1.07	0.002589	41515	no rank	                    Salmonella enterica subsp. arizonae serovar 62:z36:-
0.002596	38	38	73	1.07	0.002589	1386967	no rank	                      Salmonella enterica subsp. arizonae serovar 62:z36:- str. RKS2983
0.001298	19	19	52	1.08	0.002019	41514	no rank	                    Salmonella enterica subsp. arizonae serovar 62:z4,z23:-
0.01059	155	129	338	1.12	0.00259	59204	subspecies	                  Salmonella enterica subsp. diarizonae
0.001161	17	0	28	1.04	0.00146	1243615	no rank	                    Salmonella enterica subsp. diarizonae serovar 65:c:z
0.001161	17	17	28	1.04	0.00146	1243616	no rank	                      Salmonella enterica subsp. diarizonae serovar 65:c:z str. SA20044251
0.0006148	9	0	17	1.18	0.0007325	1243611	no rank	                    Salmonella enterica subsp. diarizonae serovar 50:k:z
0.0006148	9	9	17	1.18	0.0007325	1243612	no rank	                      Salmonella enterica subsp. diarizonae serovar 50:k:z str. MZ0080
0.008198	120	0	226	1.09	0.002313	59205	subspecies	                  Salmonella enterica subsp. houtenae
0.008198	120	120	226	1.09	0.002313	523831	no rank	                    Salmonella enterica subsp. houtenae str. ATCC BAA-1581
0.0005465	8	7	261	1.15	0.001217	54736	species	                Salmonella bongori
6.831e-05	1	0	27	1.19	0.0009719	41527	no rank	                  Salmonella bongori serovar 48:z41:--
6.831e-05	1	1	27	1.19	0.0009719	1382510	no rank	                    Salmonella bongori serovar 48:z41:-- str. RKS3044
0.005465	80	3	265	1.18	0.0001242	561	genus	              Escherichia
0.005055	74	60	218	1.2	0.0001302	562	species	                Escherichia coli
0.0002049	3	3	1	3	0.000173	83334	no rank	                  Escherichia coli O157:H7
0.0001366	2	2	3	1	0.00282	585057	no rank	                  Escherichia coli IAI39
6.831e-05	1	1	4	1	0.00312	585035	no rank	                  Escherichia coli S88
6.831e-05	1	1	4	1	0.02162	595495	no rank	                  Escherichia coli KO11FL
6.831e-05	1	1	1	2	0.0001717	340184	no rank	                  Escherichia coli B7A
6.831e-05	1	1	1	2	0.0008628	741093	no rank	                  Escherichia coli Xuzhou21
6.831e-05	1	1	2	1	0.001327	655817	no rank	                  Escherichia coli ABU 83972
6.831e-05	1	1	1	2	0.0008969	199310	no rank	                  Escherichia coli CFT073
6.831e-05	1	0	1	1	0.0003799	498388	no rank	                  Escherichia coli C
6.831e-05	1	1	1	1	0.0003855	481805	no rank	                    Escherichia coli ATCC 8739
6.831e-05	1	0	1	1	0.0001814	1603259	no rank	                  Escherichia coli O139:H28
6.831e-05	1	1	1	1	0.0001814	331111	no rank	                    Escherichia coli O139:H28 str. E24377A
6.831e-05	1	1	1	1	0.001504	591946	no rank	                  Escherichia coli LF82
0.0002049	3	2	14	1	5.941e-05	208962	species	                Escherichia albertii
6.831e-05	1	1	4	1	0.000159	1440052	no rank	                  Escherichia albertii KF1
0.001298	19	1	142	1.11	4.82e-05	570	genus	              Klebsiella
0.0008198	12	10	43	1.14	4.983e-05	573	species	                Klebsiella pneumoniae
6.831e-05	1	1	5	1	5.978e-05	72407	subspecies	                  Klebsiella pneumoniae subsp. pneumoniae
6.831e-05	1	1	1	1	0.000999	1392500	no rank	                  Klebsiella pneumoniae HK787
0.0001366	2	2	11	1.09	3.546e-05	548	species	                Klebsiella aerogenes
6.831e-05	1	1	16	1.06	4.597e-05	571	species	                Klebsiella oxytoca
6.831e-05	1	1	6	1.33	2.852e-05	1134687	species	                Klebsiella michiganensis
6.831e-05	1	1	5	1	4.234e-05	2026240	species	                Klebsiella quasivariicola
6.831e-05	1	1	2	1	2.742e-05	244366	species	                Klebsiella variicola
0.001025	15	4	366	1.1	0.0001416	544	genus	              Citrobacter
0.0003416	5	0	134	1.13	0.0001072	1344959	species group	                Citrobacter freundii complex
0.0002733	4	3	50	1.16	9.058e-05	546	species	                  Citrobacter freundii
6.831e-05	1	1	15	1.13	0.0001354	1333848	no rank	                    Citrobacter freundii CFNIH1
6.831e-05	1	1	26	1.08	9.026e-05	67827	species	                  Citrobacter werkmanii
0.0002049	3	3	19	1.16	0.0001323	1702170	species	                Citrobacter sp. FDAARGOS_156
6.831e-05	1	1	51	1.14	0.0001033	35703	species	                Citrobacter amalonaticus
6.831e-05	1	1	44	1.05	0.0001914	545	species	                Citrobacter koseri
6.831e-05	1	1	16	1	9.713e-05	67824	species	                Citrobacter farmeri
0.0007515	11	0	206	1.21	5.393e-05	547	genus	              Enterobacter
0.0004099	6	0	140	1.19	4.86e-05	354276	species group	                Enterobacter cloacae complex
0.0002049	3	2	46	1.33	4.256e-05	550	species	                  Enterobacter cloacae
6.831e-05	1	0	3	1.67	5.947e-05	336306	subspecies	                    Enterobacter cloacae subsp. cloacae
6.831e-05	1	1	3	1.67	8.403e-05	716541	no rank	                      Enterobacter cloacae subsp. cloacae ATCC 13047
6.831e-05	1	0	25	1.04	7.578e-05	61645	species	                  Enterobacter asburiae
6.831e-05	1	1	1	1	2.786e-05	1421338	no rank	                    Enterobacter asburiae L1
6.831e-05	1	1	21	1.1	8.556e-05	1334193	species	                  Enterobacter lignolyticus
6.831e-05	1	1	3	1.33	6.771e-05	1915310	species	                  Enterobacter cloacae complex sp. ECNIH7
0.0003416	5	5	17	1.65	8.22e-05	1692238	species	                Enterobacter sp. FY-07
0.0006148	9	0	36	1.11	3.778e-05	191675	no rank	              unclassified Enterobacteriaceae
0.0004099	6	0	13	1	2.158e-05	84563	no rank	                ant, tsetse, mealybug, aphid, etc. endosymbionts
0.0001366	2	0	2	1	6.947e-05	1906659	genus	                  Candidatus Hoaglandella
0.0001366	2	2	2	1	6.947e-05	1778263	species	                    Candidatus Hoaglandella endobia
0.0001366	2	0	2	1	5.264e-05	1906657	genus	                  Candidatus Doolittlea
0.0001366	2	2	2	1	5.264e-05	1778262	species	                    Candidatus Doolittlea endobia
6.831e-05	1	0	3	1	1.217e-05	146507	no rank	                  aphid secondary symbionts
6.831e-05	1	0	1	1	7.705e-06	568987	genus	                    Candidatus Hamiltonella
6.831e-05	1	1	1	1	7.705e-06	138072	species	                      Candidatus Hamiltonella defensa
6.831e-05	1	0	1	1	2.35e-05	1906661	genus	                  Candidatus Gullanella
6.831e-05	1	1	1	1	2.35e-05	1070130	species	                    Candidatus Gullanella endobia
0.0002049	3	0	23	1.17	6.563e-05	36866	no rank	                unclassified Enterobacteriaceae (miscellaneous)
0.0002049	3	3	5	1.2	3.105e-05	891974	species	                  Plautia stali symbiont
0.0002733	4	0	15	1.13	0.0001723	620	genus	              Shigella
0.0001366	2	2	5	1.4	0.0001776	623	species	                Shigella flexneri
6.831e-05	1	1	5	1	0.0003184	624	species	                Shigella sonnei
6.831e-05	1	1	1	1	5.201e-05	621	species	                Shigella boydii
0.0001366	2	0	18	1.06	8.087e-05	1330546	genus	              Pluralibacter
0.0001366	2	2	18	1.06	8.087e-05	61647	species	                Pluralibacter gergoviae
6.831e-05	1	0	42	1.02	4.339e-05	1330547	genus	              Kosakonia
6.831e-05	1	1	17	1.06	5.315e-05	208223	species	                Kosakonia cowanii
6.831e-05	1	0	24	1.12	0.0001273	83654	genus	              Leclercia
6.831e-05	1	1	24	1.12	0.0001273	83655	species	                Leclercia adecarboxylata
6.831e-05	1	0	14	1	8.031e-05	1335483	genus	              Shimwellia
6.831e-05	1	0	14	1	8.031e-05	563	species	                Shimwellia blattae
6.831e-05	1	1	14	1	8.031e-05	630626	no rank	                  Shimwellia blattae DSM 4481 = NBRC 105725
6.831e-05	1	0	10	1	1.969e-05	1330545	genus	              Lelliottia
6.831e-05	1	1	9	1	2.715e-05	61646	species	                Lelliottia amnigena
6.831e-05	1	0	2	2	8.237e-05	1048757	genus	              Candidatus Moranella
6.831e-05	1	1	2	2	8.237e-05	1048758	species	                Candidatus Moranella endobia
0.0006148	9	0	87	1.29	1.289e-05	1903411	family	            Yersiniaceae
0.0004099	6	2	35	1.49	1.458e-05	629	genus	              Yersinia
0.0002733	4	1	12	1.67	2.445e-05	1649845	species group	                Yersinia pseudotuberculosis complex
0.0002049	3	2	7	1.86	0.0002236	632	species	                  Yersinia pestis
6.831e-05	1	1	3	1.33	0.01176	748678	no rank	                    Yersinia pestis str. Pestoides B
0.0002049	3	1	41	1.12	1.13e-05	613	genus	              Serratia
6.831e-05	1	1	5	1.2	1.238e-05	82996	species	                Serratia plymuthica
6.831e-05	1	1	1	1	5.308e-06	61651	species	                Serratia ficaria
0.0004099	6	0	63	1.21	1.272e-05	1903410	family	            Pectobacteriaceae
0.0003416	5	0	9	1.33	1.822e-05	84565	genus	              Sodalis
0.0003416	5	0	4	1.75	4.43e-05	1486991	species	                Candidatus Sodalis pierantonius
0.0003416	5	5	4	1.75	4.43e-05	2342	no rank	                  Candidatus Sodalis pierantonius str. SOPE
6.831e-05	1	0	7	1.29	1.582e-05	71655	genus	              Brenneria
6.831e-05	1	1	4	1	1.732e-05	1109412	species	                Brenneria goodwinii
0.0002733	4	0	28	1.14	8.5e-06	1903414	family	            Morganellaceae
6.831e-05	1	0	6	1.5	1.874e-05	583	genus	              Proteus
6.831e-05	1	1	5	1.6	3.279e-05	584	species	                Proteus mirabilis
6.831e-05	1	0	8	1	7.67e-06	626	genus	              Xenorhabdus
6.831e-05	1	0	2	1	1.306e-05	40577	species	                Xenorhabdus poinarii
6.831e-05	1	1	2	1	1.306e-05	1354304	no rank	                  Xenorhabdus poinarii G6
6.831e-05	1	0	7	1	7.049e-06	586	genus	              Providencia
6.831e-05	1	1	3	1	1.714e-05	126385	species	                Providencia alcalifaciens
6.831e-05	1	0	1	1	2.601e-05	637	genus	              Arsenophonus
6.831e-05	1	1	1	1	2.601e-05	634113	species	                Arsenophonus symbiont of Lipoptena fortisetosa
0.0002049	3	0	78	1.1	1.948e-05	1903409	family	            Erwiniaceae
0.0001366	2	0	54	1.11	2.33e-05	53335	genus	              Pantoea
6.831e-05	1	0	5	1.2	2.45e-05	66269	species	                Pantoea stewartii
6.831e-05	1	0	5	1.2	2.45e-05	66271	subspecies	                  Pantoea stewartii subsp. stewartii
6.831e-05	1	1	5	1.2	2.45e-05	660596	no rank	                    Pantoea stewartii subsp. stewartii DC283
6.831e-05	1	1	5	1	1.843e-05	592316	species	                Pantoea sp. At-9b
6.831e-05	1	0	18	1	1.741e-05	551	genus	              Erwinia
6.831e-05	1	0	4	1	1.724e-05	182337	species	                Erwinia billingiae
6.831e-05	1	1	4	1	1.724e-05	634500	no rank	                  Erwinia billingiae Eb661
0.0001366	2	0	15	1.07	9.648e-06	1903412	family	            Hafniaceae
0.0001366	2	0	12	1.08	1.48e-05	635	genus	              Edwardsiella
6.831e-05	1	0	2	1	0.0002324	1821960	species	                Edwardsiella anguillarum
6.831e-05	1	1	2	1	0.0002324	667120	no rank	                  Edwardsiella anguillarum ET080813
6.831e-05	1	1	1	1	0.0003632	1650654	species	                Edwardsiella sp. LADL05-105
0.001025	15	0	46	1.5	1.053e-06	72274	order	          Pseudomonadales
0.0009564	14	0	45	1.51	1.188e-06	135621	family	            Pseudomonadaceae
0.0009564	14	3	43	1.51	1.158e-06	286	genus	              Pseudomonas
0.0006148	9	0	6	2.67	1.843e-06	136845	species group	                Pseudomonas putida group
0.0006148	9	0	4	3.25	1.854e-06	303	species	                  Pseudomonas putida
0.0006148	9	9	3	4	0.000324	1193499	no rank	                    Pseudomonas putida SJTE-1
6.831e-05	1	0	3	1	9.859e-07	136841	species group	                Pseudomonas aeruginosa group
6.831e-05	1	1	3	1	2.246e-06	287	species	                  Pseudomonas aeruginosa
6.831e-05	1	1	1	1	5.286e-06	1788301	species	                Pseudomonas versuta
6.831e-05	1	0	1	1	1.725e-07	468	family	            Moraxellaceae
6.831e-05	1	1	1	1	2.676e-07	469	genus	              Acinetobacter
0.0002049	3	0	22	1.32	2.153e-06	135614	order	          Xanthomonadales
0.0002049	3	0	22	1.32	2.43e-06	32033	family	            Xanthomonadaceae
0.0001366	2	0	10	1.3	4.239e-06	40323	genus	              Stenotrophomonas
6.831e-05	1	1	3	1	3.158e-05	2005046	species	                Stenotrophomonas sp. WZN-1
6.831e-05	1	1	1	2	2.862e-06	216778	species	                Stenotrophomonas rhizophila
6.831e-05	1	1	2	1.5	4.854e-07	338	genus	              Xanthomonas
0.0002049	3	0	18	1.06	1.113e-06	135622	order	          Alteromonadales
0.0001366	2	0	5	1	1.48e-05	267894	family	            Psychromonadaceae
0.0001366	2	1	5	1	1.48e-05	67572	genus	              Psychromonas
6.831e-05	1	0	1	1	4.952e-06	357794	species	                Psychromonas ingrahamii
6.831e-05	1	1	1	1	4.952e-06	357804	no rank	                  Psychromonas ingrahamii 37
6.831e-05	1	0	2	1	4.208e-07	267890	family	            Shewanellaceae
6.831e-05	1	0	2	1	4.208e-07	22	genus	              Shewanella
6.831e-05	1	0	2	1	3.431e-06	62322	species	                Shewanella baltica
6.831e-05	1	1	1	1	0.0004191	693971	no rank	                  Shewanella baltica OS183
0.0001366	2	0	13	1.38	4.528e-06	135624	order	          Aeromonadales
0.0001366	2	0	13	1.38	4.528e-06	84642	family	            Aeromonadaceae
0.0001366	2	0	7	1.29	3.336e-06	642	genus	              Aeromonas
0.0001366	2	2	6	1.33	1.571e-05	654	species	                Aeromonas veronii
0.0001366	2	0	11	1.18	1.488e-06	135619	order	          Oceanospirillales
6.831e-05	1	0	7	1.29	2.001e-06	28256	family	            Halomonadaceae
6.831e-05	1	0	1	1	2.451e-05	114403	no rank	              Zymobacter group
6.831e-05	1	0	1	1	0.000142	114185	genus	                Candidatus Carsonella
6.831e-05	1	0	1	1	0.000142	114186	species	                  Candidatus Carsonella ruddii
6.831e-05	1	1	1	1	0.000142	1202539	no rank	                    Candidatus Carsonella ruddii HT isolate Thao2000
6.831e-05	1	0	2	1	3.635e-06	224379	family	            Hahellaceae
6.831e-05	1	0	2	1	8.931e-06	305899	genus	              Endozoicomonas
6.831e-05	1	0	2	1	8.931e-06	1027273	species	                Endozoicomonas montiporae
6.831e-05	1	1	2	1	8.931e-06	570277	no rank	                  Endozoicomonas montiporae CL-33
0.0001366	2	0	2	1	6.486e-06	1692040	order	          Acidiferrobacterales
0.0001366	2	1	2	1	6.486e-06	1692041	family	            Acidiferrobacteraceae
6.831e-05	1	0	1	1	5.58e-06	1692042	genus	              Sulfurifustis
6.831e-05	1	1	1	1	5.58e-06	1675686	species	                Sulfurifustis variabilis
6.831e-05	1	0	17	1.06	5.578e-06	135625	order	          Pasteurellales
6.831e-05	1	0	17	1.06	5.578e-06	712	family	            Pasteurellaceae
6.831e-05	1	0	1	2	8.547e-06	155493	genus	              Gallibacterium
6.831e-05	1	0	1	2	8.547e-06	750	species	                Gallibacterium anatis
6.831e-05	1	1	1	2	8.547e-06	1005058	no rank	                  Gallibacterium anatis UMN179
6.831e-05	1	0	3	1.33	6.851e-07	135613	order	          Chromatiales
6.831e-05	1	0	2	1.5	1.046e-06	72276	family	            Ectothiorhodospiraceae
6.831e-05	1	0	1	2	2.15e-06	1765964	genus	              Acidihalobacter
6.831e-05	1	1	1	2	6.604e-06	1765967	species	                Acidihalobacter ferrooxidans
24.55	359363	23	97046	47.3	0.001623	28216	class	        Betaproteobacteria
24.54	359202	88	96369	47.5	0.03401	206351	order	          Neisseriales
24.53	359114	155	96369	47.4	0.06325	481	family	            Neisseriaceae
24.52	358958	28238	95559	47.4	0.08279	482	genus	              Neisseria
22.56	330227	323586	42327	56	0.6474	485	species	                Neisseria gonorrhoeae
0.3584	5246	5246	105	101	0.1517	528354	no rank	                  Neisseria gonorrhoeae MS11
0.05977	875	875	7	203	0.03182	521006	no rank	                  Neisseria gonorrhoeae NCCP11945
0.03552	520	520	48	25.1	0.03424	242231	no rank	                  Neisseria gonorrhoeae FA 1090
0.02883	422	359	747	5.81	0.003755	487	species	                Neisseria meningitidis
0.002049	30	30	8	33.9	0.00404	942513	no rank	                  Neisseria meningitidis WUE 2594
0.00123	18	0	4	11.2	0.001856	491	no rank	                  Neisseria meningitidis serogroup B
0.00123	18	18	4	11.2	0.002201	630588	no rank	                    Neisseria meningitidis alpha710
0.0004782	7	0	8	3.5	0.005274	65699	no rank	                  Neisseria meningitidis serogroup A
0.0004782	7	7	8	3.5	0.005274	122587	no rank	                    Neisseria meningitidis Z2491
0.0002049	3	0	21	1.1	0.002297	135720	no rank	                  Neisseria meningitidis serogroup C
0.0001366	2	2	12	1.08	0.002306	374833	no rank	                    Neisseria meningitidis 053442
6.831e-05	1	1	7	1.14	0.002041	604162	no rank	                    Neisseria meningitidis 8013
0.0001366	2	2	25	1.16	0.003782	662598	no rank	                  Neisseria meningitidis alpha14
6.831e-05	1	1	10	5	0.003228	935588	no rank	                  Neisseria meningitidis M01-240355
6.831e-05	1	1	2	17.5	0.001584	935590	no rank	                  Neisseria meningitidis M0579
6.831e-05	1	1	1	1	0.025	1095685	no rank	                  Neisseria meningitidis M7124
0.004167	61	51	185	3.16	0.002582	486	species	                Neisseria lactamica
0.0006831	10	10	64	3.09	0.002602	489653	no rank	                  Neisseria lactamica 020-06
0.0002049	3	3	34	1.88	0.0003326	490	species	                Neisseria sicca
0.0001366	2	0	19	1.16	0.0002127	495	species	                Neisseria elongata
0.0001366	2	0	19	1.16	0.0002127	88719	subspecies	                  Neisseria elongata subsp. glycolytica
0.0001366	2	2	19	1.16	0.0002127	546263	no rank	                    Neisseria elongata subsp. glycolytica ATCC 29315
0.0001366	2	2	9	1.22	8.442e-05	1853276	species	                Neisseria sp. 10022
6.831e-05	1	1	11	1.18	0.000108	655307	species	                Neisseria sp. KEM232
6.831e-05	1	1	9	1	8.469e-05	326523	species	                Neisseria zoodegmatis
6.831e-05	1	1	6	1.17	6.597e-05	28091	species	                Neisseria weaveri
6.831e-05	1	0	8	1	8.671e-05	538	genus	              Eikenella
6.831e-05	1	1	8	1	8.671e-05	539	species	                Eikenella corrodens
0.009427	138	2	1026	1.37	2.019e-05	80840	order	          Burkholderiales
0.008608	126	1	977	1.38	3.675e-05	119060	family	            Burkholderiaceae
0.008198	120	8	935	1.33	0.0003941	48736	genus	              Ralstonia
0.006558	96	28	708	1.31	0.001921	329	species	                Ralstonia pickettii
0.002664	39	39	227	1.42	0.002123	402626	no rank	                  Ralstonia pickettii 12J
0.001981	29	29	162	1.24	0.001286	428406	no rank	                  Ralstonia pickettii 12D
0.0008198	12	12	103	1.5	0.0006292	105219	species	                Ralstonia mannitolilytica
0.0002733	4	4	13	1.08	3.551e-05	190721	species	                Ralstonia insidiosa
0.0002733	4	0	11	6.09	7.507e-07	32008	genus	              Burkholderia
0.0002049	3	1	4	14.8	5.173e-07	87882	species group	                Burkholderia cepacia complex
0.0001366	2	0	1	56	0.003145	152500	species	                  Burkholderia dolosa
0.0001366	2	2	1	56	0.003984	1385930	no rank	                    Burkholderia dolosa PC543
6.831e-05	1	1	1	1	8.144e-06	758796	species	                Burkholderia sp. RPE67
6.831e-05	1	0	1	1	2.889e-07	1822464	genus	              Paraburkholderia
6.831e-05	1	0	1	1	6.134e-06	412963	species	                Paraburkholderia rhizoxinica
6.831e-05	1	1	1	1	6.134e-06	882378	no rank	                  Paraburkholderia rhizoxinica HKI 454
0.0002733	4	1	11	1.18	1.246e-06	80864	family	            Comamonadaceae
6.831e-05	1	0	1	2	9.447e-07	283	genus	              Comamonas
6.831e-05	1	1	1	2	1.803e-06	285	species	                Comamonas testosteroni
6.831e-05	1	0	1	1	1.198e-06	28065	genus	              Rhodoferax
6.831e-05	1	0	1	1	4.502e-06	192843	species	                Rhodoferax ferrireducens
6.831e-05	1	1	1	1	4.502e-06	338969	no rank	                  Rhodoferax ferrireducens T118
6.831e-05	1	1	1	1	7.085e-07	12916	genus	              Acidovorax
0.0001366	2	0	11	1	1.51e-06	506	family	            Alcaligenaceae
6.831e-05	1	0	8	1	2.266e-06	517	genus	              Bordetella
6.831e-05	1	1	1	1	4.71e-06	94624	species	                Bordetella petrii
6.831e-05	1	0	2	1	2.267e-05	1472344	genus	              Basilea
6.831e-05	1	0	2	1	2.267e-05	1472345	species	                Basilea psittacipulmonis
6.831e-05	1	1	2	1	2.267e-05	1072685	no rank	                  Basilea psittacipulmonis DSM 24701
0.0001366	2	0	8	1.25	1.557e-06	75682	family	            Oxalobacteraceae
6.831e-05	1	0	4	1.5	2.85e-06	29580	genus	              Janthinobacterium
6.831e-05	1	1	2	2	1.121e-05	375286	species	                Janthinobacterium sp. Marseille
6.831e-05	1	0	2	1	1.631e-06	963	genus	              Herbaspirillum
6.831e-05	1	1	1	1	4.455e-06	92645	species	                Herbaspirillum frisingense
0.0001366	2	0	5	1.2	1.763e-06	119065	no rank	            unclassified Burkholderiales
0.0001366	2	0	2	1.5	9.812e-07	224471	no rank	              Burkholderiales Genera incertae sedis
0.0001366	2	0	2	1.5	9.531e-06	88	genus	                Leptothrix
0.0001366	2	0	2	1.5	9.531e-06	34029	species	                  Leptothrix cholodnii
0.0001366	2	2	2	1.5	9.531e-06	395495	no rank	                    Leptothrix cholodnii SP-6
0.008266	121	12	316	1.25	4.094e-06	28211	class	        Alphaproteobacteria
0.005875	86	0	193	1.21	1.553e-05	204455	order	          Rhodobacterales
0.005875	86	23	193	1.21	1.639e-05	31989	family	            Rhodobacteraceae
0.002664	39	6	73	1.22	9.474e-05	265	genus	              Paracoccus
0.001298	19	19	33	1.42	0.000165	147645	species	                Paracoccus yeei
0.0006148	9	0	17	1.06	7.709e-05	266	species	                Paracoccus denitrificans
0.0006148	9	9	17	1.06	7.709e-05	318586	no rank	                  Paracoccus denitrificans PD1222
0.0003416	5	5	10	1.1	7.577e-05	1945662	species	                Paracoccus contaminans
0.0004782	7	1	13	1.15	1.171e-05	1060	genus	              Rhodobacter
0.0002049	3	3	6	1	3.882e-05	1850250	species	                Rhodobacter sp. LPB0142
6.831e-05	1	0	3	1.33	5.048e-06	1063	species	                Rhodobacter sphaeroides
6.831e-05	1	1	1	1	2.135e-05	992186	no rank	                  Rhodobacter sphaeroides WS8N
6.831e-05	1	0	2	1	1.197e-05	1061	species	                Rhodobacter capsulatus
6.831e-05	1	1	2	1	1.197e-05	272942	no rank	                  Rhodobacter capsulatus SB 1003
6.831e-05	1	1	1	1	5.388e-06	2033869	species	                Rhodobacter sp. CZR27
0.0002049	3	1	4	1	7.678e-06	875170	genus	              Celeribacter
0.0001366	2	2	3	1	1.485e-05	1208324	species	                Celeribacter indicus
0.0001366	2	0	4	1.75	1.826e-05	360528	genus	              Pelagibaca
0.0001366	2	2	4	1.75	1.826e-05	1250539	species	                Pelagibaca abyssi
0.0001366	2	0	5	1	3.392e-05	1932719	genus	              Xuhuaishuia
0.0001366	2	2	5	1	3.392e-05	1411903	species	                Xuhuaishuia manganoxidans
0.0001366	2	0	5	1	8.422e-06	97050	genus	              Ruegeria
0.0001366	2	0	4	1	1.99e-05	89184	species	                Ruegeria pomeroyi
0.0001366	2	2	4	1	1.99e-05	246200	no rank	                  Ruegeria pomeroyi DSS-3
0.0001366	2	0	3	1.67	1.734e-05	245186	genus	              Loktanella
0.0001366	2	2	3	1.67	1.734e-05	245188	species	                Loktanella vestfoldensis
0.0001366	2	0	3	1	7.034e-06	60136	genus	              Sulfitobacter
0.0001366	2	2	3	1	1.495e-05	1917485	species	                Sulfitobacter sp. AM1-D1
6.831e-05	1	0	4	1.75	1.91e-05	1097466	genus	              Defluviimonas
6.831e-05	1	1	4	1.75	1.91e-05	1335048	species	                Defluviimonas alba
6.831e-05	1	0	2	1	1.083e-05	285107	genus	              Thioclava
6.831e-05	1	1	2	1	1.083e-05	1915078	species	                Thioclava nitratireducens
6.831e-05	1	0	1	1	6.373e-06	159345	genus	              Roseibacterium
6.831e-05	1	0	1	1	6.373e-06	159346	species	                Roseibacterium elongatum
6.831e-05	1	1	1	1	6.373e-06	1294273	no rank	                  Roseibacterium elongatum DSM 19469
6.831e-05	1	0	1	1	4.134e-06	227873	genus	              Pannonibacter
6.831e-05	1	1	1	1	4.134e-06	121719	species	                Pannonibacter phragmitetus
0.001161	17	3	52	1.33	1.342e-06	356	order	          Rhizobiales
0.0005465	8	0	19	1.11	1.428e-06	82115	family	            Rhizobiaceae
0.0004099	6	0	13	1.08	1.465e-06	227290	no rank	              Rhizobium/Agrobacterium group
0.0003416	5	0	10	1.1	1.558e-06	379	genus	                Rhizobium
0.0001366	2	0	4	1	2.263e-06	384	species	                  Rhizobium leguminosarum
0.0001366	2	0	2	1	3.539e-06	387	no rank	                    Rhizobium leguminosarum bv. viciae
0.0001366	2	2	2	1	1.142e-05	216596	no rank	                      Rhizobium leguminosarum bv. viciae 3841
6.831e-05	1	1	1	2	3.387e-06	348824	species	                  Rhizobium favelukesii
6.831e-05	1	1	2	1	1.007e-05	1125847	species	                  Rhizobium sp. NT-26
6.831e-05	1	1	1	1	4.963e-06	1981173	species	                  Rhizobium sp. NXC14
6.831e-05	1	0	2	1	1.128e-06	357	genus	                Agrobacterium
6.831e-05	1	1	1	1	4.598e-06	1842536	species	                  Agrobacterium sp. RAC06
0.0001366	2	0	6	1.17	1.583e-06	227292	no rank	              Sinorhizobium/Ensifer group
0.0001366	2	0	6	1.17	2.084e-06	28105	genus	                Sinorhizobium
0.0001366	2	2	2	1.5	6.117e-06	194963	species	                  Sinorhizobium americanum
0.0001366	2	0	3	1.33	3.059e-07	41294	family	            Bradyrhizobiaceae
0.0001366	2	1	2	1	3.318e-07	374	genus	              Bradyrhizobium
6.831e-05	1	1	1	1	2.92e-06	288000	species	                Bradyrhizobium sp. BTAi1
6.831e-05	1	0	12	1.75	3.877e-06	119045	family	            Methylobacteriaceae
6.831e-05	1	0	12	1.75	3.877e-06	407	genus	              Methylobacterium
6.831e-05	1	1	3	2	4.008e-05	29429	species	                Methylobacterium zatmanii
6.831e-05	1	0	2	1.5	1.599e-06	118882	family	            Brucellaceae
6.831e-05	1	1	2	1.5	4.939e-06	234	genus	              Brucella
6.831e-05	1	0	1	2	7.104e-07	772	family	            Bartonellaceae
6.831e-05	1	0	1	2	7.104e-07	773	genus	              Bartonella
6.831e-05	1	1	1	2	1.61e-05	774	species	                Bartonella bacilliformis
6.831e-05	1	0	1	1	2.362e-06	119042	no rank	            unclassified Rhizobiales
6.831e-05	1	0	1	1	3.726e-06	1734920	genus	              Pseudorhodoplanes
6.831e-05	1	1	1	1	3.726e-06	1235591	species	                Pseudorhodoplanes sinuspersici
0.0002049	3	0	12	1.25	1.404e-06	204441	order	          Rhodospirillales
0.0001366	2	0	4	1.75	9.292e-07	41295	family	            Rhodospirillaceae
6.831e-05	1	0	2	2	6.969e-06	171436	genus	              Tistrella
6.831e-05	1	0	2	2	6.969e-06	171437	species	                Tistrella mobilis
6.831e-05	1	1	2	2	6.969e-06	1110502	no rank	                  Tistrella mobilis KA081020-065
6.831e-05	1	0	1	2	5.819e-07	191	genus	              Azospirillum
6.831e-05	1	1	1	2	1.403e-06	192	species	                Azospirillum brasilense
6.831e-05	1	0	8	1	1.886e-06	433	family	            Acetobacteraceae
6.831e-05	1	0	3	1	3.991e-06	1434011	genus	              Komagataeibacter
6.831e-05	1	0	1	1	6.42e-06	436	species	                Komagataeibacter hansenii
6.831e-05	1	1	1	1	6.42e-06	714995	no rank	                  Komagataeibacter hansenii ATCC 23769
0.0001366	2	0	12	1.08	1.064e-06	204457	order	          Sphingomonadales
0.0001366	2	0	9	1.11	1.023e-06	41297	family	            Sphingomonadaceae
0.0001366	2	1	3	1	1.096e-06	13687	genus	              Sphingomonas
6.831e-05	1	1	1	1	4.402e-06	1609977	species	                Sphingomonas hengshuiensis
6.831e-05	1	0	7	1.57	2.736e-06	204458	order	          Caulobacterales
6.831e-05	1	0	7	1.57	2.736e-06	76892	family	            Caulobacteraceae
6.831e-05	1	0	4	2	4.144e-06	41275	genus	              Brevundimonas
6.831e-05	1	1	2	2	1.409e-05	1532555	species	                Brevundimonas sp. DS20
0.04099	600	179	582	6.3	2.395e-06	1783272	no rank	      Terrabacteria group
0.01824	267	260	80	30.6	8.578e-07	1239	phylum	        Firmicutes
0.0003416	5	0	31	1.32	4.727e-07	91061	class	          Bacilli
0.0003416	5	0	19	1.32	1.009e-06	186826	order	            Lactobacillales
0.0002049	3	0	10	1.4	1.621e-06	1300	family	              Streptococcaceae
0.0002049	3	1	10	1.4	1.936e-06	1301	genus	                Streptococcus
6.831e-05	1	0	4	1	2.393e-05	28037	species	                  Streptococcus mitis
6.831e-05	1	1	4	1	7.833e-05	365659	no rank	                    Streptococcus mitis B6
6.831e-05	1	1	1	2	3.581e-05	1839799	species	                  Streptococcus sp. FDAARGOS_192
6.831e-05	1	0	6	1	8.145e-07	33958	family	              Lactobacillaceae
6.831e-05	1	0	6	1	8.726e-07	1578	genus	                Lactobacillus
6.831e-05	1	1	3	1	3.172e-05	1601	species	                  Lactobacillus agilis
6.831e-05	1	0	2	2	8.145e-07	81852	family	              Enterococcaceae
6.831e-05	1	0	2	2	1.015e-06	1350	genus	                Enterococcus
6.831e-05	1	1	1	2	2.989e-06	1352	species	                  Enterococcus faecium
0.0001366	2	0	18	1.94	7.537e-07	186801	class	          Clostridia
0.0001366	2	0	17	1.94	8.389e-07	186802	order	            Clostridiales
0.0001366	2	0	17	1.94	6.09e-06	186803	family	              Lachnospiraceae
0.0001366	2	0	17	1.94	0.0001139	186928	no rank	                unclassified Lachnospiraceae
0.0001366	2	0	17	1.94	0.0001139	39491	species	                  [Eubacterium] rectale
0.0001366	2	2	17	1.94	0.0001139	515619	no rank	                    [Eubacterium] rectale ATCC 33656
0.009427	138	1	428	1.37	3.804e-06	201174	phylum	        Actinobacteria
0.009291	136	28	411	1.37	3.761e-06	1760	class	          Actinobacteria
0.003416	50	0	110	1.27	0.0001598	1643682	order	            Geodermatophilales
0.003416	50	5	110	1.27	0.0001598	85030	family	              Geodermatophilaceae
0.001025	15	0	38	1.16	0.0001803	38501	genus	                Blastococcus
0.001025	15	0	38	1.16	0.0001803	138336	species	                  Blastococcus saxobsidens
0.001025	15	15	38	1.16	0.0001803	1146883	no rank	                    Blastococcus saxobsidens DD2
0.001025	15	0	32	1.34	0.0001388	1860	genus	                Geodermatophilus
0.001025	15	0	32	1.34	0.0001388	1861	species	                  Geodermatophilus obscurus
0.001025	15	15	32	1.34	0.0001388	526225	no rank	                    Geodermatophilus obscurus DSM 43160
0.001025	15	0	26	1.27	0.0001073	88138	genus	                Modestobacter
0.001025	15	15	26	1.27	0.0001073	477641	species	                  Modestobacter marinus
0.001571	23	3	69	1.42	3.958e-06	85006	order	            Micrococcales
0.0004099	6	0	20	1.55	1.877e-05	85020	family	              Dermabacteraceae
0.0004099	6	2	20	1.55	2.419e-05	43668	genus	                Brachybacterium
0.0001366	2	2	4	2	2.097e-05	1903186	species	                  Brachybacterium sp. P6-10-X1
6.831e-05	1	1	2	1	1.195e-05	1331682	species	                  Brachybacterium ginsengisoli
6.831e-05	1	0	1	1	6.627e-06	43669	species	                  Brachybacterium faecium
6.831e-05	1	1	1	1	6.627e-06	446465	no rank	                    Brachybacterium faecium DSM 4810
0.0003416	5	1	27	1.3	4.953e-06	1268	family	              Micrococcaceae
0.0002049	3	0	23	1.26	3.976e-05	57493	genus	                Kocuria
0.0002049	3	3	23	1.26	0.0001848	71999	species	                  Kocuria palustris
6.831e-05	1	0	2	2	1.86e-05	1269	genus	                Micrococcus
6.831e-05	1	1	2	2	1.86e-05	1270	species	                  Micrococcus luteus
0.0003416	5	1	5	1.4	7.669e-07	85023	family	              Microbacteriaceae
0.0001366	2	1	2	1	9.121e-07	33882	genus	                Microbacterium
6.831e-05	1	1	1	1	6.786e-06	300019	species	                  Microbacterium paludicola
6.831e-05	1	0	1	2	3.142e-06	518733	genus	                Microterricola
6.831e-05	1	1	1	2	3.142e-06	412690	species	                  Microterricola viridarii
6.831e-05	1	0	1	1	1.752e-06	1573	genus	                Clavibacter
6.831e-05	1	0	1	1	1.752e-06	28447	species	                  Clavibacter michiganensis
6.831e-05	1	0	1	1	9.865e-06	33013	subspecies	                    Clavibacter michiganensis subsp. michiganensis
6.831e-05	1	1	1	1	9.865e-06	443906	no rank	                      Clavibacter michiganensis subsp. michiganensis NCPPB 382
0.0002049	3	0	9	1.44	1.109e-05	85021	family	              Intrasporangiaceae
6.831e-05	1	0	3	2	1.732e-05	367298	genus	                Phycicoccus
6.831e-05	1	1	3	2	1.732e-05	443156	species	                  Phycicoccus dokdonensis
6.831e-05	1	0	3	1	2.03e-05	53457	genus	                Janibacter
6.831e-05	1	1	3	1	2.03e-05	857417	species	                  Janibacter indicus
6.831e-05	1	0	1	1	5.624e-06	53357	genus	                Intrasporangium
6.831e-05	1	0	1	1	5.624e-06	53358	species	                  Intrasporangium calvum
6.831e-05	1	1	1	1	5.624e-06	710696	no rank	                    Intrasporangium calvum DSM 43043
6.831e-05	1	0	1	1	1.166e-06	85017	family	              Promicromonosporaceae
6.831e-05	1	0	1	1	2.632e-06	157920	genus	                Cellulosimicrobium
6.831e-05	1	1	1	1	5.144e-06	1710	species	                  Cellulosimicrobium cellulans
0.001093	16	0	79	1.33	1.549e-05	85009	order	            Propionibacteriales
0.0006831	10	2	66	1.33	2.547e-05	31957	family	              Propionibacteriaceae
0.0002049	3	0	18	1.22	3.246e-05	29404	genus	                Microlunatus
0.0001366	2	2	15	1.07	4.951e-05	630515	species	                  Microlunatus soli
6.831e-05	1	0	3	2	1.193e-05	29405	species	                  Microlunatus phosphovorus
6.831e-05	1	1	3	2	1.193e-05	1032480	no rank	                    Microlunatus phosphovorus NM-1
0.0001366	2	0	24	1.29	4.999e-05	1912216	genus	                Cutibacterium
0.0001366	2	2	24	1.29	0.000123	1747	species	                  Cutibacterium acnes
0.0001366	2	0	9	1	1.477e-05	72763	genus	                Tessaracoccus
6.831e-05	1	1	8	1	5.216e-05	399497	species	                  Tessaracoccus flavescens
6.831e-05	1	1	1	1	7.102e-06	1610493	species	                  Tessaracoccus flavus
6.831e-05	1	0	9	1.67	3.417e-05	1743	genus	                Propionibacterium
6.831e-05	1	1	9	1.67	8.168e-05	671223	species	                  Propionibacterium sp. oral taxon 193
0.0004099	6	2	12	1.33	4.791e-06	85015	family	              Nocardioidaceae
6.831e-05	1	0	2	2	5.916e-06	182639	genus	                Kribbella
6.831e-05	1	0	2	2	5.916e-06	182640	species	                  Kribbella flavida
6.831e-05	1	1	2	2	5.916e-06	479435	no rank	                    Kribbella flavida DSM 17836
6.831e-05	1	0	2	1	3.306e-06	1839	genus	                Nocardioides
6.831e-05	1	1	2	1	8.704e-06	196162	species	                  Nocardioides sp. JS614
6.831e-05	1	0	2	1	4.977e-06	53387	genus	                Friedmanniella
6.831e-05	1	1	2	1	1.03e-05	546874	species	                  Friedmanniella sagamiharensis
6.831e-05	1	0	1	1	3.514e-06	117156	genus	                Actinopolymorpha
6.831e-05	1	1	1	1	3.514e-06	117157	species	                  Actinopolymorpha singaporensis
0.0002733	4	0	11	1.64	3.965e-07	85011	order	            Streptomycetales
0.0002733	4	0	11	1.64	3.965e-07	2062	family	              Streptomycetaceae
0.0002733	4	1	10	1.7	3.746e-07	1883	genus	                Streptomyces
6.831e-05	1	1	1	2	3.794e-06	1561022	species	                  Streptomyces sp. CCM_MD2014
6.831e-05	1	1	1	1	2.942e-06	545123	species	                  Streptomyces silaceus
6.831e-05	1	1	1	1	3.434e-06	862751	species	                  Streptomyces sp. SirexAA-E
0.0002733	4	0	8	1.25	1.042e-06	85008	order	            Micromonosporales
0.0002733	4	0	8	1.25	1.042e-06	28056	family	              Micromonosporaceae
0.0002049	3	1	4	1.25	8.852e-07	1873	genus	                Micromonospora
6.831e-05	1	1	1	2	3.59e-06	291594	species	                  Micromonospora rifamycinica
6.831e-05	1	1	1	1	3.815e-06	1881	species	                  Micromonospora viridifaciens
6.831e-05	1	0	1	1	3.486e-06	673534	genus	                Plantactinospora
6.831e-05	1	1	1	1	3.486e-06	2024580	species	                  Plantactinospora sp. KBS50
0.0001366	2	0	7	1.43	2.443e-07	85007	order	            Corynebacteriales
6.831e-05	1	0	1	1	1.42e-07	85025	family	              Nocardiaceae
6.831e-05	1	0	1	1	4.19e-07	1817	genus	                Nocardia
6.831e-05	1	1	1	1	3.119e-06	134962	species	                  Nocardia soli
6.831e-05	1	0	1	1	7.166e-07	85026	family	              Gordoniaceae
6.831e-05	1	0	1	1	7.166e-07	2053	genus	                Gordonia
6.831e-05	1	1	1	1	5.203e-06	1136941	species	                  Gordonia sp. QH-11
0.0001366	2	0	4	1.75	8.286e-06	1643684	order	            Nakamurellales
0.0001366	2	0	4	1.75	8.286e-06	85031	family	              Nakamurellaceae
0.0001366	2	0	4	1.75	8.286e-06	53460	genus	                Nakamurella
6.831e-05	1	1	2	2	8.967e-06	1090615	species	                  Nakamurella panacisegetis
6.831e-05	1	0	2	1.5	7.708e-06	53461	species	                  Nakamurella multipartita
6.831e-05	1	1	2	1.5	7.708e-06	479431	no rank	                    Nakamurella multipartita DSM 44233
0.0001366	2	0	5	1.2	5.427e-07	85010	order	            Pseudonocardiales
0.0001366	2	0	5	1.2	5.427e-07	2070	family	              Pseudonocardiaceae
6.831e-05	1	0	1	1	4.873e-07	1813	genus	                Amycolatopsis
6.831e-05	1	1	1	1	2.227e-06	33910	species	                  Amycolatopsis mediterranei
6.831e-05	1	0	1	1	2.66e-06	1137960	genus	                Allokutzneria
6.831e-05	1	1	1	1	2.66e-06	211114	species	                  Allokutzneria albata
6.831e-05	1	0	3	1.67	1.308e-06	85013	order	            Frankiales
6.831e-05	1	0	3	1.67	1.426e-06	74712	family	              Frankiaceae
6.831e-05	1	0	2	2	9.358e-06	1434010	genus	                Jatrophihabitans
6.831e-05	1	1	2	2	9.358e-06	1907575	species	                  Jatrophihabitans sp. GAS493
6.831e-05	1	0	2	2	8.318e-07	85012	order	            Streptosporangiales
6.831e-05	1	0	1	2	8.935e-07	83676	family	              Nocardiopsaceae
6.831e-05	1	0	1	2	1.046e-06	2013	genus	                Nocardiopsis
6.831e-05	1	1	1	2	2.35e-06	2014	species	                  Nocardiopsis dassonvillei
6.831e-05	1	0	2	1.5	3.088e-06	1217098	order	            Jiangellales
6.831e-05	1	0	2	1.5	3.088e-06	1217100	family	              Jiangellaceae
6.831e-05	1	0	2	1.5	3.088e-06	281472	genus	                Jiangella
6.831e-05	1	1	2	1.5	6.443e-06	1798224	species	                  Jiangella sp. DSM 45060
6.831e-05	1	0	1	1	3.885e-07	85004	order	            Bifidobacteriales
6.831e-05	1	0	1	1	3.885e-07	31953	family	              Bifidobacteriaceae
6.831e-05	1	0	1	1	4.505e-07	1678	genus	                Bifidobacterium
6.831e-05	1	1	1	1	2.841e-06	216816	species	                  Bifidobacterium longum
6.831e-05	1	0	1	1	3.245e-06	85014	order	            Glycomycetales
6.831e-05	1	0	1	1	3.245e-06	85034	family	              Glycomycetaceae
6.831e-05	1	0	1	1	3.245e-06	283810	genus	                Stackebrandtia
6.831e-05	1	0	1	1	3.245e-06	283811	species	                  Stackebrandtia nassauensis
6.831e-05	1	1	1	1	3.245e-06	446470	no rank	                    Stackebrandtia nassauensis DSM 44728
6.831e-05	1	0	9	1.33	4.358e-06	84998	class	          Coriobacteriia
6.831e-05	1	0	9	1.33	7.007e-06	1643822	order	            Eggerthellales
6.831e-05	1	0	9	1.33	7.007e-06	1643826	family	              Eggerthellaceae
6.831e-05	1	0	9	1.33	2.704e-05	84111	genus	                Eggerthella
6.831e-05	1	0	9	1.33	4.625e-05	84112	species	                  Eggerthella lenta
6.831e-05	1	1	7	1.14	0.0001651	479437	no rank	                    Eggerthella lenta DSM 2243
0.001093	16	0	64	1.75	2.321e-06	1798711	no rank	        Cyanobacteria/Melainabacteria group
0.001093	16	0	64	1.75	2.321e-06	1117	phylum	          Cyanobacteria
0.0008881	13	0	58	1.83	0.0001923	1890505	order	            Chroococcidiopsidales
0.0008881	13	0	58	1.83	0.0001923	1890528	family	              Chroococcidiopsidaceae
0.0008881	13	0	58	1.83	0.0001923	54298	genus	                Chroococcidiopsis
0.0008881	13	0	58	1.83	0.0001923	54299	species	                  Chroococcidiopsis thermalis
0.0008881	13	13	58	1.83	0.0001923	251229	no rank	                    Chroococcidiopsis thermalis PCC 7203
0.0002049	3	1	4	1	3.375e-07	1161	order	            Nostocales
6.831e-05	1	0	1	1	2.313e-07	1185	family	              Rivulariaceae
6.831e-05	1	0	1	1	2.755e-07	1186	genus	                Calothrix
6.831e-05	1	1	1	1	3.283e-06	99598	species	                  Calothrix sp. PCC 7507
6.831e-05	1	0	1	1	2.374e-07	1162	family	              Nostocaceae
6.831e-05	1	0	1	1	3.783e-07	1177	genus	                Nostoc
6.831e-05	1	0	1	1	3.402e-06	224012	species	                  Nostoc piscinale
6.831e-05	1	1	1	1	3.402e-06	224013	no rank	                    Nostoc piscinale CENA21
0.001298	19	0	116	1.73	2.525e-06	1783270	no rank	      FCB group
0.001298	19	0	116	1.73	2.565e-06	68336	no rank	        Bacteroidetes/Chlorobi group
0.001298	19	0	115	1.74	2.663e-06	976	phylum	          Bacteroidetes
0.001161	17	0	108	1.78	1.417e-05	200643	class	            Bacteroidia
0.001161	17	0	108	1.78	1.608e-05	171549	order	              Bacteroidales
0.001161	17	0	107	1.78	3.981e-05	815	family	                Bacteroidaceae
0.001161	17	1	107	1.78	3.981e-05	816	genus	                  Bacteroides
0.0004782	7	7	43	1.77	0.0001637	28116	species	                    Bacteroides ovatus
0.0003416	5	5	30	1.67	0.0001421	821	species	                    Bacteroides vulgatus
0.0002733	4	4	19	1.89	6.054e-05	246787	species	                    Bacteroides cellulosilyticus
6.831e-05	1	0	3	1	1.613e-07	117743	class	            Flavobacteriia
6.831e-05	1	0	3	1	1.613e-07	200644	order	              Flavobacteriales
6.831e-05	1	1	2	1	1.119e-07	49546	family	                Flavobacteriaceae
6.831e-05	1	0	1	2	4.128e-07	1853228	class	            Chitinophagia
6.831e-05	1	0	1	2	4.128e-07	1853229	order	              Chitinophagales
6.831e-05	1	0	1	2	4.128e-07	563835	family	                Chitinophagaceae
6.831e-05	1	0	1	2	1.315e-06	79328	genus	                  Chitinophaga
6.831e-05	1	1	1	2	2.88e-06	2033437	species	                    Chitinophaga sp. MD30
6.831e-05	1	0	4	1	4.765e-07	1783257	no rank	      PVC group
6.831e-05	1	0	4	1	9.292e-07	203682	phylum	        Planctomycetes
6.831e-05	1	0	4	1	1.036e-06	203683	class	          Planctomycetia
6.831e-05	1	0	4	1	1.036e-06	112	order	            Planctomycetales
6.831e-05	1	0	4	1	1.65e-06	126	family	              Planctomycetaceae
6.831e-05	1	0	4	1	1.235e-05	265488	genus	                Rhodopirellula
6.831e-05	1	0	4	1	1.235e-05	265606	species	                  Rhodopirellula baltica
6.831e-05	1	1	4	1	1.235e-05	243090	no rank	                    Rhodopirellula baltica SH 1
0.0001366	2	0	14	2	1.578e-06	10239	superkingdom	  Viruses
0.0001366	2	0	14	2	0.0001578	12333	no rank	    unclassified bacterial viruses
0.0001366	2	0	14	2	0.003171	156614	no rank	      environmental samples
0.0001366	2	2	14	2	0.003171	1211417	species	        uncultured crAssphage
