#File	1-SAT_S1_mixed_with_5%_7-GC_S7_R1.fastq.gz
#Total	1463824
#Matched	1201305	82.06622%
#Name	Reads	ReadsPct
NZ_CP011394.1 Salmonella enterica subsp. enterica serovar Enteritidis str. 18569, complete genome	584090	39.90165%
NC_003198.1 Salmonella enterica subsp. enterica serovar Typhi str. CT18, complete genome	584435	39.92522%
NC_002946.2 Neisseria gonorrhoeae FA 1090 chromosome, complete genome	32476	2.21857%
NC_003384.1 Salmonella enterica subsp. enterica serovar Typhi str. CT18 plasmid pHCM1, complete sequence	304	0.02077%
