# KrakenUniq v0.5.7 DATE:2019-04-15T15:54:11Z DB:/home/biouser/SAM/DBDIR/LIBRARY_MINIKRAKEN/minikraken_20171019_8GB DB_SIZE:8053064728 WD:/home/biouser/SAM
# CL:perl /home/biouser/miniconda3/bin/krakenuniq --db /home/biouser/SAM/DBDIR/LIBRARY_MINIKRAKEN/minikraken_20171019_8GB -paired /home/biouser/SAM/data/10-KPN_S9_mixed_with_25%_7-GC_S7_R1.fastq.gz /home/biouser/SAM/data/10-KPN_S9_mixed_with_25%_7-GC_S7_R2.fastq.gz --report-file /home/biouser/SAM/data/10-KPN_S9_mixed_with_25%_7-GC_S7.krakenuniq.report.tsv

%	reads	taxReads	kmers	dup	cov	taxID	rank	taxName
0.7885	2098	2098	9902927	8.04	1.154	0	no rank	unclassified
99.21	263990	77	339687	10.6	0.0005127	1	no rank	root
99.18	263913	0	339134	10.6	0.0005191	131567	no rank	  cellular organisms
99.18	263913	537	339134	10.6	0.000537	2	superkingdom	    Bacteria
98.95	263283	678	337862	10.6	0.001063	1224	phylum	      Proteobacteria
74.03	196978	678	243245	11.2	0.001591	1236	class	        Gammaproteobacteria
73.7	196110	1850	240801	11.1	0.00573	91347	order	          Enterobacterales
72.97	194164	5208	232082	11.1	0.01114	543	family	            Enterobacteriaceae
70.04	186364	18175	202332	11.3	0.06868	570	genus	              Klebsiella
62.99	167602	164773	105915	11.2	0.1227	573	species	                Klebsiella pneumoniae
0.8148	2168	1393	506	8.75	0.006049	72407	subspecies	                  Klebsiella pneumoniae subsp. pneumoniae
0.1251	333	333	80	9.2	0.01112	1123862	no rank	                    Klebsiella pneumoniae subsp. pneumoniae Kp13
0.07554	201	201	47	7.36	0.005775	272620	no rank	                    Klebsiella pneumoniae subsp. pneumoniae MGH 78578
0.06802	181	181	41	8.51	0.004585	1328324	no rank	                    Klebsiella pneumoniae subsp. pneumoniae KPNIH27
0.01691	45	45	11	7.45	0.003059	1392499	no rank	                    Klebsiella pneumoniae subsp. pneumoniae 1158
0.003758	10	10	2	5.5	0.0009862	1125630	no rank	                    Klebsiella pneumoniae subsp. pneumoniae HS11286
0.001879	5	5	5	1.2	0.006935	1193292	no rank	                    Klebsiella pneumoniae subsp. pneumoniae 1084
0.1319	351	0	178	11.1	0.008093	39831	subspecies	                  Klebsiella pneumoniae subsp. rhinoscleromatis
0.1319	351	351	178	11.1	0.008093	861365	no rank	                    Klebsiella pneumoniae subsp. rhinoscleromatis SB3432
0.06051	161	161	69	6.33	0.01646	1365186	no rank	                  Klebsiella pneumoniae KP-1
0.03833	102	102	41	6.54	0.01001	1049565	no rank	                  Klebsiella pneumoniae KCTC 2242
0.01616	43	43	9	7.33	0.0003846	507522	no rank	                  Klebsiella pneumoniae 342
0.0007516	2	2	3	1	0.00297	1380908	no rank	                  Klebsiella pneumoniae JM45
0.0003758	1	1	2	1	0.007605	1420012	no rank	                  Klebsiella pneumoniae 30660/NJST258_1
0.0003758	1	1	1	1	0.001908	1244085	no rank	                  Klebsiella pneumoniae CG43
0.09095	242	233	106	10.9	0.0003417	548	species	                Klebsiella aerogenes
0.003382	9	9	7	4.29	0.0001537	1028307	no rank	                  Klebsiella aerogenes KCTC 2190
0.03796	101	92	63	6.11	0.0008636	244366	species	                Klebsiella variicola
0.003382	9	9	11	6.82	0.000758	640131	no rank	                  Klebsiella variicola At-22
0.0342	91	91	126	4.36	0.001067	2026240	species	                Klebsiella quasivariicola
0.03082	82	82	51	7.96	0.001497	1463165	species	                Klebsiella quasipneumoniae
0.02105	56	55	53	7.17	0.0001523	571	species	                Klebsiella oxytoca
0.0003758	1	1	3	2.33	0.0001794	1333852	no rank	                  Klebsiella oxytoca KONIH1
0.002631	7	7	3	5.67	8.98e-05	1934254	species	                Klebsiella sp. M5al
0.001879	5	1	9	1.78	4.278e-05	1134687	species	                Klebsiella michiganensis
0.001503	4	4	1	6	0.0002068	1006551	no rank	                  Klebsiella michiganensis KCTC 1686
0.001127	3	3	6	11.5	0.0002942	1905288	species	                Klebsiella sp. LTGPAF-6F
0.5307	1412	107	619	11.1	0.0002902	561	genus	              Escherichia
0.4713	1254	1185	532	10.8	0.0003178	562	species	                Escherichia coli
0.01841	49	0	65	10.4	0.003479	168807	no rank	                  Escherichia coli O127:H6
0.01841	49	49	65	10.4	0.003479	574521	no rank	                    Escherichia coli O127:H6 str. E2348/69
0.00451	12	12	3	9	0.0002633	696406	no rank	                  Escherichia coli UMNK88
0.001879	5	5	1	5	0.0003908	1329907	no rank	                  Escherichia coli APEC IMT5155
0.0003758	1	0	2	1	0.0007599	498388	no rank	                  Escherichia coli C
0.0003758	1	1	2	1	0.000771	481805	no rank	                    Escherichia coli ATCC 8739
0.0003758	1	1	1	1	0.0004587	1358422	no rank	                  Escherichia coli PCN061
0.0003758	1	1	1	1	0.001256	1311757	no rank	                  Escherichia coli ACN001
0.01917	51	21	13	11.8	5.517e-05	208962	species	                Escherichia albertii
0.01127	30	30	3	16.3	0.0001193	1440052	no rank	                  Escherichia albertii KF1
0.1642	437	2	239	8.53	6.257e-05	547	genus	              Enterobacter
0.1244	331	8	190	8.53	6.595e-05	354276	species group	                Enterobacter cloacae complex
0.09132	243	224	114	9.71	0.0001055	550	species	                  Enterobacter cloacae
0.00451	12	12	3	13.7	6.374e-05	1354030	no rank	                    Enterobacter cloacae P101
0.002631	7	0	4	13	7.93e-05	336306	subspecies	                    Enterobacter cloacae subsp. cloacae
0.002255	6	6	3	17	0.0002044	1211025	no rank	                      Enterobacter cloacae subsp. cloacae ENHKU01
0.0003758	1	1	1	1	2.801e-05	716541	no rank	                      Enterobacter cloacae subsp. cloacae ATCC 13047
0.01729	46	0	15	15.6	7.303e-05	158836	species	                  Enterobacter hormaechei
0.01729	46	46	14	15.4	0.0003678	299766	subspecies	                    Enterobacter hormaechei subsp. steigerwaltii
0.007516	20	10	14	6.43	5.704e-05	1334193	species	                  Enterobacter lignolyticus
0.003758	10	10	3	10.7	5.245e-05	701347	no rank	                    Enterobacter lignolyticus SCF1
0.005261	14	14	8	7.38	0.0003624	208224	species	                  Enterobacter kobei
0.0218	58	58	13	15.2	0.0005608	1827481	species	                Enterobacter sp. ODB01
0.01127	30	30	7	16.6	0.0001723	1868135	species	                Enterobacter sp. HK169
0.006013	16	16	10	5.8	4.836e-05	1692238	species	                Enterobacter sp. FY-07
0.1477	393	0	170	9.49	8.28e-05	590	genus	              Salmonella
0.1477	393	23	168	9.6	9.354e-05	28901	species	                Salmonella enterica
0.1282	341	176	122	11.2	0.000162	59201	subspecies	                  Salmonella enterica subsp. enterica
0.01691	45	0	9	18.2	0.003031	29482	no rank	                    Salmonella enterica subsp. enterica serovar Abony
0.01691	45	45	9	18.2	0.003031	1029983	no rank	                      Salmonella enterica subsp. enterica serovar Abony str. 0014
0.01165	31	0	11	7.73	0.00221	58096	no rank	                    Salmonella enterica subsp. enterica serovar Bareilly
0.01165	31	31	11	7.73	0.00221	1173427	no rank	                      Salmonella enterica subsp. enterica serovar Bareilly str. CFSAN000189
0.009771	26	26	4	20.5	0.000237	595	no rank	                    Salmonella enterica subsp. enterica serovar Infantis
0.005637	15	0	4	19.2	0.0003759	1242081	no rank	                    Salmonella enterica subsp. enterica serovar Hillingdon
0.005637	15	15	4	19.2	0.0003759	1242096	no rank	                      Salmonella enterica subsp. enterica serovar Hillingdon str. N1529-D3
0.00451	12	0	4	10.8	0.0002665	192954	no rank	                    Salmonella enterica subsp. enterica serovar Mbandaka
0.00451	12	12	4	10.8	0.0002665	984237	no rank	                      Salmonella enterica subsp. enterica serovar Mbandaka str. ATCC 51958
0.003007	8	8	4	10.5	0.0001757	90370	no rank	                    Salmonella enterica subsp. enterica serovar Typhi
0.002631	7	0	1	22	0.0001063	1242079	no rank	                    Salmonella enterica subsp. enterica serovar Apapa
0.002631	7	7	1	22	0.0001063	1242088	no rank	                      Salmonella enterica subsp. enterica serovar Apapa str. SA20060561
0.002631	7	0	1	20	0.0001384	82689	no rank	                    Salmonella enterica subsp. enterica serovar Muenster
0.002631	7	7	1	20	0.0001384	1124958	no rank	                      Salmonella enterica subsp. enterica serovar Muenster str. 0315
0.002255	6	0	2	11	0.0003679	115981	no rank	                    Salmonella enterica subsp. enterica serovar Montevideo
0.002255	6	6	2	11	0.0009005	859199	no rank	                      Salmonella enterica subsp. enterica serovar Montevideo str. 507440-20
0.0007516	2	2	1	10	3.776e-05	90371	no rank	                    Salmonella enterica subsp. enterica serovar Typhimurium
0.0007516	2	1	4	1	0.0002175	58712	no rank	                    Salmonella enterica subsp. enterica serovar Anatum
0.0003758	1	1	3	1	0.004127	1454584	no rank	                      Salmonella enterica subsp. enterica serovar Anatum str. USDA-ARS-USMARC-1727
0.0003758	1	0	1	5	0.0003166	340190	no rank	                    Salmonella enterica subsp. enterica serovar Schwarzengrund
0.0003758	1	1	1	5	0.0003166	439843	no rank	                      Salmonella enterica subsp. enterica serovar Schwarzengrund str. CVM19633
0.0003758	1	1	2	1	9.071e-05	108619	no rank	                    Salmonella enterica subsp. enterica serovar Newport
0.0003758	1	1	1	1	7.196e-05	28150	no rank	                    Salmonella enterica subsp. enterica serovar Senftenberg
0.0003758	1	1	1	1	5.678e-05	57743	no rank	                    Salmonella enterica subsp. enterica serovar Weltevreden
0.009771	26	25	14	9.43	0.0001073	59204	subspecies	                  Salmonella enterica subsp. diarizonae
0.0003758	1	0	1	1	5.215e-05	1243615	no rank	                    Salmonella enterica subsp. diarizonae serovar 65:c:z
0.0003758	1	1	1	1	5.215e-05	1243616	no rank	                      Salmonella enterica subsp. diarizonae serovar 65:c:z str. SA20044251
0.001127	3	0	6	5.33	3.531e-05	59202	subspecies	                  Salmonella enterica subsp. salamae
0.001127	3	0	3	4.67	3.061e-05	1243601	no rank	                    Salmonella enterica subsp. salamae serovar 55:k:z39
0.001127	3	3	3	4.67	3.061e-05	1243602	no rank	                      Salmonella enterica subsp. salamae serovar 55:k:z39 str. 1315K
0.0793	211	2	177	6.75	6.846e-05	544	genus	              Citrobacter
0.0699	186	6	146	7.36	0.0001168	1344959	species group	                Citrobacter freundii complex
0.05938	158	141	115	7.76	0.0002083	546	species	                  Citrobacter freundii
0.006389	17	17	7	8.57	6.32e-05	1333848	no rank	                    Citrobacter freundii CFNIH1
0.007892	21	21	17	5.65	5.902e-05	67827	species	                  Citrobacter werkmanii
0.0003758	1	1	7	6.43	4.111e-05	57706	species	                  Citrobacter braakii
0.006013	16	0	2	18	1.001e-05	67825	species	                Citrobacter rodentium
0.006013	16	16	2	18	1.001e-05	637910	no rank	                  Citrobacter rodentium ICC168
0.002631	7	7	5	5.6	3.035e-05	67824	species	                Citrobacter farmeri
0.03232	86	0	71	8.45	0.0003079	579	genus	              Kluyvera
0.03232	86	86	71	8.45	0.0003079	61648	species	                Kluyvera intermedia
0.006389	17	0	11	6.27	1.658e-05	158483	genus	              Cedecea
0.006389	17	17	11	6.27	1.658e-05	158822	species	                Cedecea neteri
0.005261	14	0	39	3.28	7.18e-05	160674	genus	              Raoultella
0.005261	14	14	39	3.28	7.18e-05	54291	species	                Raoultella ornithinolytica
0.003007	8	0	17	5.82	1.756e-05	1330547	genus	              Kosakonia
0.003007	8	8	12	6.92	3.752e-05	208223	species	                Kosakonia cowanii
0.001879	5	2	4	8.5	7.877e-06	1330545	genus	              Lelliottia
0.001127	3	3	2	11	1.144e-05	1907578	species	                Lelliottia sp. PFL01
0.001503	4	1	26	3.96	2.138e-05	413496	genus	              Cronobacter
0.001127	3	0	3	3.33	2.299e-05	413502	species	                Cronobacter turicensis
0.001127	3	3	3	3.33	2.299e-05	693216	no rank	                  Cronobacter turicensis z3032
0.001127	3	0	5	1	5.745e-05	620	genus	              Shigella
0.0003758	1	0	2	1	9.683e-05	622	species	                Shigella dysenteriae
0.0003758	1	1	2	1	9.683e-05	300267	no rank	                  Shigella dysenteriae Sd197
0.0003758	1	0	2	1	7.106e-05	623	species	                Shigella flexneri
0.0003758	1	0	2	1	0.001333	42897	no rank	                  Shigella flexneri 2a
0.0003758	1	1	2	1	0.004566	198215	no rank	                    Shigella flexneri 2a str. 2457T
0.0003758	1	1	1	1	5.201e-05	621	species	                Shigella boydii
0.0003758	1	0	3	2.33	3.149e-06	191675	no rank	              unclassified Enterobacteriaceae
0.0003758	1	0	3	2.33	8.56e-06	36866	no rank	                unclassified Enterobacteriaceae (miscellaneous)
0.0003758	1	1	1	1	6.21e-06	891974	species	                  Plautia stali symbiont
0.0003758	1	0	5	1	2.868e-05	1335483	genus	              Shimwellia
0.0003758	1	0	5	1	2.868e-05	563	species	                Shimwellia blattae
0.0003758	1	1	5	1	2.868e-05	630626	no rank	                  Shimwellia blattae DSM 4481 = NBRC 105725
0.01841	49	0	52	8.08	7.705e-06	1903411	family	            Yersiniaceae
0.01841	49	0	43	8.4	1.185e-05	613	genus	              Serratia
0.01428	38	21	23	11.3	2.221e-05	615	species	                Serratia marcescens
0.006389	17	17	4	16	4.156e-05	1249634	no rank	                  Serratia marcescens FGI94
0.004134	11	11	4	11.5	4.02e-05	61652	species	                Serratia rubidaea
0.01578	42	0	27	9.96	8.196e-06	1903414	family	            Morganellaceae
0.01503	40	0	20	12.6	8.374e-05	581	genus	              Morganella
0.01503	40	40	20	12.6	8.374e-05	582	species	                Morganella morganii
0.0003758	1	0	2	6	1.917e-06	626	genus	              Xenorhabdus
0.0003758	1	1	1	1	5.435e-06	628	species	                Xenorhabdus nematophila
0.0003758	1	0	2	1	2.014e-06	586	genus	              Providencia
0.0003758	1	0	2	1	1.278e-05	516075	species	                Providencia sneebia
0.0003758	1	1	2	1	1.278e-05	1141660	no rank	                  Providencia sneebia DSM 19967
0.001127	3	0	23	3.7	4.644e-06	1903410	family	            Pectobacteriaceae
0.001127	3	1	17	4.24	6.743e-06	204037	genus	              Dickeya
0.0007516	2	2	1	20	1.038e-05	568766	species	                Dickeya sp. NCPPB 3274
0.0003758	1	0	22	2.77	5.494e-06	1903409	family	            Erwiniaceae
0.0003758	1	0	6	3.83	5.804e-06	551	genus	              Erwinia
0.0003758	1	0	1	1	5.919e-06	338565	species	                Erwinia tasmaniensis
0.0003758	1	1	1	1	5.919e-06	465817	no rank	                  Erwinia tasmaniensis Et1/99
0.0003758	1	0	13	1	8.361e-06	1903412	family	            Hafniaceae
0.0003758	1	1	12	1	1.48e-05	635	genus	              Edwardsiella
0.06464	172	0	86	16.1	8.277e-06	135623	order	          Vibrionales
0.06464	172	0	86	16.1	8.277e-06	641	family	            Vibrionaceae
0.06464	172	0	86	16.1	1.012e-05	662	genus	              Vibrio
0.05788	154	154	78	16.6	0.0002986	674	species	                Vibrio mimicus
0.006765	18	0	5	16.8	2.542e-05	29494	species	                Vibrio furnissii
0.006765	18	18	5	16.8	2.542e-05	903510	no rank	                  Vibrio furnissii NCTC 11218
0.003007	8	0	16	4.12	9.896e-07	135622	order	          Alteromonadales
0.002631	7	0	9	6.56	1.729e-06	72275	family	            Alteromonadaceae
0.002255	6	0	5	10.2	2.434e-06	2742	genus	              Marinobacter
0.002255	6	0	4	12.2	1.404e-05	2743	species	                Marinobacter hydrocarbonoclasticus
0.002255	6	6	4	12.2	3.612e-05	351348	no rank	                  Marinobacter hydrocarbonoclasticus VT8
0.0003758	1	0	3	2.33	1.441e-06	226	genus	              Alteromonas
0.0003758	1	1	2	3	4.054e-06	314275	species	                Alteromonas mediterranea
0.0003758	1	0	2	1	5.922e-06	267894	family	            Psychromonadaceae
0.0003758	1	0	2	1	5.922e-06	67572	genus	              Psychromonas
0.0003758	1	0	1	1	4.952e-06	357794	species	                Psychromonas ingrahamii
0.0003758	1	1	1	1	4.952e-06	357804	no rank	                  Psychromonas ingrahamii 37
0.002631	7	0	9	6.78	3.135e-06	135624	order	          Aeromonadales
0.002631	7	0	9	6.78	3.135e-06	84642	family	            Aeromonadaceae
0.002631	7	0	9	6.78	4.289e-06	642	genus	              Aeromonas
0.002631	7	7	4	14	2.222e-05	652	species	                Aeromonas schubertii
0.0003758	1	0	13	4.08	2.976e-07	72274	order	          Pseudomonadales
0.0003758	1	0	13	4.08	3.432e-07	135621	family	            Pseudomonadaceae
0.0003758	1	0	12	4.33	3.231e-07	286	genus	              Pseudomonas
0.0003758	1	0	4	1	1.228e-06	136845	species group	                Pseudomonas putida group
0.0003758	1	0	4	1	1.854e-06	303	species	                  Pseudomonas putida
0.0003758	1	1	3	1	0.000324	1193499	no rank	                    Pseudomonas putida SJTE-1
0.0003758	1	0	6	1.17	8.119e-07	135619	order	          Oceanospirillales
0.0003758	1	0	5	1.2	1.429e-06	28256	family	            Halomonadaceae
0.0003758	1	1	2	1.5	6.535e-06	504090	genus	              Kushneria
0.0003758	1	0	2	2	7.749e-07	72273	order	          Thiotrichales
0.0003758	1	0	2	2	2.116e-06	135616	family	            Piscirickettsiaceae
0.0003758	1	0	2	2	1.82e-05	28884	genus	              Hydrogenovibrio
0.0003758	1	0	2	2	1.82e-05	39765	species	                Hydrogenovibrio crunogenus
0.0003758	1	1	2	2	1.82e-05	317025	no rank	                  Hydrogenovibrio crunogenus XCL-2
24.66	65606	2	96225	8.69	0.001609	28216	class	        Betaproteobacteria
24.54	65297	15	93493	8.89	0.03299	206351	order	          Neisseriales
24.53	65282	30	93493	8.88	0.06136	481	family	            Neisseriaceae
24.52	65252	5187	92752	8.88	0.08036	482	genus	              Neisseria
22.54	59985	58799	41477	10.4	0.6344	485	species	                Neisseria gonorrhoeae
0.357	950	950	102	19.4	0.1474	528354	no rank	                  Neisseria gonorrhoeae MS11
0.05788	154	154	6	41.7	0.02727	521006	no rank	                  Neisseria gonorrhoeae NCCP11945
0.03082	82	82	31	5.77	0.02211	242231	no rank	                  Neisseria gonorrhoeae FA 1090
0.02593	69	56	190	3.82	0.0009551	487	species	                Neisseria meningitidis
0.002255	6	6	7	5.86	0.003535	942513	no rank	                  Neisseria meningitidis WUE 2594
0.001127	3	0	3	2.67	0.001978	65699	no rank	                  Neisseria meningitidis serogroup A
0.001127	3	3	3	2.67	0.001978	122587	no rank	                    Neisseria meningitidis Z2491
0.001127	3	0	1	7	0.000464	491	no rank	                  Neisseria meningitidis serogroup B
0.001127	3	3	1	7	0.0005504	630588	no rank	                    Neisseria meningitidis alpha710
0.0003758	1	1	1	13	0.0007918	935590	no rank	                  Neisseria meningitidis M0579
0.003758	10	9	37	2.89	0.0005164	486	species	                Neisseria lactamica
0.0003758	1	1	9	4.11	0.000366	489653	no rank	                  Neisseria lactamica 020-06
0.0003758	1	1	3	1	2.823e-05	326523	species	                Neisseria zoodegmatis
0.1154	307	1	2536	1.13	4.991e-05	80840	order	          Burkholderiales
0.1135	302	4	2458	1.13	9.247e-05	119060	family	            Burkholderiaceae
0.1116	297	18	2339	1.13	0.0009859	48736	genus	              Ralstonia
0.09207	245	68	1795	1.13	0.004871	329	species	                Ralstonia pickettii
0.03533	94	94	461	1.13	0.003658	428406	no rank	                  Ralstonia pickettii 12D
0.03119	83	83	569	1.1	0.005322	402626	no rank	                  Ralstonia pickettii 12J
0.009395	25	25	201	1.16	0.001228	105219	species	                Ralstonia mannitolilytica
0.002255	6	5	19	1.05	1.771e-05	305	species	                Ralstonia solanacearum
0.0003758	1	1	1	2	4.9e-05	267608	no rank	                  Ralstonia solanacearum GMI1000
0.001127	3	3	20	1.1	5.463e-05	190721	species	                Ralstonia insidiosa
0.0003758	1	0	7	1	4.777e-07	32008	genus	              Burkholderia
0.0003758	1	1	5	1	6.467e-07	87882	species group	                Burkholderia cepacia complex
0.001127	3	0	27	1.11	3.058e-06	80864	family	            Comamonadaceae
0.0007516	2	0	19	1.16	1.346e-05	12916	genus	              Acidovorax
0.0007516	2	2	19	1.16	0.0001372	1858609	species	                Acidovorax sp. T1
0.0003758	1	0	5	1	2.16e-05	201096	genus	              Alicycliphilus
0.0003758	1	0	5	1	2.16e-05	179636	species	                Alicycliphilus denitrificans
0.0003758	1	1	5	1	0.0001159	596153	no rank	                  Alicycliphilus denitrificans BC
0.0003758	1	0	1	1	3.526e-07	119065	no rank	            unclassified Burkholderiales
0.0003758	1	1	1	1	3.516e-06	413882	species	              [Polyangium] brachysporum
0.007892	21	2	46	1.89	5.96e-07	28211	class	        Alphaproteobacteria
0.003382	9	0	17	1	1.368e-06	204455	order	          Rhodobacterales
0.003382	9	1	17	1	1.443e-06	31989	family	            Rhodobacteraceae
0.001503	4	0	7	1	9.085e-06	265	genus	              Paracoccus
0.0007516	2	2	3	1	1.5e-05	147645	species	                Paracoccus yeei
0.0003758	1	0	3	1	1.36e-05	266	species	                Paracoccus denitrificans
0.0003758	1	1	3	1	1.36e-05	318586	no rank	                  Paracoccus denitrificans PD1222
0.0003758	1	0	1	1	4.668e-06	34003	species	                Paracoccus aminophilus
0.0003758	1	1	1	1	4.668e-06	1367847	no rank	                  Paracoccus aminophilus JCM 7686
0.0007516	2	0	2	1	1.802e-06	1060	genus	              Rhodobacter
0.0003758	1	0	1	1	1.683e-06	1063	species	                Rhodobacter sphaeroides
0.0003758	1	1	1	1	5.498e-06	349102	no rank	                  Rhodobacter sphaeroides ATCC 17025
0.0003758	1	0	1	1	5.986e-06	1061	species	                Rhodobacter capsulatus
0.0003758	1	1	1	1	5.986e-06	272942	no rank	                  Rhodobacter capsulatus SB 1003
0.0003758	1	0	1	1	4.513e-06	367771	genus	              Marinovum
0.0003758	1	0	1	1	4.513e-06	42444	species	                Marinovum algicola
0.0003758	1	1	1	1	4.513e-06	988812	no rank	                  Marinovum algicola DG 898
0.0003758	1	0	1	1	1.577e-06	34008	genus	              Rhodovulum
0.0003758	1	1	1	1	6.596e-06	308754	species	                Rhodovulum sp. MB263
0.002631	7	1	14	1.07	3.614e-07	356	order	          Rhizobiales
0.001127	3	0	4	1.25	4.078e-07	41294	family	            Bradyrhizobiaceae
0.0007516	2	0	2	1.5	3.318e-07	374	genus	              Bradyrhizobium
0.0003758	1	1	1	2	9.098e-07	1437360	species	                Bradyrhizobium erythrophlei
0.0003758	1	1	1	1	3.686e-06	335659	species	                Bradyrhizobium sp. S23321
0.0003758	1	0	1	1	9.668e-07	85413	genus	              Bosea
0.0003758	1	1	1	1	4.205e-06	1792307	species	                Bosea sp. PAMC 26642
0.0003758	1	0	3	1	2.254e-07	82115	family	            Rhizobiaceae
0.0003758	1	0	2	1	2.253e-07	227290	no rank	              Rhizobium/Agrobacterium group
0.0003758	1	1	2	1	3.116e-07	379	genus	                Rhizobium
0.0003758	1	1	2	1	2.89e-06	335928	family	            Xanthobacteraceae
0.0003758	1	0	1	1	2.593e-07	69277	family	            Phyllobacteriaceae
0.0003758	1	1	1	1	3.629e-07	68287	genus	              Mesorhizobium
0.0007516	2	0	5	4.8	5.849e-07	204441	order	          Rhodospirillales
0.0003758	1	0	3	7.33	7.072e-07	433	family	            Acetobacteraceae
0.0003758	1	0	1	1	4.149e-06	125216	genus	              Roseomonas
0.0003758	1	1	1	1	4.149e-06	257708	species	                Roseomonas gilardii
0.0003758	1	0	1	1	2.323e-07	41295	family	            Rhodospirillaceae
0.0003758	1	0	1	1	5.819e-07	191	genus	              Azospirillum
0.0003758	1	1	1	1	1.403e-06	192	species	                Azospirillum brasilense
0.0003758	1	0	2	1	1.773e-07	204457	order	          Sphingomonadales
0.0003758	1	0	1	1	1.137e-07	41297	family	            Sphingomonadaceae
0.0003758	1	0	1	1	5.155e-06	150203	genus	              Blastomonas
0.0003758	1	1	1	1	5.155e-06	1842535	species	                Blastomonas sp. RAC04
0.03458	92	27	131	5.37	5.39e-07	1783272	no rank	      Terrabacteria group
0.02067	55	52	67	8.3	7.184e-07	1239	phylum	        Firmicutes
0.0007516	2	0	21	2.76	3.202e-07	91061	class	          Bacilli
0.0007516	2	0	16	1.56	8.495e-07	186826	order	            Lactobacillales
0.0007516	2	0	11	1.55	1.783e-06	1300	family	              Streptococcaceae
0.0007516	2	1	11	1.55	2.13e-06	1301	genus	                Streptococcus
0.0003758	1	1	1	2	4.203e-06	1304	species	                  Streptococcus salivarius
0.0003758	1	0	19	1.37	7.956e-07	186801	class	          Clostridia
0.0003758	1	0	19	1.37	9.376e-07	186802	order	            Clostridiales
0.0003758	1	0	19	1.37	6.807e-06	186803	family	              Lachnospiraceae
0.0003758	1	0	19	1.37	0.0001273	186928	no rank	                unclassified Lachnospiraceae
0.0003758	1	0	19	1.37	0.0001273	39491	species	                  [Eubacterium] rectale
0.0003758	1	1	19	1.37	0.0001273	515619	no rank	                    [Eubacterium] rectale ATCC 33656
0.003758	10	0	60	1.18	5.332e-07	201174	phylum	        Actinobacteria
0.003758	10	1	59	1.19	5.399e-07	1760	class	          Actinobacteria
0.001503	4	0	24	1.21	4.707e-06	85009	order	            Propionibacteriales
0.001503	4	0	24	1.21	9.263e-06	31957	family	              Propionibacteriaceae
0.001127	3	0	16	1.31	3.333e-05	1912216	genus	                Cutibacterium
0.001127	3	3	16	1.31	8.202e-05	1747	species	                  Cutibacterium acnes
0.0003758	1	0	8	1	3.038e-05	1743	genus	                Propionibacterium
0.0003758	1	1	8	1	7.26e-05	671223	species	                  Propionibacterium sp. oral taxon 193
0.0007516	2	0	4	1.75	4.342e-07	85010	order	            Pseudonocardiales
0.0007516	2	0	4	1.75	4.342e-07	2070	family	              Pseudonocardiaceae
0.0007516	2	0	2	1.5	9.746e-07	1813	genus	                Amycolatopsis
0.0003758	1	0	1	2	3.191e-06	1814	species	                  Amycolatopsis methanolica
0.0003758	1	1	1	2	3.191e-06	1068978	no rank	                    Amycolatopsis methanolica 239
0.0003758	1	1	1	1	1.732e-06	31958	species	                  Amycolatopsis orientalis
0.0003758	1	0	22	1.09	1.262e-06	85006	order	            Micrococcales
0.0003758	1	0	22	1.09	4.036e-06	1268	family	              Micrococcaceae
0.0003758	1	0	22	1.09	0.0002045	1269	genus	                Micrococcus
0.0003758	1	1	22	1.09	0.0002045	1270	species	                  Micrococcus luteus
0.0003758	1	0	2	1	2.906e-06	1643682	order	            Geodermatophilales
0.0003758	1	0	2	1	2.906e-06	85030	family	              Geodermatophilaceae
0.0003758	1	0	1	1	4.337e-06	1860	genus	                Geodermatophilus
0.0003758	1	0	1	1	4.337e-06	1861	species	                  Geodermatophilus obscurus
0.0003758	1	1	1	1	4.337e-06	526225	no rank	                    Geodermatophilus obscurus DSM 43160
0.0003758	1	0	2	1	7.209e-08	85011	order	            Streptomycetales
0.0003758	1	0	2	1	7.209e-08	2062	family	              Streptomycetaceae
0.0003758	1	0	2	1	7.492e-08	1883	genus	                Streptomyces
0.0003758	1	1	1	1	3.917e-06	408015	species	                  Streptomyces xiamenensis
0.0003758	1	0	8	1.75	1.742e-07	1783270	no rank	      FCB group
0.0003758	1	0	8	1.75	1.769e-07	68336	no rank	        Bacteroidetes/Chlorobi group
0.0003758	1	0	8	1.75	1.852e-07	976	phylum	          Bacteroidetes
0.0003758	1	0	8	1.75	1.05e-06	200643	class	            Bacteroidia
0.0003758	1	0	8	1.75	1.191e-06	171549	order	              Bacteroidales
0.0003758	1	0	8	1.75	6.025e-06	171552	family	                Prevotellaceae
0.0003758	1	0	8	1.75	6.025e-06	838	genus	                  Prevotella
0.0003758	1	1	8	1.75	3.294e-05	28131	species	                    Prevotella intermedia
