# KrakenUniq v0.5.7 DATE:2019-04-15T17:12:25Z DB:/home/biouser/SAM/DBDIR/LIBRARY_MINIKRAKEN/minikraken_20171019_8GB DB_SIZE:8053064728 WD:/home/biouser/SAM
# CL:perl /home/biouser/miniconda3/bin/krakenuniq --db /home/biouser/SAM/DBDIR/LIBRARY_MINIKRAKEN/minikraken_20171019_8GB -paired /home/biouser/SAM/data/7-GC_S7_R1.fastq.gz /home/biouser/SAM/data/7-GC_S7_R2.fastq.gz --report-file /home/biouser/SAM/data/7-GC_S7.krakenuniq.report.tsv

%	reads	taxReads	kmers	dup	cov	taxID	rank	taxName
0.615	3814	3814	7998815	22.3	0.9319	0	no rank	unclassified
99.39	616380	0	99253	81.9	0.0001498	1	no rank	root
99.39	616380	4	99253	81.8	0.0001519	131567	no rank	  cellular organisms
99.38	616376	2345	99253	81.8	0.0001572	2	superkingdom	    Bacteria
98.88	613264	4287	98831	81.3	0.0003111	1224	phylum	      Proteobacteria
98.18	608932	40	97382	81.5	0.001628	28216	class	        Betaproteobacteria
98.17	608864	149	97214	81.4	0.03431	206351	order	          Neisseriales
98.15	608715	243	97214	81.3	0.0638	481	family	            Neisseriaceae
98.11	608471	46537	96353	81.4	0.08348	482	genus	              Neisseria
90.47	561119	549542	42476	96.4	0.6497	485	species	                Neisseria gonorrhoeae
1.475	9147	9147	111	168	0.1604	528354	no rank	                  Neisseria gonorrhoeae MS11
0.2465	1529	1529	8	311	0.03636	521006	no rank	                  Neisseria gonorrhoeae NCCP11945
0.1453	901	901	54	37.6	0.03852	242231	no rank	                  Neisseria gonorrhoeae FA 1090
0.1125	698	586	1073	6.85	0.005394	487	species	                Neisseria meningitidis
0.008223	51	51	8	53.1	0.00404	942513	no rank	                  Neisseria meningitidis WUE 2594
0.00516	32	0	8	10.1	0.003712	491	no rank	                  Neisseria meningitidis serogroup B
0.00516	32	32	7	11.4	0.003853	630588	no rank	                    Neisseria meningitidis alpha710
0.002419	15	0	10	5.1	0.006592	65699	no rank	                  Neisseria meningitidis serogroup A
0.002419	15	15	10	5.1	0.006592	122587	no rank	                    Neisseria meningitidis Z2491
0.000645	4	4	32	1.12	0.00484	662598	no rank	                  Neisseria meningitidis alpha14
0.000645	4	0	30	1.1	0.003282	135720	no rank	                  Neisseria meningitidis serogroup C
0.0004837	3	3	21	1.1	0.004036	374833	no rank	                    Neisseria meningitidis 053442
0.0001612	1	1	7	1.14	0.002041	604162	no rank	                    Neisseria meningitidis 8013
0.0003225	2	2	3	17	0.002375	935590	no rank	                  Neisseria meningitidis M0579
0.0001612	1	1	15	5.73	0.004842	935588	no rank	                  Neisseria meningitidis M01-240355
0.0001612	1	1	11	1.18	0.004386	935593	no rank	                  Neisseria meningitidis M04-240196
0.0001612	1	1	1	5	0.0025	935599	no rank	                  Neisseria meningitidis G2136
0.0001612	1	1	1	1	0.025	1095685	no rank	                  Neisseria meningitidis M7124
0.01612	100	83	270	3.79	0.003769	486	species	                Neisseria lactamica
0.002741	17	17	94	3.57	0.003822	489653	no rank	                  Neisseria lactamica 020-06
0.0009674	6	6	62	1.98	0.0006065	490	species	                Neisseria sicca
0.0004837	3	3	19	1.21	0.0001865	655307	species	                Neisseria sp. KEM232
0.0003225	2	0	29	1.14	0.0003246	495	species	                Neisseria elongata
0.0003225	2	0	29	1.14	0.0003246	88719	subspecies	                  Neisseria elongata subsp. glycolytica
0.0003225	2	2	29	1.14	0.0003246	546263	no rank	                    Neisseria elongata subsp. glycolytica ATCC 29315
0.0003225	2	2	24	1.04	0.0002233	1853278	species	                Neisseria sp. 10023
0.0003225	2	2	12	1.17	0.0001126	1853276	species	                Neisseria sp. 10022
0.0001612	1	1	13	1	0.0001223	326523	species	                Neisseria zoodegmatis
0.0001612	1	1	7	1.14	7.696e-05	28091	species	                Neisseria weaveri
0.0001612	1	0	10	1	0.0001084	538	genus	              Eikenella
0.0001612	1	1	10	1	0.0001084	539	species	                Eikenella corrodens
0.004515	28	0	322	1.09	6.337e-06	80840	order	          Burkholderiales
0.004192	26	0	298	1.09	1.121e-05	119060	family	            Burkholderiaceae
0.004031	25	0	281	1.06	0.0001184	48736	genus	              Ralstonia
0.003709	23	3	230	1.03	0.0006242	329	species	                Ralstonia pickettii
0.001774	11	11	76	1.04	0.0007108	402626	no rank	                  Ralstonia pickettii 12J
0.001451	9	9	58	1.02	0.0004603	428406	no rank	                  Ralstonia pickettii 12D
0.0003225	2	2	18	1.33	0.00011	105219	species	                Ralstonia mannitolilytica
0.0001612	1	0	4	4	2.73e-07	32008	genus	              Burkholderia
0.0001612	1	0	2	6.5	2.587e-07	87882	species group	                Burkholderia cepacia complex
0.0001612	1	0	1	12	0.003145	152500	species	                  Burkholderia dolosa
0.0001612	1	1	1	12	0.003984	1385930	no rank	                    Burkholderia dolosa PC543
0.0001612	1	0	10	1	1.372e-06	506	family	            Alcaligenaceae
0.0001612	1	0	2	1	2.267e-05	1472344	genus	              Basilea
0.0001612	1	0	2	1	2.267e-05	1472345	species	                Basilea psittacipulmonis
0.0001612	1	1	2	1	2.267e-05	1072685	no rank	                  Basilea psittacipulmonis DSM 24701
0.0001612	1	0	7	1	7.927e-07	80864	family	            Comamonadaceae
0.0001612	1	1	1	1	7.085e-07	12916	genus	              Acidovorax
0.006933	43	2	385	1.24	2.519e-06	1236	class	        Gammaproteobacteria
0.006127	38	1	317	1.26	7.543e-06	91347	order	          Enterobacterales
0.005966	37	3	302	1.27	1.45e-05	543	family	            Enterobacteriaceae
0.00387	24	0	239	1.23	0.0001164	590	genus	              Salmonella
0.00387	24	22	212	1.23	0.000118	28901	species	                Salmonella enterica
0.0003225	2	0	16	1.19	2.125e-05	59201	subspecies	                  Salmonella enterica subsp. enterica
0.0001612	1	1	13	1	0.0004908	90371	no rank	                    Salmonella enterica subsp. enterica serovar Typhimurium
0.0001612	1	1	2	2	8.786e-05	90370	no rank	                    Salmonella enterica subsp. enterica serovar Typhi
0.001129	7	0	26	1.27	1.219e-05	561	genus	              Escherichia
0.001129	7	5	26	1.27	1.553e-05	562	species	                Escherichia coli
0.0001612	1	1	1	2	0.0008628	741093	no rank	                  Escherichia coli Xuzhou21
0.0001612	1	0	1	1	0.0005666	1038927	no rank	                  Escherichia coli O104:H4
0.0001612	1	1	1	1	0.008475	1048254	no rank	                    Escherichia coli O104:H4 str. C227-11
0.0004837	3	0	8	1.38	2.715e-06	570	genus	              Klebsiella
0.0003225	2	2	4	1.75	1.289e-05	548	species	                Klebsiella aerogenes
0.0001612	1	1	4	1	4.636e-06	573	species	                Klebsiella pneumoniae
0.0003225	2	0	11	1.09	2.518e-07	72274	order	          Pseudomonadales
0.0003225	2	0	2	1	3.449e-07	468	family	            Moraxellaceae
0.0003225	2	1	2	1	5.352e-07	469	genus	              Acinetobacter
0.0001612	1	0	1	1	6.954e-07	909768	species group	                Acinetobacter calcoaceticus/baumannii complex
0.0001612	1	0	1	1	1.82e-06	470	species	                  Acinetobacter baumannii
0.0001612	1	1	1	1	0.001351	1100841	no rank	                    Acinetobacter baumannii TYTH-1
0.0001612	1	0	2	1.5	4.568e-07	135613	order	          Chromatiales
0.0001612	1	0	2	1.5	1.046e-06	72276	family	            Ectothiorhodospiraceae
0.0001612	1	0	1	2	2.15e-06	1765964	genus	              Acidihalobacter
0.0001612	1	1	1	2	6.604e-06	1765967	species	                Acidihalobacter ferrooxidans
0.0003225	2	0	13	1	1.684e-07	28211	class	        Alphaproteobacteria
0.0003225	2	0	6	1	1.549e-07	356	order	          Rhizobiales
0.0001612	1	0	3	1	2.254e-07	82115	family	            Rhizobiaceae
0.0001612	1	0	2	1	5.277e-07	227292	no rank	              Sinorhizobium/Ensifer group
0.0001612	1	0	2	1	6.948e-07	28105	genus	                Sinorhizobium
0.0001612	1	1	2	1	2.433e-06	382	species	                  Sinorhizobium meliloti
0.0001612	1	0	1	1	2.362e-06	119042	no rank	            unclassified Rhizobiales
0.0001612	1	0	1	1	3.726e-06	1734920	genus	              Pseudorhodoplanes
0.0001612	1	1	1	1	3.726e-06	1235591	species	                Pseudorhodoplanes sinuspersici
0.1237	767	314	66	80.9	2.716e-07	1783272	no rank	      Terrabacteria group
0.07288	452	447	45	97.5	4.825e-07	1239	phylum	        Firmicutes
0.000645	4	0	15	1.13	2.287e-07	91061	class	          Bacilli
0.000645	4	0	11	1.09	5.84e-07	186826	order	            Lactobacillales
0.0003225	2	0	6	1	9.725e-07	1300	family	              Streptococcaceae
0.0003225	2	0	6	1	1.162e-06	1301	genus	                Streptococcus
0.0001612	1	0	4	1	2.393e-05	28037	species	                  Streptococcus mitis
0.0001612	1	1	4	1	7.833e-05	365659	no rank	                    Streptococcus mitis B6
0.0001612	1	1	2	1	9.108e-06	1311	species	                  Streptococcus agalactiae
0.0001612	1	0	3	1	4.072e-07	33958	family	              Lactobacillaceae
0.0001612	1	0	3	1	4.363e-07	1578	genus	                Lactobacillus
0.0001612	1	1	3	1	3.172e-05	1601	species	                  Lactobacillus agilis
0.0001612	1	0	1	2	4.072e-07	81852	family	              Enterococcaceae
0.0001612	1	0	1	2	5.077e-07	1350	genus	                Enterococcus
0.0001612	1	1	1	2	2.989e-06	1352	species	                  Enterococcus faecium
0.0001612	1	0	2	1	8.374e-08	186801	class	          Clostridia
0.0001612	1	0	2	1	9.869e-08	186802	order	            Clostridiales
0.0001612	1	0	1	1	1.245e-06	186804	family	              Peptostreptococcaceae
0.0001612	1	0	1	1	1.207e-05	44259	genus	                Filifactor
0.0001612	1	0	1	1	1.207e-05	143361	species	                  Filifactor alocis
0.0001612	1	1	1	1	1.207e-05	546269	no rank	                    Filifactor alocis ATCC 35896
0.0001612	1	0	12	1.67	1.066e-07	201174	phylum	        Actinobacteria
0.0001612	1	0	12	1.67	1.098e-07	1760	class	          Actinobacteria
0.0001612	1	0	9	1.89	5.163e-07	85006	order	            Micrococcales
0.0001612	1	0	9	1.89	1.651e-06	1268	family	              Micrococcaceae
0.0001612	1	0	9	1.89	2.656e-05	32207	genus	                Rothia
0.0001612	1	1	9	1.89	3.979e-05	43675	species	                  Rothia mucilaginosa
