# KrakenUniq v0.5.7 DATE:2019-04-15T17:37:52Z DB:/home/biouser/SAM/DBDIR/LIBRARY_MINIKRAKEN/minikraken_20171019_8GB DB_SIZE:8053064728 WD:/home/biouser/SAM
# CL:perl /home/biouser/miniconda3/bin/krakenuniq --db /home/biouser/SAM/DBDIR/LIBRARY_MINIKRAKEN/minikraken_20171019_8GB -paired /home/biouser/SAM/data/7-GC_S7_mixed_with_25%_4-NTS_S4_R1.fastq.gz /home/biouser/SAM/data/7-GC_S7_mixed_with_25%_4-NTS_S4_R2.fastq.gz --report-file /home/biouser/SAM/data/7-GC_S7_mixed_with_25%_4-NTS_S4.krakenuniq.report.tsv

%	reads	taxReads	kmers	dup	cov	taxID	rank	taxName
0.4805	2980	2980	12725877	14.1	1.483	0	no rank	unclassified
99.52	617214	1731	321798	25.5	0.0004857	1	no rank	root
99.24	615481	2	319303	25.5	0.0004888	131567	no rank	  cellular organisms
99.24	615479	1946	319303	25.5	0.0005056	2	superkingdom	    Bacteria
98.83	612947	3427	318638	25.3	0.001003	1224	phylum	      Proteobacteria
73.63	456650	33	97088	61.1	0.001623	28216	class	        Betaproteobacteria
73.62	456581	110	96778	61.1	0.03415	206351	order	          Neisseriales
73.6	456471	187	96778	61.1	0.06352	481	family	            Neisseriaceae
73.57	456283	35070	95925	61.1	0.08311	482	genus	              Neisseria
67.82	420594	412002	42356	72.3	0.6478	485	species	                Neisseria gonorrhoeae
1.095	6791	6791	105	131	0.1517	528354	no rank	                  Neisseria gonorrhoeae MS11
0.1827	1133	1133	8	230	0.03636	521006	no rank	                  Neisseria gonorrhoeae NCCP11945
0.1077	668	668	53	29	0.0378	242231	no rank	                  Neisseria gonorrhoeae FA 1090
0.08481	526	445	887	6.25	0.004459	487	species	                Neisseria meningitidis
0.005966	37	37	8	40.9	0.00404	942513	no rank	                  Neisseria meningitidis WUE 2594
0.004031	25	0	7	8.71	0.003248	491	no rank	                  Neisseria meningitidis serogroup B
0.004031	25	25	7	8.71	0.003853	630588	no rank	                    Neisseria meningitidis alpha710
0.001612	10	0	9	3.78	0.005933	65699	no rank	                  Neisseria meningitidis serogroup A
0.001612	10	10	9	3.78	0.005933	122587	no rank	                    Neisseria meningitidis Z2491
0.0004837	3	0	26	1.08	0.002844	135720	no rank	                  Neisseria meningitidis serogroup C
0.0003225	2	2	17	1.06	0.003267	374833	no rank	                    Neisseria meningitidis 053442
0.0001612	1	1	7	1.14	0.002041	604162	no rank	                    Neisseria meningitidis 8013
0.0003225	2	2	29	1.14	0.004387	662598	no rank	                  Neisseria meningitidis alpha14
0.0001612	1	1	11	5.73	0.003551	935588	no rank	                  Neisseria meningitidis M01-240355
0.0001612	1	1	2	20	0.001584	935590	no rank	                  Neisseria meningitidis M0579
0.0001612	1	1	1	3	0.0025	935599	no rank	                  Neisseria meningitidis G2136
0.0001612	1	1	1	1	0.025	1095685	no rank	                  Neisseria meningitidis M7124
0.01274	79	66	220	3.5	0.003071	486	species	                Neisseria lactamica
0.002096	13	13	72	3.44	0.002928	489653	no rank	                  Neisseria lactamica 020-06
0.000645	4	4	48	1.9	0.0004695	490	species	                Neisseria sicca
0.0003225	2	0	24	1.12	0.0002686	495	species	                Neisseria elongata
0.0003225	2	0	24	1.12	0.0002686	88719	subspecies	                  Neisseria elongata subsp. glycolytica
0.0003225	2	2	24	1.12	0.0002686	546263	no rank	                    Neisseria elongata subsp. glycolytica ATCC 29315
0.0003225	2	2	15	1.27	0.0001472	655307	species	                Neisseria sp. KEM232
0.0003225	2	2	15	1.07	0.0001396	1853278	species	                Neisseria sp. 10023
0.0003225	2	2	9	1.22	8.442e-05	1853276	species	                Neisseria sp. 10022
0.0001612	1	1	9	1	8.469e-05	326523	species	                Neisseria zoodegmatis
0.0001612	1	1	7	1.14	7.696e-05	28091	species	                Neisseria weaveri
0.0001612	1	0	8	1	8.671e-05	538	genus	              Eikenella
0.0001612	1	1	8	1	8.671e-05	539	species	                Eikenella corrodens
0.005805	36	0	410	1.07	8.069e-06	80840	order	          Burkholderiales
0.005482	34	0	387	1.07	1.456e-05	119060	family	            Burkholderiaceae
0.005321	33	0	371	1.06	0.0001564	48736	genus	              Ralstonia
0.004515	28	5	290	1.04	0.000787	329	species	                Ralstonia pickettii
0.002096	13	13	97	1.05	0.0009073	402626	no rank	                  Ralstonia pickettii 12J
0.001612	10	10	84	1.05	0.0006666	428406	no rank	                  Ralstonia pickettii 12D
0.0004837	3	3	32	1.19	0.0001955	105219	species	                Ralstonia mannitolilytica
0.0001612	1	1	5	1	4.662e-06	305	species	                Ralstonia solanacearum
0.0001612	1	1	4	1	1.093e-05	190721	species	                Ralstonia insidiosa
0.0001612	1	0	4	2.75	2.73e-07	32008	genus	              Burkholderia
0.0001612	1	0	2	4.5	2.587e-07	87882	species group	                Burkholderia cepacia complex
0.0001612	1	0	1	8	0.003145	152500	species	                  Burkholderia dolosa
0.0001612	1	1	1	8	0.003984	1385930	no rank	                    Burkholderia dolosa PC543
0.0001612	1	0	9	1	1.235e-06	506	family	            Alcaligenaceae
0.0001612	1	0	2	1	2.267e-05	1472344	genus	              Basilea
0.0001612	1	0	2	1	2.267e-05	1472345	species	                Basilea psittacipulmonis
0.0001612	1	1	2	1	2.267e-05	1072685	no rank	                  Basilea psittacipulmonis DSM 24701
0.0001612	1	0	7	1	7.927e-07	80864	family	            Comamonadaceae
0.0001612	1	1	1	1	7.085e-07	12916	genus	              Acidovorax
24.65	152869	313	220266	9.3	0.001441	1236	class	        Gammaproteobacteria
24.6	152553	489	219072	9.28	0.005213	91347	order	          Enterobacterales
24.52	152059	4728	213968	9.19	0.01027	543	family	            Enterobacteriaceae
23.43	145339	1103	195099	8.91	0.09503	590	genus	              Salmonella
23.26	144236	136396	177404	8.91	0.09877	28901	species	                Salmonella enterica
1.239	7687	3559	4940	9.13	0.00656	59201	subspecies	                  Salmonella enterica subsp. enterica
0.569	3529	3522	2616	10.1	0.09877	90371	no rank	                    Salmonella enterica subsp. enterica serovar Typhimurium
0.0003225	2	2	4	1	0.005122	568709	no rank	                      Salmonella enterica subsp. enterica serovar Typhimurium str. DT2
0.0003225	2	2	2	1	0.0101	1008297	no rank	                      Salmonella enterica subsp. enterica serovar Typhimurium str. 798
0.0001612	1	1	3	1	0.008174	1454639	no rank	                      Salmonella enterica subsp. enterica serovar Typhimurium str. USDA-ARS-USMARC-1899
0.0001612	1	1	1	1	0.01493	1454634	no rank	                      Salmonella enterica subsp. enterica serovar Typhimurium str. USDA-ARS-USMARC-1880
0.0001612	1	1	1	1	0.004525	1171376	no rank	                      Salmonella enterica subsp. enterica serovar Typhimurium str. U288
0.05692	353	0	88	11.1	0.02786	340190	no rank	                    Salmonella enterica subsp. enterica serovar Schwarzengrund
0.05692	353	353	88	11.1	0.02786	439843	no rank	                      Salmonella enterica subsp. enterica serovar Schwarzengrund str. CVM19633
0.004031	25	0	40	1	0.0008688	1242085	no rank	                    Salmonella enterica subsp. enterica serovar Macclesfield
0.004031	25	25	40	1	0.0008688	1242107	no rank	                      Salmonella enterica subsp. enterica serovar Macclesfield str. S-1643
0.002741	17	17	30	1.07	0.001318	90370	no rank	                    Salmonella enterica subsp. enterica serovar Typhi
0.002419	15	10	26	1	0.00154	595	no rank	                    Salmonella enterica subsp. enterica serovar Infantis
0.0008062	5	5	8	1	0.0008043	596155	no rank	                      Salmonella enterica subsp. enterica serovar Infantis str. SARB27
0.001935	12	0	3	8	0.001129	611	no rank	                    Salmonella enterica subsp. enterica serovar Heidelberg
0.001935	12	12	3	8	0.01327	1124936	no rank	                      Salmonella enterica subsp. enterica serovar Heidelberg str. 41578
0.001935	12	11	13	1	0.001274	54388	no rank	                    Salmonella enterica subsp. enterica serovar Paratyphi A
0.0001612	1	1	1	1	0.001563	941189	no rank	                      Salmonella enterica subsp. enterica serovar Paratyphi A str. ATCC 11511
0.001612	10	7	19	1	0.004463	594	no rank	                    Salmonella enterica subsp. enterica serovar Gallinarum
0.0003225	2	2	6	1	0.02575	550538	no rank	                      Salmonella enterica subsp. enterica serovar Gallinarum str. 287/91
0.0001612	1	1	1	1	0.004184	909947	no rank	                      Salmonella enterica subsp. enterica serovar Gallinarum str. SG9
0.001451	9	6	14	1	0.001979	149539	no rank	                    Salmonella enterica subsp. enterica serovar Enteritidis
0.0001612	1	1	2	1	0.05556	1412452	no rank	                      Salmonella enterica subsp. enterica serovar Enteritidis str. SA19992322
0.0001612	1	1	1	1	0.01235	1412580	no rank	                      Salmonella enterica subsp. enterica serovar Enteritidis str. EC20121986
0.0001612	1	1	1	1	0.01042	1244111	no rank	                      Salmonella enterica subsp. enterica serovar Enteritidis str. EC20110357
0.00129	8	5	13	1	0.0005896	108619	no rank	                    Salmonella enterica subsp. enterica serovar Newport
0.0001612	1	1	1	1	0.0003124	1454627	no rank	                      Salmonella enterica subsp. enterica serovar Newport str. CDC 2010K-2159
0.0001612	1	1	1	1	0.0009107	1454620	no rank	                      Salmonella enterica subsp. enterica serovar Newport str. USDA-ARS-USMARC-1927
0.0001612	1	1	1	1	0.009434	796731	no rank	                      Salmonella enterica subsp. enterica serovar Newport str. CVM 21538
0.001129	7	5	12	1	0.001059	119912	no rank	                    Salmonella enterica subsp. enterica serovar Choleraesuis
0.0001612	1	1	4	1	0.006826	321314	no rank	                      Salmonella enterica subsp. enterica serovar Choleraesuis str. SC-B67
0.0001612	1	1	1	1	0.0002068	938142	no rank	                      Salmonella enterica subsp. enterica serovar Choleraesuis str. ATCC 10708
0.001129	7	0	9	1	0.0007057	1242080	no rank	                    Salmonella enterica subsp. enterica serovar Djakarta
0.001129	7	7	9	1	0.0007057	1242091	no rank	                      Salmonella enterica subsp. enterica serovar Djakarta str. S-1087
0.0009674	6	0	10	1	0.001715	915158	no rank	                    Salmonella enterica subsp. enterica serovar Manchester
0.0009674	6	6	10	1	0.001715	1242108	no rank	                      Salmonella enterica subsp. enterica serovar Manchester str. ST278
0.0009674	6	4	8	1.12	0.001758	98360	no rank	                    Salmonella enterica subsp. enterica serovar Dublin
0.0003225	2	2	4	1.25	0.01166	439851	no rank	                      Salmonella enterica subsp. enterica serovar Dublin str. CT_02021853
0.0009674	6	6	8	1.12	0.001141	1243585	no rank	                    Salmonella enterica subsp. enterica serovar Ouakam
0.0009674	6	0	8	1	0.0008502	1242079	no rank	                    Salmonella enterica subsp. enterica serovar Apapa
0.0009674	6	6	8	1	0.0008502	1242088	no rank	                      Salmonella enterica subsp. enterica serovar Apapa str. SA20060561
0.0009674	6	0	6	1	0.000818	260368	no rank	                    Salmonella enterica subsp. enterica serovar Bergen
0.0009674	6	6	6	1	0.000818	1240708	no rank	                      Salmonella enterica subsp. enterica serovar Bergen str. ST350
0.0008062	5	1	10	1	0.00131	57045	no rank	                    Salmonella enterica subsp. enterica serovar Paratyphi B
0.0004837	3	3	7	1	0.002169	1016998	no rank	                      Salmonella enterica subsp. enterica serovar Paratyphi B str. SPB7
0.0001612	1	1	2	1	0.0004851	224729	no rank	                      Salmonella enterica subsp. enterica serovar Java
0.0008062	5	2	8	1	0.00049	90105	no rank	                    Salmonella enterica subsp. enterica serovar Saintpaul
0.0004837	3	3	6	1	0.0007735	702982	no rank	                      Salmonella enterica subsp. enterica serovar Saintpaul str. SARA26
0.0008062	5	2	7	1	0.0003806	58712	no rank	                    Salmonella enterica subsp. enterica serovar Anatum
0.0001612	1	1	2	1	0.002751	1454584	no rank	                      Salmonella enterica subsp. enterica serovar Anatum str. USDA-ARS-USMARC-1727
0.0001612	1	1	2	1	0.01681	1454583	no rank	                      Salmonella enterica subsp. enterica serovar Anatum str. USDA-ARS-USMARC-1783
0.0001612	1	1	1	1	0.0008389	1454593	no rank	                      Salmonella enterica subsp. enterica serovar Anatum str. USDA-ARS-USMARC-1765
0.000645	4	4	10	1	0.001188	58101	no rank	                    Salmonella enterica subsp. enterica serovar Waycross
0.000645	4	4	6	1.17	0.001717	600	no rank	                    Salmonella enterica subsp. enterica serovar Thompson
0.000645	4	0	7	1	0.0006579	1242081	no rank	                    Salmonella enterica subsp. enterica serovar Hillingdon
0.000645	4	4	7	1	0.0006579	1242096	no rank	                      Salmonella enterica subsp. enterica serovar Hillingdon str. N1529-D3
0.000645	4	4	7	1	0.0007906	340188	no rank	                    Salmonella enterica subsp. enterica serovar Cerro
0.000645	4	0	6	1	0.0008416	1242084	no rank	                    Salmonella enterica subsp. enterica serovar Krefeld
0.000645	4	4	6	1	0.0008416	1242106	no rank	                      Salmonella enterica subsp. enterica serovar Krefeld str. SA20030536
0.000645	4	4	6	1	0.0004318	28150	no rank	                    Salmonella enterica subsp. enterica serovar Senftenberg
0.000645	4	2	6	1	0.001104	115981	no rank	                    Salmonella enterica subsp. enterica serovar Montevideo
0.0003225	2	2	3	1	0.001351	859199	no rank	                      Salmonella enterica subsp. enterica serovar Montevideo str. 507440-20
0.0004837	3	0	7	1.14	0.0006752	189201	no rank	                    Salmonella enterica subsp. enterica serovar Cubana
0.0004837	3	3	7	1.14	0.0006752	1271863	no rank	                      Salmonella enterica subsp. enterica serovar Cubana str. CFSAN002050
0.0004837	3	0	6	1	0.0003997	192954	no rank	                    Salmonella enterica subsp. enterica serovar Mbandaka
0.0004837	3	3	6	1	0.0003997	984237	no rank	                      Salmonella enterica subsp. enterica serovar Mbandaka str. ATCC 51958
0.0004837	3	0	6	1	0.001803	57046	no rank	                    Salmonella enterica subsp. enterica serovar Paratyphi C
0.0004837	3	3	6	1	0.001803	476213	no rank	                      Salmonella enterica subsp. enterica serovar Paratyphi C str. RKS4594
0.0004837	3	3	5	1	0.0006485	143221	no rank	                    Salmonella enterica subsp. enterica serovar Tennessee
0.0004837	3	3	3	1.33	0.0001703	57743	no rank	                    Salmonella enterica subsp. enterica serovar Weltevreden
0.0004837	3	0	4	1	0.0008035	58096	no rank	                    Salmonella enterica subsp. enterica serovar Bareilly
0.0004837	3	3	4	1	0.0008035	1173427	no rank	                      Salmonella enterica subsp. enterica serovar Bareilly str. CFSAN000189
0.0004837	3	0	4	1	0.0006522	211968	no rank	                    Salmonella enterica subsp. enterica serovar Albany
0.0004837	3	3	4	1	0.0006522	1173798	no rank	                      Salmonella enterica subsp. enterica serovar Albany str. ATCC 51960
0.0004837	3	0	3	1	0.0009066	1242078	no rank	                    Salmonella enterica subsp. enterica serovar Antsalova
0.0004837	3	3	3	1	0.0009066	1242087	no rank	                      Salmonella enterica subsp. enterica serovar Antsalova str. S01-0511
0.0003225	2	0	6	1.5	0.0005059	913074	no rank	                    Salmonella enterica subsp. enterica serovar Inverness
0.0003225	2	2	6	1.5	0.0005059	941187	no rank	                      Salmonella enterica subsp. enterica serovar Inverness str. ATCC 10720
0.0003225	2	0	4	1	0.0005721	913085	no rank	                    Salmonella enterica subsp. enterica serovar Wandsworth
0.0003225	2	2	4	1	0.0005721	1243595	no rank	                      Salmonella enterica subsp. enterica serovar Wandsworth str. SA20092095
0.0003225	2	0	4	1	0.000269	1243583	no rank	                    Salmonella enterica subsp. Enterica serovar Onderstepoort
0.0003225	2	2	4	1	0.000269	1243584	no rank	                      Salmonella enterica subsp. enterica serovar Onderstepoort str. SA20060086
0.0003225	2	0	2	1	0.002047	28146	no rank	                    Salmonella enterica subsp. enterica serovar Moscow
0.0003225	2	2	2	1	0.002047	1243579	no rank	                      Salmonella enterica subsp. enterica serovar Moscow str. S-1843
0.0003225	2	0	2	1	0.001189	1151172	no rank	                    Salmonella enterica subsp. enterica serovar Abaetetuba
0.0003225	2	2	2	1	0.001189	1208611	no rank	                      Salmonella enterica subsp. enterica serovar Abaetetuba str. ATCC 35640
0.0003225	2	0	2	1	0.0005062	1243590	no rank	                    Salmonella enterica subsp. enterica serovar Quebec
0.0003225	2	2	2	1	0.0005062	1243591	no rank	                      Salmonella enterica subsp. enterica serovar Quebec str. S-1267
0.0003225	2	0	2	1	0.000195	598	no rank	                    Salmonella enterica subsp. enterica serovar Rubislaw
0.0003225	2	2	2	1	0.000195	938143	no rank	                      Salmonella enterica subsp. enterica serovar Rubislaw str. ATCC 10717
0.0001612	1	0	5	1	0.02174	29472	no rank	                    Salmonella enterica subsp. enterica serovar Panama
0.0001612	1	1	5	1	0.02174	1124961	no rank	                      Salmonella enterica subsp. enterica serovar Panama str. ATCC 7378
0.0001612	1	1	3	1	0.009464	932733	no rank	                    Salmonella enterica subsp. enterica serovar Bardo
0.0001612	1	0	2	1	0.001669	58095	no rank	                    Salmonella enterica subsp. enterica serovar Agona
0.0001612	1	1	2	1	0.0303	1406860	no rank	                      Salmonella enterica subsp. enterica serovar Agona str. 24249
0.0001612	1	0	2	1	0.0003288	363569	no rank	                    Salmonella enterica subsp. enterica serovar Javiana
0.0001612	1	1	2	1	0.0003288	1267753	no rank	                      Salmonella enterica subsp. enterica serovar Javiana str. CFSAN001992
0.0001612	1	0	2	1	0.0007133	149386	no rank	                    Salmonella enterica subsp. enterica serovar Chester
0.0001612	1	1	2	1	0.0007133	941190	no rank	                      Salmonella enterica subsp. enterica serovar Chester str. ATCC 11997
0.0001612	1	0	2	1	0.00463	1243599	no rank	                    Salmonella enterica subsp. enterica serovar Yovokome
0.0001612	1	1	2	1	0.00463	1243600	no rank	                      Salmonella enterica subsp. enterica serovar Yovokome str. S-1850
0.0001612	1	1	2	1	0.0001147	70803	no rank	                    Salmonella enterica subsp. enterica serovar Minnesota
0.0001612	1	1	2	1	0.001764	1129117	no rank	                    Salmonella enterica subsp. enterica serovar Nitra
0.0001612	1	0	2	1	0.0006736	29482	no rank	                    Salmonella enterica subsp. enterica serovar Abony
0.0001612	1	1	2	1	0.0006736	1029983	no rank	                      Salmonella enterica subsp. enterica serovar Abony str. 0014
0.0001612	1	0	1	1	0.001374	604	no rank	                    Salmonella enterica subsp. enterica serovar Gallinarum/pullorum
0.0001612	1	1	1	1	0.00241	1081093	no rank	                      Salmonella enterica subsp. enterica serovar Gallinarum/pullorum str. RKS5078
0.0001612	1	1	1	1	0.0006766	605	no rank	                    Salmonella enterica subsp. enterica serovar Pullorum
0.0001612	1	0	1	1	0.0001604	913076	no rank	                    Salmonella enterica subsp. enterica serovar Johannesburg
0.0001612	1	1	1	1	0.0001604	1242101	no rank	                      Salmonella enterica subsp. enterica serovar Johannesburg str. ST203
0.0001612	1	0	1	1	0.0001384	82689	no rank	                    Salmonella enterica subsp. enterica serovar Muenster
0.0001612	1	1	1	1	0.0001384	1124958	no rank	                      Salmonella enterica subsp. enterica serovar Muenster str. 0315
0.009352	58	3	86	1.01	0.0005061	59202	subspecies	                  Salmonella enterica subsp. salamae
0.004998	31	0	46	1.02	0.0004694	1243601	no rank	                    Salmonella enterica subsp. salamae serovar 55:k:z39
0.004998	31	31	46	1.02	0.0004694	1243602	no rank	                      Salmonella enterica subsp. salamae serovar 55:k:z39 str. 1315K
0.00387	24	24	35	1	0.000526	1710356	no rank	                    Salmonella enterica subsp. salamae serovar 57:z29:z42
0.005643	35	0	55	1	0.0005628	59205	subspecies	                  Salmonella enterica subsp. houtenae
0.005643	35	35	55	1	0.0005628	523831	no rank	                    Salmonella enterica subsp. houtenae str. ATCC BAA-1581
0.005643	35	27	48	1.04	0.0003282	59203	subspecies	                  Salmonella enterica subsp. arizonae
0.0009674	6	6	9	1.11	0.0003495	41514	no rank	                    Salmonella enterica subsp. arizonae serovar 62:z4,z23:-
0.0003225	2	0	2	1	7.092e-05	41515	no rank	                    Salmonella enterica subsp. arizonae serovar 62:z36:-
0.0003225	2	2	2	1	7.092e-05	1386967	no rank	                      Salmonella enterica subsp. arizonae serovar 62:z36:- str. RKS2983
0.004031	25	20	42	1	0.0003218	59204	subspecies	                  Salmonella enterica subsp. diarizonae
0.000645	4	0	4	1	0.0001724	1243611	no rank	                    Salmonella enterica subsp. diarizonae serovar 50:k:z
0.000645	4	4	4	1	0.0001724	1243612	no rank	                      Salmonella enterica subsp. diarizonae serovar 50:k:z str. MZ0080
0.0001612	1	0	4	1	0.0002086	1243615	no rank	                    Salmonella enterica subsp. diarizonae serovar 65:c:z
0.0001612	1	1	4	1	0.0002086	1243616	no rank	                      Salmonella enterica subsp. diarizonae serovar 65:c:z str. SA20044251
0.2494	1547	9	56	117	1.901e-05	570	genus	              Klebsiella
0.2477	1536	1536	27	190	3.129e-05	573	species	                Klebsiella pneumoniae
0.0003225	2	2	13	1	4.191e-05	548	species	                Klebsiella aerogenes
0.07014	435	0	86	9.06	4.031e-05	561	genus	              Escherichia
0.06998	434	432	69	11	4.122e-05	562	species	                Escherichia coli
0.0001612	1	1	1	2	0.0008628	741093	no rank	                  Escherichia coli Xuzhou21
0.0001612	1	1	1	1	0.0009398	585057	no rank	                  Escherichia coli IAI39
0.0001612	1	1	7	1.14	2.971e-05	208962	species	                Escherichia albertii
0.00129	8	0	31	12.5	8.116e-06	547	genus	              Enterobacter
0.001129	7	0	25	15.2	8.678e-06	354276	species group	                Enterobacter cloacae complex
0.0009674	6	6	7	51.4	2.122e-05	61645	species	                  Enterobacter asburiae
0.0001612	1	1	6	1.17	5.552e-06	550	species	                  Enterobacter cloacae
0.0001612	1	1	2	2	9.671e-06	1692238	species	                Enterobacter sp. FY-07
0.0001612	1	0	7	1	7.347e-06	191675	no rank	              unclassified Enterobacteriaceae
0.0001612	1	0	7	1	1.997e-05	36866	no rank	                unclassified Enterobacteriaceae (miscellaneous)
0.0001612	1	1	2	1	1.242e-05	891974	species	                  Plautia stali symbiont
0.0001612	1	0	4	1.25	4.596e-05	620	genus	              Shigella
0.0001612	1	1	4	1.25	0.0001421	623	species	                Shigella flexneri
0.0003225	2	0	19	1	4.745e-06	1903409	family	            Erwiniaceae
0.0001612	1	0	9	1	3.884e-06	53335	genus	              Pantoea
0.0001612	1	0	1	1	3.138e-06	1654067	species group	                Pantoea agglomerans group
0.0001612	1	1	1	1	3.138e-06	549	species	                  Pantoea agglomerans
0.0001612	1	1	8	1	7.739e-06	551	genus	              Erwinia
0.0001612	1	0	16	1	3.231e-06	1903410	family	            Pectobacteriaceae
0.0001612	1	0	5	1	1.983e-06	204037	genus	              Dickeya
0.0001612	1	1	1	1	3.368e-06	204038	species	                Dickeya dadantii
0.0001612	1	0	14	1	2.074e-06	1903411	family	            Yersiniaceae
0.0001612	1	1	5	1	2.082e-06	629	genus	              Yersinia
0.0001612	1	0	10	1	3.036e-06	1903414	family	            Morganellaceae
0.0001612	1	0	2	1	2.014e-06	586	genus	              Providencia
0.0001612	1	1	1	1	3.809e-06	588	species	                Providencia stuartii
0.0001612	1	0	11	1.18	3.61e-06	135625	order	          Pasteurellales
0.0001612	1	0	11	1.18	3.61e-06	712	family	            Pasteurellaceae
0.0001612	1	0	5	1.2	6.184e-06	724	genus	              Haemophilus
0.0001612	1	1	1	1	9.522e-06	730	species	                [Haemophilus] ducreyi
0.0001612	1	0	10	1.1	2.289e-07	72274	order	          Pseudomonadales
0.0001612	1	0	3	1	5.174e-07	468	family	            Moraxellaceae
0.0001612	1	1	2	1	5.352e-07	469	genus	              Acinetobacter
0.0001612	1	0	4	1.25	9.135e-07	135613	order	          Chromatiales
0.0001612	1	0	2	1.5	1.046e-06	72276	family	            Ectothiorhodospiraceae
0.0001612	1	0	1	2	2.15e-06	1765964	genus	              Acidihalobacter
0.0001612	1	1	1	2	6.604e-06	1765967	species	                Acidihalobacter ferrooxidans
0.0001612	1	0	13	1	1.684e-07	28211	class	        Alphaproteobacteria
0.0001612	1	0	3	1	7.745e-08	356	order	          Rhizobiales
0.0001612	1	0	1	1	2.362e-06	119042	no rank	            unclassified Rhizobiales
0.0001612	1	0	1	1	3.726e-06	1734920	genus	              Pseudorhodoplanes
0.0001612	1	1	1	1	3.726e-06	1235591	species	                Pseudorhodoplanes sinuspersici
0.09449	586	245	52	75.2	2.14e-07	1783272	no rank	      Terrabacteria group
0.05498	341	337	43	74.5	4.611e-07	1239	phylum	        Firmicutes
0.000645	4	0	15	1.13	2.287e-07	91061	class	          Bacilli
0.000645	4	0	11	1.09	5.84e-07	186826	order	            Lactobacillales
0.0003225	2	0	6	1	9.725e-07	1300	family	              Streptococcaceae
0.0003225	2	0	6	1	1.162e-06	1301	genus	                Streptococcus
0.0001612	1	0	4	1	2.393e-05	28037	species	                  Streptococcus mitis
0.0001612	1	1	4	1	7.833e-05	365659	no rank	                    Streptococcus mitis B6
0.0001612	1	1	2	1	9.108e-06	1311	species	                  Streptococcus agalactiae
0.0001612	1	0	3	1	4.072e-07	33958	family	              Lactobacillaceae
0.0001612	1	0	3	1	4.363e-07	1578	genus	                Lactobacillus
0.0001612	1	1	3	1	3.172e-05	1601	species	                  Lactobacillus agilis
0.0001612	1	0	1	2	4.072e-07	81852	family	              Enterococcaceae
0.0001612	1	0	1	2	5.077e-07	1350	genus	                Enterococcus
0.0001612	1	1	1	2	2.989e-06	1352	species	                  Enterococcus faecium
0.0003225	2	0	3	1	3.381e-07	10239	superkingdom	  Viruses
0.0003225	2	0	3	1	4.222e-07	35237	no rank	    dsDNA viruses, no RNA stage
0.0003225	2	0	3	1	7.334e-07	28883	order	      Caudovirales
0.0003225	2	0	3	1	1.422e-06	10662	family	        Myoviridae
0.0003225	2	0	3	1	3.28e-06	196896	no rank	          unclassified Myoviridae
0.0001612	1	1	2	1	0.02597	66284	species	            Shigella phage SfII
0.0001612	1	1	1	1	0.007194	55884	species	            Enterobacteria phage SfV
