# KrakenUniq v0.5.7 DATE:2019-04-15T15:47:24Z DB:/home/biouser/SAM/DBDIR/LIBRARY_MINIKRAKEN/minikraken_20171019_8GB DB_SIZE:8053064728 WD:/home/biouser/SAM
# CL:perl /home/biouser/miniconda3/bin/krakenuniq --db /home/biouser/SAM/DBDIR/LIBRARY_MINIKRAKEN/minikraken_20171019_8GB -paired /home/biouser/SAM/data/10-KPN_S9_mixed_with_10%_1-SAT_S1_R1.fastq.gz /home/biouser/SAM/data/10-KPN_S9_mixed_with_10%_1-SAT_S1_R2.fastq.gz --report-file /home/biouser/SAM/data/10-KPN_S9_mixed_with_10%_1-SAT_S1.krakenuniq.report.tsv

%	reads	taxReads	kmers	dup	cov	taxID	rank	taxName
0.7659	2038	2038	10905163	7.39	1.27	0	no rank	unclassified
99.23	264050	130	394459	9.29	0.0005954	1	no rank	root
99.19	263920	1	393720	9.29	0.0006027	131567	no rank	  cellular organisms
99.18	263919	323	393720	9.29	0.0006234	2	superkingdom	    Bacteria
99.06	263574	298	392686	9.24	0.001236	1224	phylum	      Proteobacteria
98.8	262889	848	388293	9.3	0.00254	1236	class	        Gammaproteobacteria
98.39	261810	2312	385359	9.25	0.00917	91347	order	          Enterobacterales
97.48	259377	6885	373575	9.19	0.01794	543	family	            Enterobacteriaceae
84.05	223658	21902	202762	13.5	0.06882	570	genus	              Klebsiella
75.56	201051	197661	106062	13.5	0.1229	573	species	                Klebsiella pneumoniae
0.9794	2606	1670	527	10.1	0.0063	72407	subspecies	                  Klebsiella pneumoniae subsp. pneumoniae
0.1511	402	402	80	11.4	0.01112	1123862	no rank	                    Klebsiella pneumoniae subsp. pneumoniae Kp13
0.0932	248	248	50	8.48	0.006143	272620	no rank	                    Klebsiella pneumoniae subsp. pneumoniae MGH 78578
0.08155	217	217	43	9.51	0.004809	1328324	no rank	                    Klebsiella pneumoniae subsp. pneumoniae KPNIH27
0.01841	49	49	11	8.27	0.003059	1392499	no rank	                    Klebsiella pneumoniae subsp. pneumoniae 1158
0.005637	15	15	2	8.5	0.0009862	1125630	no rank	                    Klebsiella pneumoniae subsp. pneumoniae HS11286
0.001879	5	5	5	1.2	0.006935	1193292	no rank	                    Klebsiella pneumoniae subsp. pneumoniae 1084
0.1545	411	0	182	12.5	0.008275	39831	subspecies	                  Klebsiella pneumoniae subsp. rhinoscleromatis
0.1545	411	411	182	12.5	0.008275	861365	no rank	                    Klebsiella pneumoniae subsp. rhinoscleromatis SB3432
0.07216	192	192	69	7.61	0.01646	1365186	no rank	                  Klebsiella pneumoniae KP-1
0.04547	121	121	41	8.29	0.01001	1049565	no rank	                  Klebsiella pneumoniae KCTC 2242
0.02067	55	55	9	9.22	0.0003846	507522	no rank	                  Klebsiella pneumoniae 342
0.0007516	2	2	3	1	0.00297	1380908	no rank	                  Klebsiella pneumoniae JM45
0.0003758	1	1	2	1	0.007605	1420012	no rank	                  Klebsiella pneumoniae 30660/NJST258_1
0.0003758	1	1	1	1	0.001908	1244085	no rank	                  Klebsiella pneumoniae CG43
0.0003758	1	1	1	1	0.003436	1304922	no rank	                  Klebsiella pneumoniae 500_1420
0.106	282	272	110	12.4	0.0003546	548	species	                Klebsiella aerogenes
0.003758	10	10	7	4.57	0.0001537	1028307	no rank	                  Klebsiella aerogenes KCTC 2190
0.0451	120	108	66	6.8	0.0009047	244366	species	                Klebsiella variicola
0.00451	12	12	11	7.73	0.000758	640131	no rank	                  Klebsiella variicola At-22
0.04322	115	115	134	5.24	0.001135	2026240	species	                Klebsiella quasivariicola
0.03645	97	97	53	8.87	0.001556	1463165	species	                Klebsiella quasipneumoniae
0.02556	68	64	58	8.26	0.0001667	571	species	                Klebsiella oxytoca
0.001503	4	4	3	7	0.0001794	1333852	no rank	                  Klebsiella oxytoca KONIH1
0.003382	9	9	3	7	8.98e-05	1934254	species	                Klebsiella sp. M5al
0.003007	8	2	10	2	4.753e-05	1134687	species	                Klebsiella michiganensis
0.002255	6	6	1	9	0.0002068	1006551	no rank	                  Klebsiella michiganensis KCTC 1686
0.002255	6	6	6	13.7	0.0002942	1905288	species	                Klebsiella sp. LTGPAF-6F
9.853	26217	337	128604	2.27	0.06264	590	genus	              Salmonella
9.726	25880	14015	118023	2.26	0.06571	28901	species	                Salmonella enterica
4.44	11814	5371	20420	2.32	0.02712	59201	subspecies	                  Salmonella enterica subsp. enterica
2.34	6227	6137	7879	2.27	0.3461	90370	no rank	                    Salmonella enterica subsp. enterica serovar Typhi
0.03382	90	90	88	2.11	0.1654	220341	no rank	                      Salmonella enterica subsp. enterica serovar Typhi str. CT18
0.01954	52	0	9	21.2	0.003031	29482	no rank	                    Salmonella enterica subsp. enterica serovar Abony
0.01954	52	52	9	21.2	0.003031	1029983	no rank	                      Salmonella enterica subsp. enterica serovar Abony str. 0014
0.01466	39	0	12	8.67	0.002411	58096	no rank	                    Salmonella enterica subsp. enterica serovar Bareilly
0.01466	39	39	12	8.67	0.002411	1173427	no rank	                      Salmonella enterica subsp. enterica serovar Bareilly str. CFSAN000189
0.01127	30	29	5	18.2	0.0002962	595	no rank	                    Salmonella enterica subsp. enterica serovar Infantis
0.0003758	1	1	1	1	0.0001005	596155	no rank	                      Salmonella enterica subsp. enterica serovar Infantis str. SARB27
0.00714	19	0	8	11.4	0.0007519	1242081	no rank	                    Salmonella enterica subsp. enterica serovar Hillingdon
0.00714	19	19	8	11.4	0.0007519	1242096	no rank	                      Salmonella enterica subsp. enterica serovar Hillingdon str. N1529-D3
0.004886	13	0	4	12.2	0.0002665	192954	no rank	                    Salmonella enterica subsp. enterica serovar Mbandaka
0.004886	13	13	4	12.2	0.0002665	984237	no rank	                      Salmonella enterica subsp. enterica serovar Mbandaka str. ATCC 51958
0.003382	9	0	3	8.67	0.0003188	1242079	no rank	                    Salmonella enterica subsp. enterica serovar Apapa
0.003382	9	9	3	8.67	0.0003188	1242088	no rank	                      Salmonella enterica subsp. enterica serovar Apapa str. SA20060561
0.003007	8	0	2	13	0.0003679	115981	no rank	                    Salmonella enterica subsp. enterica serovar Montevideo
0.003007	8	8	2	13	0.0009005	859199	no rank	                      Salmonella enterica subsp. enterica serovar Montevideo str. 507440-20
0.003007	8	0	1	21	0.0001384	82689	no rank	                    Salmonella enterica subsp. enterica serovar Muenster
0.003007	8	8	1	21	0.0001384	1124958	no rank	                      Salmonella enterica subsp. enterica serovar Muenster str. 0315
0.002631	7	5	9	2.78	0.0003398	90371	no rank	                    Salmonella enterica subsp. enterica serovar Typhimurium
0.0003758	1	1	3	1	0.008499	1029978	no rank	                      Salmonella enterica subsp. enterica serovar Typhimurium str. SARA13
0.0003758	1	1	1	1	0.005051	1008297	no rank	                      Salmonella enterica subsp. enterica serovar Typhimurium str. 798
0.001127	3	0	6	1	0.0009783	211968	no rank	                    Salmonella enterica subsp. enterica serovar Albany
0.001127	3	3	6	1	0.0009783	1173798	no rank	                      Salmonella enterica subsp. enterica serovar Albany str. ATCC 51960
0.001127	3	2	6	1	0.0008558	1243585	no rank	                    Salmonella enterica subsp. enterica serovar Ouakam
0.0003758	1	1	1	1	0.000692	1243586	no rank	                      Salmonella enterica subsp. enterica serovar Ouakam str. SA20034636
0.001127	3	2	5	1	0.0004901	54388	no rank	                    Salmonella enterica subsp. enterica serovar Paratyphi A
0.0003758	1	1	1	1	0.001563	941189	no rank	                      Salmonella enterica subsp. enterica serovar Paratyphi A str. ATCC 11511
0.001127	3	1	4	1	0.0005653	149539	no rank	                    Salmonella enterica subsp. enterica serovar Enteritidis
0.0003758	1	1	1	1	0.01515	1412495	no rank	                      Salmonella enterica subsp. enterica serovar Enteritidis str. SA20123395
0.0003758	1	1	1	1	0.125	1244122	no rank	                      Salmonella enterica subsp. enterica serovar Enteritidis str. EC20111174
0.0007516	2	0	9	1	0.0001955	1242085	no rank	                    Salmonella enterica subsp. enterica serovar Macclesfield
0.0007516	2	2	9	1	0.0001955	1242107	no rank	                      Salmonella enterica subsp. enterica serovar Macclesfield str. S-1643
0.0007516	2	2	6	1.33	0.0003675	90105	no rank	                    Salmonella enterica subsp. enterica serovar Saintpaul
0.0007516	2	0	3	1.67	0.0003599	181798	no rank	                    Salmonella enterica subsp. enterica serovar Sloterdijk
0.0007516	2	2	3	1.67	0.0003599	938141	no rank	                      Salmonella enterica subsp. enterica serovar Sloterdijk str. ATCC 15791
0.0007516	2	1	4	1	0.0002175	58712	no rank	                    Salmonella enterica subsp. enterica serovar Anatum
0.0003758	1	1	3	1	0.004127	1454584	no rank	                      Salmonella enterica subsp. enterica serovar Anatum str. USDA-ARS-USMARC-1727
0.0007516	2	2	4	1	0.0001814	108619	no rank	                    Salmonella enterica subsp. enterica serovar Newport
0.0007516	2	2	4	1	0.0008791	98360	no rank	                    Salmonella enterica subsp. enterica serovar Dublin
0.0003758	1	0	1	7	0.0003166	340190	no rank	                    Salmonella enterica subsp. enterica serovar Schwarzengrund
0.0003758	1	1	1	7	0.0003166	439843	no rank	                      Salmonella enterica subsp. enterica serovar Schwarzengrund str. CVM19633
0.0003758	1	0	4	1	0.001202	57046	no rank	                    Salmonella enterica subsp. enterica serovar Paratyphi C
0.0003758	1	1	4	1	0.001202	476213	no rank	                      Salmonella enterica subsp. enterica serovar Paratyphi C str. RKS4594
0.0003758	1	0	2	1	0.0006044	1242078	no rank	                    Salmonella enterica subsp. enterica serovar Antsalova
0.0003758	1	1	2	1	0.0006044	1242087	no rank	                      Salmonella enterica subsp. enterica serovar Antsalova str. S01-0511
0.0003758	1	0	2	1	0.0003208	913076	no rank	                    Salmonella enterica subsp. enterica serovar Johannesburg
0.0003758	1	1	2	1	0.0003208	1242101	no rank	                      Salmonella enterica subsp. enterica serovar Johannesburg str. ST203
0.0003758	1	0	1	1	0.0001363	260368	no rank	                    Salmonella enterica subsp. enterica serovar Bergen
0.0003758	1	1	1	1	0.0001363	1240708	no rank	                      Salmonella enterica subsp. enterica serovar Bergen str. ST350
0.0003758	1	1	1	1	5.678e-05	57743	no rank	                    Salmonella enterica subsp. enterica serovar Weltevreden
0.0003758	1	1	1	1	7.196e-05	28150	no rank	                    Salmonella enterica subsp. enterica serovar Senftenberg
0.01278	34	32	23	7.61	0.0001762	59204	subspecies	                  Salmonella enterica subsp. diarizonae
0.0003758	1	0	3	1.33	0.0001293	1243611	no rank	                    Salmonella enterica subsp. diarizonae serovar 50:k:z
0.0003758	1	1	3	1.33	0.0001293	1243612	no rank	                      Salmonella enterica subsp. diarizonae serovar 50:k:z str. MZ0080
0.0003758	1	0	1	1	5.215e-05	1243615	no rank	                    Salmonella enterica subsp. diarizonae serovar 65:c:z
0.0003758	1	1	1	1	5.215e-05	1243616	no rank	                      Salmonella enterica subsp. diarizonae serovar 65:c:z str. SA20044251
0.003382	9	0	18	3.28	0.0001059	59202	subspecies	                  Salmonella enterica subsp. salamae
0.002631	7	0	10	2.8	0.000102	1243601	no rank	                    Salmonella enterica subsp. salamae serovar 55:k:z39
0.002631	7	7	10	2.8	0.000102	1243602	no rank	                      Salmonella enterica subsp. salamae serovar 55:k:z39 str. 1315K
0.0007516	2	2	6	1.33	9.018e-05	1710356	no rank	                    Salmonella enterica subsp. salamae serovar 57:z29:z42
0.001503	4	2	7	1	4.786e-05	59203	subspecies	                  Salmonella enterica subsp. arizonae
0.0003758	1	0	2	1	7.092e-05	41515	no rank	                    Salmonella enterica subsp. arizonae serovar 62:z36:-
0.0003758	1	1	2	1	7.092e-05	1386967	no rank	                      Salmonella enterica subsp. arizonae serovar 62:z36:- str. RKS2983
0.0003758	1	1	1	1	3.883e-05	41514	no rank	                    Salmonella enterica subsp. arizonae serovar 62:z4,z23:-
0.001503	4	0	4	1	4.093e-05	59205	subspecies	                  Salmonella enterica subsp. houtenae
0.001503	4	4	4	1	4.093e-05	523831	no rank	                    Salmonella enterica subsp. houtenae str. ATCC BAA-1581
0.6287	1673	121	628	13	0.0002944	561	genus	              Escherichia
0.5603	1491	1406	539	12.7	0.000322	562	species	                Escherichia coli
0.02255	60	0	65	12.6	0.003479	168807	no rank	                  Escherichia coli O127:H6
0.02255	60	60	65	12.6	0.003479	574521	no rank	                    Escherichia coli O127:H6 str. E2348/69
0.006013	16	16	3	13.3	0.0002633	696406	no rank	                  Escherichia coli UMNK88
0.002255	6	6	1	6	0.0003908	1329907	no rank	                  Escherichia coli APEC IMT5155
0.0003758	1	0	2	1	0.0007599	498388	no rank	                  Escherichia coli C
0.0003758	1	1	2	1	0.000771	481805	no rank	                    Escherichia coli ATCC 8739
0.0003758	1	1	1	1	0.0004587	1358422	no rank	                  Escherichia coli PCN061
0.0003758	1	1	1	1	0.001256	1311757	no rank	                  Escherichia coli ACN001
0.02292	61	26	14	13.5	5.941e-05	208962	species	                Escherichia albertii
0.01315	35	35	3	18.7	0.0001193	1440052	no rank	                  Escherichia albertii KF1
0.1981	527	3	255	9.7	6.676e-05	547	genus	              Enterobacter
0.1503	400	9	202	9.8	7.012e-05	354276	species group	                Enterobacter cloacae complex
0.1139	303	282	115	12.1	0.0001064	550	species	                  Enterobacter cloacae
0.005261	14	14	3	16.7	6.374e-05	1354030	no rank	                    Enterobacter cloacae P101
0.002631	7	0	4	13	7.93e-05	336306	subspecies	                    Enterobacter cloacae subsp. cloacae
0.002255	6	6	3	17	0.0002044	1211025	no rank	                      Enterobacter cloacae subsp. cloacae ENHKU01
0.0003758	1	1	1	1	2.801e-05	716541	no rank	                      Enterobacter cloacae subsp. cloacae ATCC 13047
0.01917	51	0	15	17.3	7.303e-05	158836	species	                  Enterobacter hormaechei
0.01917	51	51	14	17.2	0.0003678	299766	subspecies	                    Enterobacter hormaechei subsp. steigerwaltii
0.008644	23	12	17	6.12	6.926e-05	1334193	species	                  Enterobacter lignolyticus
0.004134	11	11	4	8.75	6.993e-05	701347	no rank	                    Enterobacter lignolyticus SCF1
0.005261	14	14	8	7.62	0.0003624	208224	species	                  Enterobacter kobei
0.02706	72	72	13	18.6	0.0005608	1827481	species	                Enterobacter sp. ODB01
0.01203	32	32	7	17.9	0.0001723	1868135	species	                Enterobacter sp. HK169
0.007516	20	20	10	7.3	4.836e-05	1692238	species	                Enterobacter sp. FY-07
0.09283	247	2	191	7.46	7.388e-05	544	genus	              Citrobacter
0.08193	218	8	152	8.32	0.0001216	1344959	species group	                Citrobacter freundii complex
0.0699	186	168	117	9.02	0.0002119	546	species	                  Citrobacter freundii
0.006765	18	18	8	8.5	7.222e-05	1333848	no rank	                    Citrobacter freundii CFNIH1
0.008644	23	23	20	5.35	6.943e-05	67827	species	                  Citrobacter werkmanii
0.0003758	1	1	7	7.86	4.111e-05	57706	species	                  Citrobacter braakii
0.00714	19	0	3	15	1.501e-05	67825	species	                Citrobacter rodentium
0.00714	19	19	3	15	1.501e-05	637910	no rank	                  Citrobacter rodentium ICC168
0.003007	8	8	6	5.83	3.643e-05	67824	species	                Citrobacter farmeri
0.04021	107	0	73	10.4	0.0003166	579	genus	              Kluyvera
0.04021	107	107	73	10.4	0.0003166	61648	species	                Kluyvera intermedia
0.006765	18	0	41	3.63	7.548e-05	160674	genus	              Raoultella
0.006765	18	18	41	3.63	7.548e-05	54291	species	                Raoultella ornithinolytica
0.006765	18	0	11	6.82	1.658e-05	158483	genus	              Cedecea
0.006765	18	18	11	6.82	1.658e-05	158822	species	                Cedecea neteri
0.004134	11	0	20	5.9	2.066e-05	1330547	genus	              Kosakonia
0.004134	11	11	14	7.21	4.377e-05	208223	species	                Kosakonia cowanii
0.002255	6	2	6	7	1.182e-05	1330545	genus	              Lelliottia
0.001127	3	3	3	9	1.715e-05	1907578	species	                Lelliottia sp. PFL01
0.0003758	1	1	3	5	9.051e-06	61646	species	                Lelliottia amnigena
0.001503	4	1	26	4.46	2.138e-05	413496	genus	              Cronobacter
0.001127	3	0	3	3.33	2.299e-05	413502	species	                Cronobacter turicensis
0.001127	3	3	3	3.33	2.299e-05	693216	no rank	                  Cronobacter turicensis z3032
0.001127	3	0	5	1	5.745e-05	620	genus	              Shigella
0.0003758	1	0	2	1	9.683e-05	622	species	                Shigella dysenteriae
0.0003758	1	1	2	1	9.683e-05	300267	no rank	                  Shigella dysenteriae Sd197
0.0003758	1	0	2	1	7.106e-05	623	species	                Shigella flexneri
0.0003758	1	0	2	1	0.001333	42897	no rank	                  Shigella flexneri 2a
0.0003758	1	1	2	1	0.004566	198215	no rank	                    Shigella flexneri 2a str. 2457T
0.0003758	1	1	1	1	5.201e-05	621	species	                Shigella boydii
0.0007516	2	0	9	1.67	9.446e-06	191675	no rank	              unclassified Enterobacteriaceae
0.0003758	1	0	8	1.75	2.283e-05	36866	no rank	                unclassified Enterobacteriaceae (miscellaneous)
0.0003758	1	1	5	1	3.105e-05	891974	species	                  Plautia stali symbiont
0.0003758	1	0	1	1	1.66e-06	84563	no rank	                ant, tsetse, mealybug, aphid, etc. endosymbionts
0.0003758	1	0	1	1	4.056e-06	146507	no rank	                  aphid secondary symbionts
0.0003758	1	0	1	1	7.705e-06	568987	genus	                    Candidatus Hamiltonella
0.0003758	1	1	1	1	7.705e-06	138072	species	                      Candidatus Hamiltonella defensa
0.0003758	1	0	6	1	3.442e-05	1335483	genus	              Shimwellia
0.0003758	1	0	6	1	3.442e-05	563	species	                Shimwellia blattae
0.0003758	1	1	6	1	3.442e-05	630626	no rank	                  Shimwellia blattae DSM 4481 = NBRC 105725
0.02368	63	0	56	9.36	8.298e-06	1903411	family	            Yersiniaceae
0.02368	63	0	46	9.85	1.268e-05	613	genus	              Serratia
0.01879	50	28	23	14.6	2.221e-05	615	species	                Serratia marcescens
0.008268	22	22	4	21.2	4.156e-05	1249634	no rank	                  Serratia marcescens FGI94
0.004886	13	13	4	13.2	4.02e-05	61652	species	                Serratia rubidaea
0.01917	51	0	27	11.7	8.196e-06	1903414	family	            Morganellaceae
0.01841	49	0	20	14.9	8.374e-05	581	genus	              Morganella
0.01841	49	49	20	14.9	8.374e-05	582	species	                Morganella morganii
0.0003758	1	0	2	6	1.917e-06	626	genus	              Xenorhabdus
0.0003758	1	1	1	1	5.435e-06	628	species	                Xenorhabdus nematophila
0.0003758	1	0	2	1	2.014e-06	586	genus	              Providencia
0.0003758	1	0	2	1	1.278e-05	516075	species	                Providencia sneebia
0.0003758	1	1	2	1	1.278e-05	1141660	no rank	                  Providencia sneebia DSM 19967
0.001879	5	0	26	3.62	5.25e-06	1903410	family	            Pectobacteriaceae
0.001127	3	1	17	4.47	6.743e-06	204037	genus	              Dickeya
0.0007516	2	2	1	21	1.038e-05	568766	species	                Dickeya sp. NCPPB 3274
0.0003758	1	1	1	10	6.751e-07	122277	genus	              Pectobacterium
0.0003758	1	0	6	1	1.215e-05	84565	genus	              Sodalis
0.0003758	1	0	2	1	2.215e-05	1486991	species	                Candidatus Sodalis pierantonius
0.0003758	1	1	2	1	2.215e-05	2342	no rank	                  Candidatus Sodalis pierantonius str. SOPE
0.0003758	1	0	23	2.96	5.744e-06	1903409	family	            Erwiniaceae
0.0003758	1	0	7	4.14	6.772e-06	551	genus	              Erwinia
0.0003758	1	0	1	1	5.919e-06	338565	species	                Erwinia tasmaniensis
0.0003758	1	1	1	1	5.919e-06	465817	no rank	                  Erwinia tasmaniensis Et1/99
0.0003758	1	0	17	1	1.093e-05	1903412	family	            Hafniaceae
0.0003758	1	1	16	1	1.974e-05	635	genus	              Edwardsiella
0.07892	210	0	87	19.2	8.374e-06	135623	order	          Vibrionales
0.07892	210	0	87	19.2	8.374e-06	641	family	            Vibrionaceae
0.07892	210	0	86	19.4	1.012e-05	662	genus	              Vibrio
0.07065	188	188	78	20	0.0002986	674	species	                Vibrio mimicus
0.008268	22	0	5	20.4	2.542e-05	29494	species	                Vibrio furnissii
0.008268	22	22	5	20.4	2.542e-05	903510	no rank	                  Vibrio furnissii NCTC 11218
0.003758	10	0	13	5.54	8.04e-07	135622	order	          Alteromonadales
0.003382	9	0	8	8.38	1.537e-06	72275	family	            Alteromonadaceae
0.003007	8	0	4	14.8	1.947e-06	2742	genus	              Marinobacter
0.003007	8	0	4	14.8	1.404e-05	2743	species	                Marinobacter hydrocarbonoclasticus
0.003007	8	8	4	14.8	3.612e-05	351348	no rank	                  Marinobacter hydrocarbonoclasticus VT8
0.0003758	1	0	3	2.33	1.441e-06	226	genus	              Alteromonas
0.0003758	1	1	2	3	4.054e-06	314275	species	                Alteromonas mediterranea
0.0003758	1	0	2	1	5.922e-06	267894	family	            Psychromonadaceae
0.0003758	1	0	2	1	5.922e-06	67572	genus	              Psychromonas
0.0003758	1	0	1	1	4.952e-06	357794	species	                Psychromonas ingrahamii
0.0003758	1	1	1	1	4.952e-06	357804	no rank	                  Psychromonas ingrahamii 37
0.002631	7	0	10	7.7	3.483e-06	135624	order	          Aeromonadales
0.002631	7	0	10	7.7	3.483e-06	84642	family	            Aeromonadaceae
0.002631	7	0	10	7.7	4.765e-06	642	genus	              Aeromonas
0.002631	7	7	4	17.8	2.222e-05	652	species	                Aeromonas schubertii
0.0007516	2	0	14	4.79	3.205e-07	72274	order	          Pseudomonadales
0.0007516	2	0	14	4.79	3.696e-07	135621	family	            Pseudomonadaceae
0.0007516	2	0	13	5.08	3.5e-07	286	genus	              Pseudomonas
0.0007516	2	0	4	1.25	1.228e-06	136845	species group	                Pseudomonas putida group
0.0007516	2	0	4	1.25	1.854e-06	303	species	                  Pseudomonas putida
0.0007516	2	2	3	1.33	0.000324	1193499	no rank	                    Pseudomonas putida SJTE-1
0.0003758	1	0	5	1.2	6.766e-07	135619	order	          Oceanospirillales
0.0003758	1	0	4	1.25	1.143e-06	28256	family	            Halomonadaceae
0.0003758	1	1	2	1.5	6.535e-06	504090	genus	              Kushneria
0.0003758	1	0	2	2	7.749e-07	72273	order	          Thiotrichales
0.0003758	1	0	2	2	2.116e-06	135616	family	            Piscirickettsiaceae
0.0003758	1	0	2	2	1.82e-05	28884	genus	              Hydrogenovibrio
0.0003758	1	0	2	2	1.82e-05	39765	species	                Hydrogenovibrio crunogenus
0.0003758	1	1	2	2	1.82e-05	317025	no rank	                  Hydrogenovibrio crunogenus XCL-2
0.1345	358	0	3011	1.14	5.035e-05	28216	class	        Betaproteobacteria
0.1345	358	1	2998	1.14	5.9e-05	80840	order	          Burkholderiales
0.1323	352	4	2917	1.14	0.0001097	119060	family	            Burkholderiaceae
0.1304	347	19	2780	1.14	0.001172	48736	genus	              Ralstonia
0.1082	288	80	2122	1.15	0.005759	329	species	                Ralstonia pickettii
0.04209	112	112	572	1.15	0.004539	428406	no rank	                  Ralstonia pickettii 12D
0.03608	96	96	668	1.12	0.006248	402626	no rank	                  Ralstonia pickettii 12J
0.0109	29	29	233	1.15	0.001423	105219	species	                Ralstonia mannitolilytica
0.002631	7	6	22	1.05	2.051e-05	305	species	                Ralstonia solanacearum
0.0003758	1	1	1	2	4.9e-05	267608	no rank	                  Ralstonia solanacearum GMI1000
0.001503	4	4	24	1.08	6.555e-05	190721	species	                Ralstonia insidiosa
0.0003758	1	0	7	1	4.777e-07	32008	genus	              Burkholderia
0.0003758	1	1	5	1	6.467e-07	87882	species group	                Burkholderia cepacia complex
0.001127	3	0	27	1.11	3.058e-06	80864	family	            Comamonadaceae
0.0007516	2	0	19	1.16	1.346e-05	12916	genus	              Acidovorax
0.0007516	2	2	19	1.16	0.0001372	1858609	species	                Acidovorax sp. T1
0.0003758	1	0	5	1	2.16e-05	201096	genus	              Alicycliphilus
0.0003758	1	0	5	1	2.16e-05	179636	species	                Alicycliphilus denitrificans
0.0003758	1	1	5	1	0.0001159	596153	no rank	                  Alicycliphilus denitrificans BC
0.0007516	2	0	2	1	7.052e-07	119065	no rank	            unclassified Burkholderiales
0.0003758	1	1	1	1	3.516e-06	413882	species	              [Polyangium] brachysporum
0.0003758	1	0	1	1	4.906e-07	224471	no rank	              Burkholderiales Genera incertae sedis
0.0003758	1	0	1	1	4.765e-06	88	genus	                Leptothrix
0.0003758	1	0	1	1	4.765e-06	34029	species	                  Leptothrix cholodnii
0.0003758	1	1	1	1	4.765e-06	395495	no rank	                    Leptothrix cholodnii SP-6
0.0109	29	3	67	1.69	8.681e-07	28211	class	        Alphaproteobacteria
0.005261	14	0	29	1.03	2.334e-06	204455	order	          Rhodobacterales
0.005261	14	2	29	1.03	2.462e-06	31989	family	            Rhodobacteraceae
0.002255	6	1	9	1	1.168e-05	265	genus	              Paracoccus
0.001127	3	3	4	1	2.001e-05	147645	species	                Paracoccus yeei
0.0003758	1	0	3	1	1.36e-05	266	species	                Paracoccus denitrificans
0.0003758	1	1	3	1	1.36e-05	318586	no rank	                  Paracoccus denitrificans PD1222
0.0003758	1	0	1	1	4.668e-06	34003	species	                Paracoccus aminophilus
0.0003758	1	1	1	1	4.668e-06	1367847	no rank	                  Paracoccus aminophilus JCM 7686
0.0007516	2	0	2	1	1.802e-06	1060	genus	              Rhodobacter
0.0003758	1	0	1	1	1.683e-06	1063	species	                Rhodobacter sphaeroides
0.0003758	1	1	1	1	5.498e-06	349102	no rank	                  Rhodobacter sphaeroides ATCC 17025
0.0003758	1	0	1	1	5.986e-06	1061	species	                Rhodobacter capsulatus
0.0003758	1	1	1	1	5.986e-06	272942	no rank	                  Rhodobacter capsulatus SB 1003
0.0003758	1	0	1	1	4.513e-06	367771	genus	              Marinovum
0.0003758	1	0	1	1	4.513e-06	42444	species	                Marinovum algicola
0.0003758	1	1	1	1	4.513e-06	988812	no rank	                  Marinovum algicola DG 898
0.0003758	1	0	1	1	5.343e-06	309512	genus	              Dinoroseobacter
0.0003758	1	0	1	1	5.343e-06	215813	species	                Dinoroseobacter shibae
0.0003758	1	1	1	1	5.343e-06	398580	no rank	                  Dinoroseobacter shibae DFL 12 = DSM 16493
0.0003758	1	0	1	1	6.373e-06	159345	genus	              Roseibacterium
0.0003758	1	0	1	1	6.373e-06	159346	species	                Roseibacterium elongatum
0.0003758	1	1	1	1	6.373e-06	1294273	no rank	                  Roseibacterium elongatum DSM 19469
0.0003758	1	0	1	1	1.577e-06	34008	genus	              Rhodovulum
0.0003758	1	1	1	1	6.596e-06	308754	species	                Rhodovulum sp. MB263
0.003382	9	2	19	1.11	4.905e-07	356	order	          Rhizobiales
0.001127	3	0	4	1.25	4.078e-07	41294	family	            Bradyrhizobiaceae
0.0007516	2	0	2	1.5	3.318e-07	374	genus	              Bradyrhizobium
0.0003758	1	1	1	2	9.098e-07	1437360	species	                Bradyrhizobium erythrophlei
0.0003758	1	1	1	1	3.686e-06	335659	species	                Bradyrhizobium sp. S23321
0.0003758	1	0	1	1	9.668e-07	85413	genus	              Bosea
0.0003758	1	1	1	1	4.205e-06	1792307	species	                Bosea sp. PAMC 26642
0.0007516	2	0	6	1	4.508e-07	82115	family	            Rhizobiaceae
0.0007516	2	0	5	1	5.633e-07	227290	no rank	              Rhizobium/Agrobacterium group
0.0007516	2	2	5	1	7.791e-07	379	genus	                Rhizobium
0.0003758	1	1	2	1	2.89e-06	335928	family	            Xanthobacteraceae
0.0003758	1	0	2	1	5.186e-07	69277	family	            Phyllobacteriaceae
0.0003758	1	1	1	1	3.629e-07	68287	genus	              Mesorhizobium
0.0007516	2	0	5	5.2	5.849e-07	204441	order	          Rhodospirillales
0.0003758	1	0	3	8	7.072e-07	433	family	            Acetobacteraceae
0.0003758	1	0	1	1	4.149e-06	125216	genus	              Roseomonas
0.0003758	1	1	1	1	4.149e-06	257708	species	                Roseomonas gilardii
0.0003758	1	0	1	1	2.323e-07	41295	family	            Rhodospirillaceae
0.0003758	1	0	1	1	5.819e-07	191	genus	              Azospirillum
0.0003758	1	1	1	1	1.403e-06	192	species	                Azospirillum brasilense
0.0003758	1	0	3	1	2.659e-07	204457	order	          Sphingomonadales
0.0003758	1	0	2	1	2.274e-07	41297	family	            Sphingomonadaceae
0.0003758	1	0	1	1	5.155e-06	150203	genus	              Blastomonas
0.0003758	1	1	1	1	5.155e-06	1842535	species	                Blastomonas sp. RAC04
0.007892	21	0	130	1.66	5.349e-07	1783272	no rank	      Terrabacteria group
0.005261	14	0	73	1.23	6.488e-07	201174	phylum	        Actinobacteria
0.005261	14	1	71	1.23	6.497e-07	1760	class	          Actinobacteria
0.001503	4	0	24	1.21	4.707e-06	85009	order	            Propionibacteriales
0.001503	4	0	24	1.21	9.263e-06	31957	family	              Propionibacteriaceae
0.001127	3	0	16	1.31	3.333e-05	1912216	genus	                Cutibacterium
0.001127	3	3	16	1.31	8.202e-05	1747	species	                  Cutibacterium acnes
0.0003758	1	0	8	1	3.038e-05	1743	genus	                Propionibacterium
0.0003758	1	1	8	1	7.26e-05	671223	species	                  Propionibacterium sp. oral taxon 193
0.001127	3	1	25	1.2	1.434e-06	85006	order	            Micrococcales
0.0003758	1	0	22	1.09	4.036e-06	1268	family	              Micrococcaceae
0.0003758	1	0	22	1.09	0.0002045	1269	genus	                Micrococcus
0.0003758	1	1	22	1.09	0.0002045	1270	species	                  Micrococcus luteus
0.0003758	1	0	1	2	1.534e-07	85023	family	              Microbacteriaceae
0.0003758	1	0	1	2	3.142e-06	518733	genus	                Microterricola
0.0003758	1	1	1	2	3.142e-06	412690	species	                  Microterricola viridarii
0.0007516	2	0	8	1	1.162e-05	1643682	order	            Geodermatophilales
0.0007516	2	0	8	1	1.162e-05	85030	family	              Geodermatophilaceae
0.0003758	1	0	6	1	2.846e-05	38501	genus	                Blastococcus
0.0003758	1	0	6	1	2.846e-05	138336	species	                  Blastococcus saxobsidens
0.0003758	1	1	6	1	2.846e-05	1146883	no rank	                    Blastococcus saxobsidens DD2
0.0003758	1	0	1	1	4.337e-06	1860	genus	                Geodermatophilus
0.0003758	1	0	1	1	4.337e-06	1861	species	                  Geodermatophilus obscurus
0.0003758	1	1	1	1	4.337e-06	526225	no rank	                    Geodermatophilus obscurus DSM 43160
0.0007516	2	0	4	1.75	4.342e-07	85010	order	            Pseudonocardiales
0.0007516	2	0	4	1.75	4.342e-07	2070	family	              Pseudonocardiaceae
0.0007516	2	0	2	1.5	9.746e-07	1813	genus	                Amycolatopsis
0.0003758	1	0	1	2	3.191e-06	1814	species	                  Amycolatopsis methanolica
0.0003758	1	1	1	2	3.191e-06	1068978	no rank	                    Amycolatopsis methanolica 239
0.0003758	1	1	1	1	1.732e-06	31958	species	                  Amycolatopsis orientalis
0.0003758	1	0	2	1	6.981e-08	85007	order	            Corynebacteriales
0.0003758	1	0	1	1	8.197e-08	1762	family	              Mycobacteriaceae
0.0003758	1	1	1	1	8.347e-08	1763	genus	                Mycobacterium
0.0003758	1	0	2	1	7.209e-08	85011	order	            Streptomycetales
0.0003758	1	0	2	1	7.209e-08	2062	family	              Streptomycetaceae
0.0003758	1	0	2	1	7.492e-08	1883	genus	                Streptomyces
0.0003758	1	1	1	1	3.917e-06	408015	species	                  Streptomyces xiamenensis
0.002631	7	0	56	2.23	6.005e-07	1239	phylum	        Firmicutes
0.001503	4	0	30	2.83	4.574e-07	91061	class	          Bacilli
0.001503	4	0	26	1.85	1.38e-06	186826	order	            Lactobacillales
0.001503	4	0	21	1.71	3.404e-06	1300	family	              Streptococcaceae
0.001503	4	3	21	1.71	4.066e-06	1301	genus	                Streptococcus
0.0003758	1	1	1	2	4.203e-06	1304	species	                  Streptococcus salivarius
0.0003758	1	0	19	1.37	7.956e-07	186801	class	          Clostridia
0.0003758	1	0	19	1.37	9.376e-07	186802	order	            Clostridiales
0.0003758	1	0	19	1.37	6.807e-06	186803	family	              Lachnospiraceae
0.0003758	1	0	19	1.37	0.0001273	186928	no rank	                unclassified Lachnospiraceae
0.0003758	1	0	19	1.37	0.0001273	39491	species	                  [Eubacterium] rectale
0.0003758	1	1	19	1.37	0.0001273	515619	no rank	                    [Eubacterium] rectale ATCC 33656
0.0003758	1	0	4	2	2.023e-06	909932	class	          Negativicutes
0.0003758	1	0	4	2	7.722e-06	1843489	order	            Veillonellales
0.0003758	1	0	4	2	7.722e-06	31977	family	              Veillonellaceae
0.0003758	1	0	4	2	1.618e-05	29465	genus	                Veillonella
0.0003758	1	1	3	2	1.934e-05	29466	species	                  Veillonella parvula
0.0003758	1	0	3	2	3.906e-06	1737404	class	          Tissierellia
0.0003758	1	0	3	2	4.339e-06	1737405	order	            Tissierellales
0.0003758	1	0	3	2	5.442e-06	1570339	family	              Peptoniphilaceae
0.0003758	1	0	3	2	4.225e-05	543311	genus	                Parvimonas
0.0003758	1	1	3	2	4.225e-05	33033	species	                  Parvimonas micra
0.0003758	1	0	8	1.75	1.742e-07	1783270	no rank	      FCB group
0.0003758	1	0	8	1.75	1.769e-07	68336	no rank	        Bacteroidetes/Chlorobi group
0.0003758	1	0	8	1.75	1.852e-07	976	phylum	          Bacteroidetes
0.0003758	1	0	8	1.75	1.05e-06	200643	class	            Bacteroidia
0.0003758	1	0	8	1.75	1.191e-06	171549	order	              Bacteroidales
0.0003758	1	0	8	1.75	6.025e-06	171552	family	                Prevotellaceae
0.0003758	1	0	8	1.75	6.025e-06	838	genus	                  Prevotella
0.0003758	1	1	8	1.75	3.294e-05	28131	species	                    Prevotella intermedia
