Assembly	# contigs (>= 0 bp)	# contigs (>= 1000 bp)	# contigs (>= 5000 bp)	# contigs (>= 10000 bp)	# contigs (>= 25000 bp)	# contigs (>= 50000 bp)	Total length (>= 0 bp)	Total length (>= 1000 bp)	Total length (>= 5000 bp)	Total length (>= 10000 bp)	Total length (>= 25000 bp)	Total length (>= 50000 bp)	# contigs	Largest contig	Total length	GC (%)	N50	N75	L50	L75	# N's per 100 kbp
ERR033333_scaffolds	38	38	31	31	23	13	2738768	2738768	2721759	2721759	2614424	2248006	38	387436	2738768	32.63	173528	80112	5	11	29.06
ERR033354_scaffolds	60	60	49	45	37	18	2687302	2687302	2658083	2623630	2488194	1833569	60	170998	2687302	32.70	86652	39650	11	23	0.74
ERR033425_scaffolds	49	49	44	40	32	20	2735526	2735526	2718973	2690130	2556947	2136349	49	285699	2735526	32.70	98632	55422	9	19	11.11
ERR033457_scaffolds	40	40	34	32	27	17	2723577	2723577	2707980	2689642	2613436	2231733	40	294801	2723577	32.64	126239	69447	7	14	11.82
ERR033465_scaffolds	40	40	35	34	27	15	2758622	2758622	2746670	2739514	2646128	2174536	40	421471	2758622	32.63	115616	55661	6	14	11.96
ERR033466_scaffolds	46	46	42	37	28	17	2800518	2800518	2792466	2751779	2602216	2179314	46	327932	2800518	32.64	125441	54012	8	16	15.71
ERR033473_scaffolds	52	52	43	42	35	18	2775067	2775067	2751850	2746440	2629872	2014138	52	318371	2775067	32.66	85509	43102	10	20	21.95
ERR033474_scaffolds	50	50	41	37	31	20	2711457	2711457	2687480	2656277	2574559	2196558	50	281493	2711457	32.68	100113	62063	8	18	19.18
ERR033475_scaffolds	52	52	42	40	31	17	2803580	2803580	2773555	2759098	2615649	2067132	52	204920	2803580	32.64	108024	48888	9	18	11.13
ERR033476_scaffolds	44	44	38	36	27	17	2788063	2788063	2772001	2755862	2612232	2236204	44	286258	2788063	32.65	125246	70948	8	15	12.09
ERR033477_scaffolds	50	50	39	38	31	16	2756176	2756176	2724211	2715080	2622910	2055294	50	323847	2756176	32.67	108161	47632	8	17	14.77
ERR033486_scaffolds	45	45	38	38	33	19	2802400	2802400	2782593	2782593	2702348	2188260	45	263077	2802400	32.63	91480	54157	9	18	11.20
ERR033488_scaffolds	65	65	51	46	32	17	2781140	2781140	2742172	2705432	2496459	1981654	65	262327	2781140	32.65	108025	40097	9	20	29.41
ERR033511_scaffolds	43	43	36	33	30	21	2803499	2803499	2787500	2768050	2717796	2377242	43	174698	2803499	32.63	111066	77977	10	17	17.41
ERR033512_scaffolds	48	48	40	37	31	21	2800088	2800088	2777734	2756161	2674776	2296009	48	286243	2800088	32.62	98366	67021	9	18	5.14
ERR033514_scaffolds	54	54	43	38	30	17	2771648	2771648	2743309	2704696	2574598	2120090	54	261971	2771648	32.64	110259	51650	8	17	7.11
ERR033518_scaffolds	48	48	41	38	31	18	2805165	2805165	2784497	2760140	2636933	2160990	48	251605	2805165	32.63	110021	54180	9	17	12.90
ERR033519_scaffolds	50	50	41	40	31	17	2802511	2802511	2772292	2764946	2602563	2101853	50	281144	2802511	32.62	103901	49298	8	18	7.39
ERR033553_scaffolds	39	39	30	30	27	17	2772990	2772990	2749010	2749010	2688964	2346469	39	302685	2772990	32.65	149860	87201	7	13	18.54
ERR033555_scaffolds	49	49	41	40	28	14	2776908	2776908	2758708	2751110	2557003	2079853	49	306354	2776908	32.65	139512	42937	7	15	11.27
ERR033583_scaffolds	51	51	42	37	32	19	2742141	2742141	2721546	2683570	2600726	2134294	51	258321	2742141	32.69	103895	50380	10	18	10.94
ERR033605_scaffolds	48	48	43	41	33	21	2765212	2765212	2751713	2736563	2590319	2117980	48	233087	2765212	32.66	90060	51963	11	21	8.75
ERR033607_scaffolds	49	49	43	41	31	19	2761614	2761614	2746563	2729555	2555447	2091964	49	244134	2761614	32.67	104052	50518	10	19	13.58
ERR033608_scaffolds	50	50	44	40	36	17	2798691	2798691	2783079	2754453	2686987	1990804	50	210218	2798691	32.64	108029	45267	9	20	18.58
ERR033615_scaffolds	73	73	60	54	37	17	2801227	2801227	2763363	2716022	2428241	1728096	73	252963	2801227	32.63	72071	35491	12	27	7.00
ERR033618_scaffolds	170	170	107	77	35	9	2734691	2734691	2558924	2341526	1665463	725140	170	130289	2734691	32.73	35674	15606	25	55	24.83
ERR033619_scaffolds	84	84	66	62	40	20	2756145	2756145	2713182	2680650	2302709	1628301	84	158838	2756145	32.68	66105	30705	16	32	8.09
ERR033620_scaffolds	223	223	120	71	28	9	2705915	2705915	2420315	2069038	1407080	730191	223	122694	2705915	32.75	27656	10268	26	68	27.83
ERR033621_scaffolds	62	62	52	46	37	17	2836145	2836145	2810197	2762521	2602262	1835899	62	173958	2836145	32.67	86310	42778	12	24	7.93
ERR033622_scaffolds	52	52	45	43	33	20	2771043	2771043	2752563	2736552	2567399	2107611	52	264133	2771043	32.65	96194	55740	11	20	12.31
ERR033623_scaffolds	52	52	46	43	34	20	2808119	2808119	2792621	2769487	2619148	2142461	52	251386	2808119	32.70	98515	53740	9	20	11.97
ERR033624_scaffolds	56	56	48	46	36	21	2753164	2753164	2732108	2718333	2547451	2001409	56	196163	2753164	32.67	91281	43631	12	23	4.39
ERR033625_scaffolds	54	54	46	42	32	19	2835424	2835424	2812964	2778092	2616316	2134603	54	286549	2835424	32.68	103965	54383	10	19	15.27
ERR033630_scaffolds	55	55	45	42	35	22	2694323	2694323	2665932	2647137	2540837	2074844	55	188915	2694323	32.69	87971	53869	11	21	32.85
ERR033639_scaffolds	99	99	72	53	35	13	2705278	2705278	2617934	2470442	2160925	1378476	99	246367	2705278	32.68	53412	30155	13	31	74.89
ERR033645_scaffolds	42	42	39	35	30	18	2801666	2801666	2790472	2757453	2665216	2213203	42	300307	2801666	32.63	108310	53702	8	16	18.77
ERR033648_scaffolds	51	51	43	41	33	20	2758578	2758578	2737596	2721440	2607907	2120376	51	228188	2758578	32.68	100680	51669	10	20	10.33
ERR038660_scaffolds	50	50	43	40	31	19	2729788	2729788	2711196	2688024	2528024	2083031	50	365652	2729788	32.64	88639	52075	9	19	21.98
ERR038682_scaffolds	1	1	0	0	0	0	1217	1217	0	0	0	0	1	1217	1217	49.21	1217	1217	1	1	821.69
ERR039397_scaffolds	60	60	50	46	38	17	2713860	2713860	2687698	2658788	2520406	1760751	60	213262	2713860	32.67	72979	39412	11	24	29.48
