# KrakenUniq v0.5.7 DATE:2019-04-15T15:56:57Z DB:/home/biouser/SAM/DBDIR/LIBRARY_MINIKRAKEN/minikraken_20171019_8GB DB_SIZE:8053064728 WD:/home/biouser/SAM
# CL:perl /home/biouser/miniconda3/bin/krakenuniq --db /home/biouser/SAM/DBDIR/LIBRARY_MINIKRAKEN/minikraken_20171019_8GB -paired /home/biouser/SAM/data/10-KPN_S9_mixed_with_5%_4-NTS_S4_R1.fastq.gz /home/biouser/SAM/data/10-KPN_S9_mixed_with_5%_4-NTS_S4_R2.fastq.gz --report-file /home/biouser/SAM/data/10-KPN_S9_mixed_with_5%_4-NTS_S4.krakenuniq.report.tsv

%	reads	taxReads	kmers	dup	cov	taxID	rank	taxName
0.7712	2052	2052	10089218	8.01	1.175	0	no rank	unclassified
99.23	264036	238	354961	10.3	0.0005358	1	no rank	root
99.14	263798	1	352272	10.4	0.0005392	131567	no rank	  cellular organisms
99.14	263797	355	352272	10.4	0.0005578	2	superkingdom	    Bacteria
99	263423	329	351066	10.3	0.001105	1224	phylum	      Proteobacteria
98.72	262685	915	346880	10.4	0.002269	1236	class	        Gammaproteobacteria
98.29	261531	2384	344613	10.3	0.0082	91347	order	          Enterobacterales
97.34	259016	7067	333999	10.3	0.01604	543	family	            Enterobacteriaceae
88.76	236171	23135	202815	14.3	0.06884	570	genus	              Klebsiella
79.78	212296	208717	106222	14.2	0.1231	573	species	                Klebsiella pneumoniae
1.035	2754	1761	533	10.6	0.006372	72407	subspecies	                  Klebsiella pneumoniae subsp. pneumoniae
0.1624	432	432	80	12.2	0.01112	1123862	no rank	                    Klebsiella pneumoniae subsp. pneumoniae Kp13
0.09809	261	261	50	8.96	0.006143	272620	no rank	                    Klebsiella pneumoniae subsp. pneumoniae MGH 78578
0.08493	226	226	46	9.28	0.005144	1328324	no rank	                    Klebsiella pneumoniae subsp. pneumoniae KPNIH27
0.01992	53	53	11	8.73	0.003059	1392499	no rank	                    Klebsiella pneumoniae subsp. pneumoniae 1158
0.006013	16	16	2	9	0.0009862	1125630	no rank	                    Klebsiella pneumoniae subsp. pneumoniae HS11286
0.001879	5	5	5	1.2	0.006935	1193292	no rank	                    Klebsiella pneumoniae subsp. pneumoniae 1084
0.1639	436	0	184	13.2	0.008366	39831	subspecies	                  Klebsiella pneumoniae subsp. rhinoscleromatis
0.1639	436	436	184	13.2	0.008366	861365	no rank	                    Klebsiella pneumoniae subsp. rhinoscleromatis SB3432
0.07629	203	203	70	7.87	0.01669	1365186	no rank	                  Klebsiella pneumoniae KP-1
0.04698	125	125	41	8.39	0.01001	1049565	no rank	                  Klebsiella pneumoniae KCTC 2242
0.02105	56	56	9	9.33	0.0003846	507522	no rank	                  Klebsiella pneumoniae 342
0.0007516	2	2	3	1	0.00297	1380908	no rank	                  Klebsiella pneumoniae JM45
0.0003758	1	1	2	1	0.007605	1420012	no rank	                  Klebsiella pneumoniae 30660/NJST258_1
0.0003758	1	1	1	1	0.001908	1244085	no rank	                  Klebsiella pneumoniae CG43
0.0003758	1	1	1	1	0.003436	1304922	no rank	                  Klebsiella pneumoniae 500_1420
0.1124	299	288	110	13	0.0003546	548	species	                Klebsiella aerogenes
0.004134	11	11	7	4.71	0.0001537	1028307	no rank	                  Klebsiella aerogenes KCTC 2190
0.04735	126	113	68	6.97	0.0009321	244366	species	                Klebsiella variicola
0.004886	13	13	11	8.36	0.000758	640131	no rank	                  Klebsiella variicola At-22
0.04547	121	121	136	5.4	0.001152	2026240	species	                Klebsiella quasivariicola
0.03721	99	99	53	9.15	0.001556	1463165	species	                Klebsiella quasipneumoniae
0.02706	72	67	59	8.76	0.0001695	571	species	                Klebsiella oxytoca
0.001879	5	5	3	8	0.0001794	1333852	no rank	                  Klebsiella oxytoca KONIH1
0.003382	9	9	3	7	8.98e-05	1934254	species	                Klebsiella sp. M5al
0.003007	8	2	10	2.1	4.753e-05	1134687	species	                Klebsiella michiganensis
0.002255	6	6	1	10	0.0002068	1006551	no rank	                  Klebsiella michiganensis KCTC 1686
0.002255	6	6	6	14.5	0.0002942	1905288	species	                Klebsiella sp. LTGPAF-6F
4.874	12969	91	93223	1.47	0.04541	590	genus	              Salmonella
4.84	12878	11791	84467	1.47	0.04703	28901	species	                Salmonella enterica
0.3905	1039	502	2443	2.12	0.003244	59201	subspecies	                  Salmonella enterica subsp. enterica
0.1079	287	285	1401	1.48	0.0529	90371	no rank	                    Salmonella enterica subsp. enterica serovar Typhimurium
0.0003758	1	1	1	1	0.00128	568709	no rank	                      Salmonella enterica subsp. enterica serovar Typhimurium str. DT2
0.0003758	1	1	1	1	0.005051	1008297	no rank	                      Salmonella enterica subsp. enterica serovar Typhimurium str. 798
0.02105	56	0	9	21.7	0.003031	29482	no rank	                    Salmonella enterica subsp. enterica serovar Abony
0.02105	56	56	9	21.7	0.003031	1029983	no rank	                      Salmonella enterica subsp. enterica serovar Abony str. 0014
0.01503	40	0	11	9.73	0.00221	58096	no rank	                    Salmonella enterica subsp. enterica serovar Bareilly
0.01503	40	40	11	9.73	0.00221	1173427	no rank	                      Salmonella enterica subsp. enterica serovar Bareilly str. CFSAN000189
0.0124	33	32	7	14.4	0.0004147	595	no rank	                    Salmonella enterica subsp. enterica serovar Infantis
0.0003758	1	1	3	1	0.0003016	596155	no rank	                      Salmonella enterica subsp. enterica serovar Infantis str. SARB27
0.01015	27	0	55	1.55	0.01741	340190	no rank	                    Salmonella enterica subsp. enterica serovar Schwarzengrund
0.01015	27	27	55	1.55	0.01741	439843	no rank	                      Salmonella enterica subsp. enterica serovar Schwarzengrund str. CVM19633
0.00714	19	0	4	23.8	0.0003759	1242081	no rank	                    Salmonella enterica subsp. enterica serovar Hillingdon
0.00714	19	19	4	23.8	0.0003759	1242096	no rank	                      Salmonella enterica subsp. enterica serovar Hillingdon str. N1529-D3
0.006765	18	0	4	16.8	0.0002665	192954	no rank	                    Salmonella enterica subsp. enterica serovar Mbandaka
0.006765	18	18	4	16.8	0.0002665	984237	no rank	                      Salmonella enterica subsp. enterica serovar Mbandaka str. ATCC 51958
0.004134	11	11	8	6.88	0.0003514	90370	no rank	                    Salmonella enterica subsp. enterica serovar Typhi
0.003382	9	0	3	8.67	0.0003188	1242079	no rank	                    Salmonella enterica subsp. enterica serovar Apapa
0.003382	9	9	3	8.67	0.0003188	1242088	no rank	                      Salmonella enterica subsp. enterica serovar Apapa str. SA20060561
0.003007	8	0	2	13	0.0003679	115981	no rank	                    Salmonella enterica subsp. enterica serovar Montevideo
0.003007	8	8	2	13	0.0009005	859199	no rank	                      Salmonella enterica subsp. enterica serovar Montevideo str. 507440-20
0.003007	8	0	1	21	0.0001384	82689	no rank	                    Salmonella enterica subsp. enterica serovar Muenster
0.003007	8	8	1	21	0.0001384	1124958	no rank	                      Salmonella enterica subsp. enterica serovar Muenster str. 0315
0.001127	3	0	5	1	0.0008575	915158	no rank	                    Salmonella enterica subsp. enterica serovar Manchester
0.001127	3	3	5	1	0.0008575	1242108	no rank	                      Salmonella enterica subsp. enterica serovar Manchester str. ST278
0.0007516	2	0	6	1	0.0001303	1242085	no rank	                    Salmonella enterica subsp. enterica serovar Macclesfield
0.0007516	2	2	6	1	0.0001303	1242107	no rank	                      Salmonella enterica subsp. enterica serovar Macclesfield str. S-1643
0.0007516	2	1	4	1	0.0002175	58712	no rank	                    Salmonella enterica subsp. enterica serovar Anatum
0.0003758	1	1	3	1	0.004127	1454584	no rank	                      Salmonella enterica subsp. enterica serovar Anatum str. USDA-ARS-USMARC-1727
0.0007516	2	2	2	1	0.0001961	54388	no rank	                    Salmonella enterica subsp. enterica serovar Paratyphi A
0.0007516	2	0	2	1	0.0003261	211968	no rank	                    Salmonella enterica subsp. enterica serovar Albany
0.0007516	2	2	2	1	0.0003261	1173798	no rank	                      Salmonella enterica subsp. enterica serovar Albany str. ATCC 51960
0.0007516	2	2	2	1	0.0002853	1243585	no rank	                    Salmonella enterica subsp. enterica serovar Ouakam
0.0003758	1	0	4	1	0.0003858	189201	no rank	                    Salmonella enterica subsp. enterica serovar Cubana
0.0003758	1	1	4	1	0.0003858	1271863	no rank	                      Salmonella enterica subsp. enterica serovar Cubana str. CFSAN002050
0.0003758	1	0	2	1	0.001669	58095	no rank	                    Salmonella enterica subsp. enterica serovar Agona
0.0003758	1	1	2	1	0.0303	1406860	no rank	                      Salmonella enterica subsp. enterica serovar Agona str. 24249
0.0003758	1	1	2	1	9.071e-05	108619	no rank	                    Salmonella enterica subsp. enterica serovar Newport
0.0003758	1	0	2	1	0.0001568	1242080	no rank	                    Salmonella enterica subsp. enterica serovar Djakarta
0.0003758	1	1	2	1	0.0001568	1242091	no rank	                      Salmonella enterica subsp. enterica serovar Djakarta str. S-1087
0.0003758	1	1	1	1	7.196e-05	28150	no rank	                    Salmonella enterica subsp. enterica serovar Senftenberg
0.0003758	1	0	1	1	0.0003764	611	no rank	                    Salmonella enterica subsp. enterica serovar Heidelberg
0.0003758	1	1	1	1	0.004425	1124936	no rank	                      Salmonella enterica subsp. enterica serovar Heidelberg str. 41578
0.0003758	1	1	1	1	5.678e-05	57743	no rank	                    Salmonella enterica subsp. enterica serovar Weltevreden
0.0003758	1	0	1	1	0.0001363	260368	no rank	                    Salmonella enterica subsp. enterica serovar Bergen
0.0003758	1	1	1	1	0.0001363	1240708	no rank	                      Salmonella enterica subsp. enterica serovar Bergen str. ST350
0.01428	38	36	17	11.4	0.0001303	59204	subspecies	                  Salmonella enterica subsp. diarizonae
0.0003758	1	0	1	1	4.309e-05	1243611	no rank	                    Salmonella enterica subsp. diarizonae serovar 50:k:z
0.0003758	1	1	1	1	4.309e-05	1243612	no rank	                      Salmonella enterica subsp. diarizonae serovar 50:k:z str. MZ0080
0.0003758	1	0	1	1	5.215e-05	1243615	no rank	                    Salmonella enterica subsp. diarizonae serovar 65:c:z
0.0003758	1	1	1	1	5.215e-05	1243616	no rank	                      Salmonella enterica subsp. diarizonae serovar 65:c:z str. SA20044251
0.002631	7	0	11	4.55	6.474e-05	59202	subspecies	                  Salmonella enterica subsp. salamae
0.002631	7	0	8	3	8.164e-05	1243601	no rank	                    Salmonella enterica subsp. salamae serovar 55:k:z39
0.002631	7	7	8	3	8.164e-05	1243602	no rank	                      Salmonella enterica subsp. salamae serovar 55:k:z39 str. 1315K
0.0007516	2	0	5	1	5.117e-05	59205	subspecies	                  Salmonella enterica subsp. houtenae
0.0007516	2	2	5	1	5.117e-05	523831	no rank	                    Salmonella enterica subsp. houtenae str. ATCC BAA-1581
0.0003758	1	1	2	1	1.367e-05	59203	subspecies	                  Salmonella enterica subsp. arizonae
0.6829	1817	131	631	13.8	0.0002958	561	genus	              Escherichia
0.6092	1621	1529	543	13.5	0.0003244	562	species	                Escherichia coli
0.0248	66	0	65	13.7	0.003479	168807	no rank	                  Escherichia coli O127:H6
0.0248	66	66	65	13.7	0.003479	574521	no rank	                    Escherichia coli O127:H6 str. E2348/69
0.006389	17	17	3	14.7	0.0002633	696406	no rank	                  Escherichia coli UMNK88
0.002255	6	6	1	6	0.0003908	1329907	no rank	                  Escherichia coli APEC IMT5155
0.0003758	1	0	2	1	0.0007599	498388	no rank	                  Escherichia coli C
0.0003758	1	1	2	1	0.000771	481805	no rank	                    Escherichia coli ATCC 8739
0.0003758	1	1	1	1	0.0004587	1358422	no rank	                  Escherichia coli PCN061
0.0003758	1	1	1	1	0.001256	1311757	no rank	                  Escherichia coli ACN001
0.02443	65	28	14	14.3	5.941e-05	208962	species	                Escherichia albertii
0.01391	37	37	3	19.3	0.0001193	1440052	no rank	                  Escherichia albertii KF1
0.2067	550	3	252	10.2	6.598e-05	547	genus	              Enterobacter
0.1563	416	9	201	10.3	6.977e-05	354276	species group	                Enterobacter cloacae complex
0.1173	312	291	115	12.4	0.0001064	550	species	                  Enterobacter cloacae
0.005261	14	14	3	16.7	6.374e-05	1354030	no rank	                    Enterobacter cloacae P101
0.002631	7	0	4	13	7.93e-05	336306	subspecies	                    Enterobacter cloacae subsp. cloacae
0.002255	6	6	3	17	0.0002044	1211025	no rank	                      Enterobacter cloacae subsp. cloacae ENHKU01
0.0003758	1	1	1	1	2.801e-05	716541	no rank	                      Enterobacter cloacae subsp. cloacae ATCC 13047
0.01954	52	0	15	17.7	7.303e-05	158836	species	                  Enterobacter hormaechei
0.01954	52	52	14	17.6	0.0003678	299766	subspecies	                    Enterobacter hormaechei subsp. steigerwaltii
0.01015	27	13	17	6.88	6.926e-05	1334193	species	                  Enterobacter lignolyticus
0.005261	14	14	4	10	6.993e-05	701347	no rank	                    Enterobacter lignolyticus SCF1
0.005637	15	15	8	7.88	0.0003624	208224	species	                  Enterobacter kobei
0.0003758	1	1	7	4.57	2.122e-05	61645	species	                  Enterobacter asburiae
0.02856	76	76	13	19.2	0.0005608	1827481	species	                Enterobacter sp. ODB01
0.01278	34	34	7	18.9	0.0001723	1868135	species	                Enterobacter sp. HK169
0.007892	21	21	10	7.5	4.836e-05	1692238	species	                Enterobacter sp. FY-07
0.09734	259	2	190	7.76	7.349e-05	544	genus	              Citrobacter
0.08531	227	8	150	8.69	0.00012	1344959	species group	                Citrobacter freundii complex
0.07328	195	175	116	9.39	0.0002101	546	species	                  Citrobacter freundii
0.007516	20	20	7	10.7	6.32e-05	1333848	no rank	                    Citrobacter freundii CFNIH1
0.008644	23	23	20	5.4	6.943e-05	67827	species	                  Citrobacter werkmanii
0.0003758	1	1	7	8.29	4.111e-05	57706	species	                  Citrobacter braakii
0.007516	20	0	4	12	2.001e-05	67825	species	                Citrobacter rodentium
0.007516	20	20	4	12	2.001e-05	637910	no rank	                  Citrobacter rodentium ICC168
0.003758	10	10	5	7.8	3.035e-05	67824	species	                Citrobacter farmeri
0.04397	117	0	73	11.2	0.0003166	579	genus	              Kluyvera
0.04397	117	117	73	11.2	0.0003166	61648	species	                Kluyvera intermedia
0.007516	20	0	42	3.79	7.732e-05	160674	genus	              Raoultella
0.007516	20	20	42	3.79	7.732e-05	54291	species	                Raoultella ornithinolytica
0.007516	20	0	11	7.45	1.658e-05	158483	genus	              Cedecea
0.007516	20	20	11	7.45	1.658e-05	158822	species	                Cedecea neteri
0.004134	11	0	19	6.32	1.963e-05	1330547	genus	              Kosakonia
0.004134	11	11	13	7.77	4.065e-05	208223	species	                Kosakonia cowanii
0.001879	5	2	6	7.5	1.182e-05	1330545	genus	              Lelliottia
0.001127	3	3	3	9.67	1.715e-05	1907578	species	                Lelliottia sp. PFL01
0.001503	4	1	29	4.45	2.385e-05	413496	genus	              Cronobacter
0.001127	3	0	3	3.67	2.299e-05	413502	species	                Cronobacter turicensis
0.001127	3	3	3	3.67	2.299e-05	693216	no rank	                  Cronobacter turicensis z3032
0.001127	3	0	5	1	5.745e-05	620	genus	              Shigella
0.0003758	1	0	2	1	9.683e-05	622	species	                Shigella dysenteriae
0.0003758	1	1	2	1	9.683e-05	300267	no rank	                  Shigella dysenteriae Sd197
0.0003758	1	0	2	1	7.106e-05	623	species	                Shigella flexneri
0.0003758	1	0	2	1	0.001333	42897	no rank	                  Shigella flexneri 2a
0.0003758	1	1	2	1	0.004566	198215	no rank	                    Shigella flexneri 2a str. 2457T
0.0003758	1	1	1	1	5.201e-05	621	species	                Shigella boydii
0.0003758	1	0	7	4.57	3.712e-05	83654	genus	              Leclercia
0.0003758	1	1	7	4.57	3.712e-05	83655	species	                Leclercia adecarboxylata
0.0003758	1	0	10	1.7	1.05e-05	191675	no rank	              unclassified Enterobacteriaceae
0.0003758	1	0	10	1.7	2.853e-05	36866	no rank	                unclassified Enterobacteriaceae (miscellaneous)
0.0003758	1	1	6	1	3.726e-05	891974	species	                  Plautia stali symbiont
0.0003758	1	0	6	1	3.442e-05	1335483	genus	              Shimwellia
0.0003758	1	0	6	1	3.442e-05	563	species	                Shimwellia blattae
0.0003758	1	1	6	1	3.442e-05	630626	no rank	                  Shimwellia blattae DSM 4481 = NBRC 105725
0.02556	68	0	55	10.1	8.15e-06	1903411	family	            Yersiniaceae
0.02556	68	0	46	10.5	1.268e-05	613	genus	              Serratia
0.02029	54	31	23	15.6	2.221e-05	615	species	                Serratia marcescens
0.008644	23	23	4	22.8	4.156e-05	1249634	no rank	                  Serratia marcescens FGI94
0.005261	14	14	4	14.2	4.02e-05	61652	species	                Serratia rubidaea
0.02029	54	0	26	12.8	7.893e-06	1903414	family	            Morganellaceae
0.01954	52	0	20	15.8	8.374e-05	581	genus	              Morganella
0.01954	52	52	20	15.8	8.374e-05	582	species	                Morganella morganii
0.0003758	1	0	2	6.5	1.917e-06	626	genus	              Xenorhabdus
0.0003758	1	1	1	1	5.435e-06	628	species	                Xenorhabdus nematophila
0.0003758	1	0	2	1	2.014e-06	586	genus	              Providencia
0.0003758	1	0	2	1	1.278e-05	516075	species	                Providencia sneebia
0.0003758	1	1	2	1	1.278e-05	1141660	no rank	                  Providencia sneebia DSM 19967
0.002255	6	0	27	3.59	5.452e-06	1903410	family	            Pectobacteriaceae
0.001127	3	1	17	4.59	6.743e-06	204037	genus	              Dickeya
0.0007516	2	2	1	22	1.038e-05	568766	species	                Dickeya sp. NCPPB 3274
0.0007516	2	2	2	5.5	1.35e-06	122277	genus	              Pectobacterium
0.0003758	1	0	4	1	8.099e-06	84565	genus	              Sodalis
0.0003758	1	0	2	1	2.215e-05	1486991	species	                Candidatus Sodalis pierantonius
0.0003758	1	1	2	1	2.215e-05	2342	no rank	                  Candidatus Sodalis pierantonius str. SOPE
0.0007516	2	0	27	2.85	6.743e-06	1903409	family	            Erwiniaceae
0.0007516	2	1	9	3.44	8.706e-06	551	genus	              Erwinia
0.0003758	1	0	1	1	5.919e-06	338565	species	                Erwinia tasmaniensis
0.0003758	1	1	1	1	5.919e-06	465817	no rank	                  Erwinia tasmaniensis Et1/99
0.0003758	1	0	17	1	1.093e-05	1903412	family	            Hafniaceae
0.0003758	1	1	16	1	1.974e-05	635	genus	              Edwardsiella
0.0823	219	0	86	20.3	8.277e-06	135623	order	          Vibrionales
0.0823	219	0	86	20.3	8.277e-06	641	family	            Vibrionaceae
0.0823	219	0	85	20.6	9.999e-06	662	genus	              Vibrio
0.07404	197	197	78	21	0.0002986	674	species	                Vibrio mimicus
0.008268	22	0	5	21.4	2.542e-05	29494	species	                Vibrio furnissii
0.008268	22	22	5	21.4	2.542e-05	903510	no rank	                  Vibrio furnissii NCTC 11218
0.003758	10	0	13	5.69	8.04e-07	135622	order	          Alteromonadales
0.003382	9	0	8	8.62	1.537e-06	72275	family	            Alteromonadaceae
0.003007	8	0	4	15.2	1.947e-06	2742	genus	              Marinobacter
0.003007	8	0	4	15.2	1.404e-05	2743	species	                Marinobacter hydrocarbonoclasticus
0.003007	8	8	4	15.2	3.612e-05	351348	no rank	                  Marinobacter hydrocarbonoclasticus VT8
0.0003758	1	0	3	2.33	1.441e-06	226	genus	              Alteromonas
0.0003758	1	1	2	3	4.054e-06	314275	species	                Alteromonas mediterranea
0.0003758	1	0	2	1	5.922e-06	267894	family	            Psychromonadaceae
0.0003758	1	0	2	1	5.922e-06	67572	genus	              Psychromonas
0.0003758	1	0	1	1	4.952e-06	357794	species	                Psychromonas ingrahamii
0.0003758	1	1	1	1	4.952e-06	357804	no rank	                  Psychromonas ingrahamii 37
0.002631	7	0	9	9.11	3.135e-06	135624	order	          Aeromonadales
0.002631	7	0	9	9.11	3.135e-06	84642	family	            Aeromonadaceae
0.002631	7	0	9	9.11	4.289e-06	642	genus	              Aeromonas
0.002631	7	7	4	19.2	2.222e-05	652	species	                Aeromonas schubertii
0.0003758	1	0	14	4.93	3.205e-07	72274	order	          Pseudomonadales
0.0003758	1	0	14	4.93	3.696e-07	135621	family	            Pseudomonadaceae
0.0003758	1	0	13	5.23	3.5e-07	286	genus	              Pseudomonas
0.0003758	1	0	4	1	1.228e-06	136845	species group	                Pseudomonas putida group
0.0003758	1	0	4	1	1.854e-06	303	species	                  Pseudomonas putida
0.0003758	1	1	3	1	0.000324	1193499	no rank	                    Pseudomonas putida SJTE-1
0.0003758	1	0	6	1.17	8.119e-07	135619	order	          Oceanospirillales
0.0003758	1	0	5	1.2	1.429e-06	28256	family	            Halomonadaceae
0.0003758	1	1	3	1.33	9.803e-06	504090	genus	              Kushneria
0.0003758	1	0	2	2	7.749e-07	72273	order	          Thiotrichales
0.0003758	1	0	2	2	2.116e-06	135616	family	            Piscirickettsiaceae
0.0003758	1	0	2	2	1.82e-05	28884	genus	              Hydrogenovibrio
0.0003758	1	0	2	2	1.82e-05	39765	species	                Hydrogenovibrio crunogenus
0.0003758	1	1	2	2	1.82e-05	317025	no rank	                  Hydrogenovibrio crunogenus XCL-2
0.1443	384	0	3274	1.13	5.475e-05	28216	class	        Betaproteobacteria
0.1443	384	1	3261	1.13	6.418e-05	80840	order	          Burkholderiales
0.1424	379	4	3178	1.13	0.0001196	119060	family	            Burkholderiaceae
0.1406	374	19	3032	1.14	0.001278	48736	genus	              Ralstonia
0.1165	310	87	2300	1.14	0.006242	329	species	                Ralstonia pickettii
0.04472	119	119	617	1.14	0.004896	428406	no rank	                  Ralstonia pickettii 12D
0.03908	104	104	709	1.12	0.006631	402626	no rank	                  Ralstonia pickettii 12J
0.0124	33	33	271	1.13	0.001656	105219	species	                Ralstonia mannitolilytica
0.002631	7	6	22	1.05	2.051e-05	305	species	                Ralstonia solanacearum
0.0003758	1	1	1	2	4.9e-05	267608	no rank	                  Ralstonia solanacearum GMI1000
0.001879	5	5	25	1.08	6.828e-05	190721	species	                Ralstonia insidiosa
0.0003758	1	0	7	1	4.777e-07	32008	genus	              Burkholderia
0.0003758	1	1	5	1	6.467e-07	87882	species group	                Burkholderia cepacia complex
0.001127	3	0	27	1.11	3.058e-06	80864	family	            Comamonadaceae
0.0007516	2	0	19	1.16	1.346e-05	12916	genus	              Acidovorax
0.0007516	2	2	19	1.16	0.0001372	1858609	species	                Acidovorax sp. T1
0.0003758	1	0	5	1	2.16e-05	201096	genus	              Alicycliphilus
0.0003758	1	0	5	1	2.16e-05	179636	species	                Alicycliphilus denitrificans
0.0003758	1	1	5	1	0.0001159	596153	no rank	                  Alicycliphilus denitrificans BC
0.0003758	1	0	1	1	3.526e-07	119065	no rank	            unclassified Burkholderiales
0.0003758	1	1	1	1	3.516e-06	413882	species	              [Polyangium] brachysporum
0.009395	25	2	60	1.78	7.774e-07	28211	class	        Alphaproteobacteria
0.00451	12	0	26	1	2.092e-06	204455	order	          Rhodobacterales
0.00451	12	2	26	1	2.208e-06	31989	family	            Rhodobacteraceae
0.001879	5	0	9	1	1.168e-05	265	genus	              Paracoccus
0.001127	3	3	4	1	2.001e-05	147645	species	                Paracoccus yeei
0.0003758	1	0	3	1	1.36e-05	266	species	                Paracoccus denitrificans
0.0003758	1	1	3	1	1.36e-05	318586	no rank	                  Paracoccus denitrificans PD1222
0.0003758	1	0	1	1	4.668e-06	34003	species	                Paracoccus aminophilus
0.0003758	1	1	1	1	4.668e-06	1367847	no rank	                  Paracoccus aminophilus JCM 7686
0.0007516	2	0	2	1	1.802e-06	1060	genus	              Rhodobacter
0.0003758	1	0	1	1	1.683e-06	1063	species	                Rhodobacter sphaeroides
0.0003758	1	1	1	1	5.498e-06	349102	no rank	                  Rhodobacter sphaeroides ATCC 17025
0.0003758	1	0	1	1	5.986e-06	1061	species	                Rhodobacter capsulatus
0.0003758	1	1	1	1	5.986e-06	272942	no rank	                  Rhodobacter capsulatus SB 1003
0.0003758	1	0	1	1	4.513e-06	367771	genus	              Marinovum
0.0003758	1	0	1	1	4.513e-06	42444	species	                Marinovum algicola
0.0003758	1	1	1	1	4.513e-06	988812	no rank	                  Marinovum algicola DG 898
0.0003758	1	0	1	1	5.343e-06	309512	genus	              Dinoroseobacter
0.0003758	1	0	1	1	5.343e-06	215813	species	                Dinoroseobacter shibae
0.0003758	1	1	1	1	5.343e-06	398580	no rank	                  Dinoroseobacter shibae DFL 12 = DSM 16493
0.0003758	1	0	1	1	1.577e-06	34008	genus	              Rhodovulum
0.0003758	1	1	1	1	6.596e-06	308754	species	                Rhodovulum sp. MB263
0.003007	8	1	16	1.06	4.131e-07	356	order	          Rhizobiales
0.001127	3	0	4	1.25	4.078e-07	41294	family	            Bradyrhizobiaceae
0.0007516	2	0	2	1.5	3.318e-07	374	genus	              Bradyrhizobium
0.0003758	1	1	1	2	9.098e-07	1437360	species	                Bradyrhizobium erythrophlei
0.0003758	1	1	1	1	3.686e-06	335659	species	                Bradyrhizobium sp. S23321
0.0003758	1	0	1	1	9.668e-07	85413	genus	              Bosea
0.0003758	1	1	1	1	4.205e-06	1792307	species	                Bosea sp. PAMC 26642
0.0007516	2	0	5	1	3.757e-07	82115	family	            Rhizobiaceae
0.0007516	2	0	4	1	4.506e-07	227290	no rank	              Rhizobium/Agrobacterium group
0.0007516	2	2	4	1	6.233e-07	379	genus	                Rhizobium
0.0003758	1	1	2	1	2.89e-06	335928	family	            Xanthobacteraceae
0.0003758	1	0	1	1	2.593e-07	69277	family	            Phyllobacteriaceae
0.0003758	1	1	1	1	3.629e-07	68287	genus	              Mesorhizobium
0.0007516	2	0	5	5.6	5.849e-07	204441	order	          Rhodospirillales
0.0003758	1	0	3	8.67	7.072e-07	433	family	            Acetobacteraceae
0.0003758	1	0	1	1	4.149e-06	125216	genus	              Roseomonas
0.0003758	1	1	1	1	4.149e-06	257708	species	                Roseomonas gilardii
0.0003758	1	0	1	1	2.323e-07	41295	family	            Rhodospirillaceae
0.0003758	1	0	1	1	5.819e-07	191	genus	              Azospirillum
0.0003758	1	1	1	1	1.403e-06	192	species	                Azospirillum brasilense
0.0003758	1	0	3	1	2.659e-07	204457	order	          Sphingomonadales
0.0003758	1	0	2	1	2.274e-07	41297	family	            Sphingomonadaceae
0.0003758	1	0	1	1	5.155e-06	150203	genus	              Blastomonas
0.0003758	1	1	1	1	5.155e-06	1842535	species	                Blastomonas sp. RAC04
0.006765	18	0	118	1.73	4.855e-07	1783272	no rank	      Terrabacteria group
0.004134	11	0	61	1.18	5.421e-07	201174	phylum	        Actinobacteria
0.004134	11	1	60	1.18	5.49e-07	1760	class	          Actinobacteria
0.001503	4	0	24	1.21	4.707e-06	85009	order	            Propionibacteriales
0.001503	4	0	24	1.21	9.263e-06	31957	family	              Propionibacteriaceae
0.001127	3	0	16	1.31	3.333e-05	1912216	genus	                Cutibacterium
0.001127	3	3	16	1.31	8.202e-05	1747	species	                  Cutibacterium acnes
0.0003758	1	0	8	1	3.038e-05	1743	genus	                Propionibacterium
0.0003758	1	1	8	1	7.26e-05	671223	species	                  Propionibacterium sp. oral taxon 193
0.0007516	2	0	4	1.75	4.342e-07	85010	order	            Pseudonocardiales
0.0007516	2	0	4	1.75	4.342e-07	2070	family	              Pseudonocardiaceae
0.0007516	2	0	2	1.5	9.746e-07	1813	genus	                Amycolatopsis
0.0003758	1	0	1	2	3.191e-06	1814	species	                  Amycolatopsis methanolica
0.0003758	1	1	1	2	3.191e-06	1068978	no rank	                    Amycolatopsis methanolica 239
0.0003758	1	1	1	1	1.732e-06	31958	species	                  Amycolatopsis orientalis
0.0003758	1	0	22	1.09	1.262e-06	85006	order	            Micrococcales
0.0003758	1	0	22	1.09	4.036e-06	1268	family	              Micrococcaceae
0.0003758	1	0	22	1.09	0.0002045	1269	genus	                Micrococcus
0.0003758	1	1	22	1.09	0.0002045	1270	species	                  Micrococcus luteus
0.0003758	1	0	2	1	2.906e-06	1643682	order	            Geodermatophilales
0.0003758	1	0	2	1	2.906e-06	85030	family	              Geodermatophilaceae
0.0003758	1	0	1	1	4.337e-06	1860	genus	                Geodermatophilus
0.0003758	1	0	1	1	4.337e-06	1861	species	                  Geodermatophilus obscurus
0.0003758	1	1	1	1	4.337e-06	526225	no rank	                    Geodermatophilus obscurus DSM 43160
0.0003758	1	0	2	1	6.981e-08	85007	order	            Corynebacteriales
0.0003758	1	0	1	1	8.197e-08	1762	family	              Mycobacteriaceae
0.0003758	1	1	1	1	8.347e-08	1763	genus	                Mycobacterium
0.0003758	1	0	2	1	7.209e-08	85011	order	            Streptomycetales
0.0003758	1	0	2	1	7.209e-08	2062	family	              Streptomycetaceae
0.0003758	1	0	2	1	7.492e-08	1883	genus	                Streptomyces
0.0003758	1	1	1	1	3.917e-06	408015	species	                  Streptomyces xiamenensis
0.002631	7	0	56	2.34	6.005e-07	1239	phylum	        Firmicutes
0.001503	4	0	30	3.03	4.574e-07	91061	class	          Bacilli
0.001503	4	0	26	2	1.38e-06	186826	order	            Lactobacillales
0.001503	4	0	21	1.71	3.404e-06	1300	family	              Streptococcaceae
0.001503	4	3	21	1.71	4.066e-06	1301	genus	                Streptococcus
0.0003758	1	1	1	2	4.203e-06	1304	species	                  Streptococcus salivarius
0.0003758	1	0	19	1.37	7.956e-07	186801	class	          Clostridia
0.0003758	1	0	19	1.37	9.376e-07	186802	order	            Clostridiales
0.0003758	1	0	19	1.37	6.807e-06	186803	family	              Lachnospiraceae
0.0003758	1	0	19	1.37	0.0001273	186928	no rank	                unclassified Lachnospiraceae
0.0003758	1	0	19	1.37	0.0001273	39491	species	                  [Eubacterium] rectale
0.0003758	1	1	19	1.37	0.0001273	515619	no rank	                    [Eubacterium] rectale ATCC 33656
0.0003758	1	0	4	2	2.023e-06	909932	class	          Negativicutes
0.0003758	1	0	4	2	7.722e-06	1843489	order	            Veillonellales
0.0003758	1	0	4	2	7.722e-06	31977	family	              Veillonellaceae
0.0003758	1	0	4	2	1.618e-05	29465	genus	                Veillonella
0.0003758	1	1	3	2	1.934e-05	29466	species	                  Veillonella parvula
0.0003758	1	0	3	2	3.906e-06	1737404	class	          Tissierellia
0.0003758	1	0	3	2	4.339e-06	1737405	order	            Tissierellales
0.0003758	1	0	3	2	5.442e-06	1570339	family	              Peptoniphilaceae
0.0003758	1	0	3	2	4.225e-05	543311	genus	                Parvimonas
0.0003758	1	1	3	2	4.225e-05	33033	species	                  Parvimonas micra
0.0003758	1	0	8	1.75	1.742e-07	1783270	no rank	      FCB group
0.0003758	1	0	8	1.75	1.769e-07	68336	no rank	        Bacteroidetes/Chlorobi group
0.0003758	1	0	8	1.75	1.852e-07	976	phylum	          Bacteroidetes
0.0003758	1	0	8	1.75	1.05e-06	200643	class	            Bacteroidia
0.0003758	1	0	8	1.75	1.191e-06	171549	order	              Bacteroidales
0.0003758	1	0	8	1.75	6.025e-06	171552	family	                Prevotellaceae
0.0003758	1	0	8	1.75	6.025e-06	838	genus	                  Prevotella
0.0003758	1	1	8	1.75	3.294e-05	28131	species	                    Prevotella intermedia
