# KrakenUniq v0.5.7 DATE:2019-04-15T17:20:46Z DB:/home/biouser/SAM/DBDIR/LIBRARY_MINIKRAKEN/minikraken_20171019_8GB DB_SIZE:8053064728 WD:/home/biouser/SAM
# CL:perl /home/biouser/miniconda3/bin/krakenuniq --db /home/biouser/SAM/DBDIR/LIBRARY_MINIKRAKEN/minikraken_20171019_8GB -paired /home/biouser/SAM/data/7-GC_S7_mixed_with_1%_4-NTS_S4_R1.fastq.gz /home/biouser/SAM/data/7-GC_S7_mixed_with_1%_4-NTS_S4_R2.fastq.gz --report-file /home/biouser/SAM/data/7-GC_S7_mixed_with_1%_4-NTS_S4.krakenuniq.report.tsv

%	reads	taxReads	kmers	dup	cov	taxID	rank	taxName
0.6105	3786	3786	9186314	19.4	1.07	0	no rank	unclassified
99.39	616408	67	155357	52.2	0.0002345	1	no rank	root
99.38	616341	3	154260	52.6	0.0002361	131567	no rank	  cellular organisms
99.38	616338	2328	154260	52.6	0.0002442	2	superkingdom	    Bacteria
98.88	613252	4244	153663	52.3	0.0004836	1224	phylum	      Proteobacteria
97.2	602852	40	97357	80.7	0.001628	28216	class	        Betaproteobacteria
97.19	602781	147	97189	80.6	0.0343	206351	order	          Neisseriales
97.17	602634	239	97189	80.5	0.06379	481	family	            Neisseriaceae
97.13	602394	46094	96329	80.6	0.08346	482	genus	              Neisseria
89.57	555499	544055	42476	95.4	0.6497	485	species	                Neisseria gonorrhoeae
1.458	9042	9042	111	166	0.1604	528354	no rank	                  Neisseria gonorrhoeae MS11
0.2428	1506	1506	8	306	0.03636	521006	no rank	                  Neisseria gonorrhoeae NCCP11945
0.1445	896	896	53	38.1	0.0378	242231	no rank	                  Neisseria gonorrhoeae FA 1090
0.1103	684	576	1059	6.85	0.005323	487	species	                Neisseria meningitidis
0.008062	50	50	8	52.4	0.00404	942513	no rank	                  Neisseria meningitidis WUE 2594
0.004998	31	0	8	9.88	0.003712	491	no rank	                  Neisseria meningitidis serogroup B
0.004998	31	31	7	11.1	0.003853	630588	no rank	                    Neisseria meningitidis alpha710
0.002096	13	0	10	4.8	0.006592	65699	no rank	                  Neisseria meningitidis serogroup A
0.002096	13	13	10	4.8	0.006592	122587	no rank	                    Neisseria meningitidis Z2491
0.000645	4	4	32	1.12	0.00484	662598	no rank	                  Neisseria meningitidis alpha14
0.000645	4	0	30	1.1	0.003282	135720	no rank	                  Neisseria meningitidis serogroup C
0.0004837	3	3	21	1.1	0.004036	374833	no rank	                    Neisseria meningitidis 053442
0.0001612	1	1	7	1.14	0.002041	604162	no rank	                    Neisseria meningitidis 8013
0.0003225	2	2	3	17	0.002375	935590	no rank	                  Neisseria meningitidis M0579
0.0001612	1	1	14	6.07	0.004519	935588	no rank	                  Neisseria meningitidis M01-240355
0.0001612	1	1	11	1.18	0.004386	935593	no rank	                  Neisseria meningitidis M04-240196
0.0001612	1	1	1	5	0.0025	935599	no rank	                  Neisseria meningitidis G2136
0.0001612	1	1	1	1	0.025	1095685	no rank	                  Neisseria meningitidis M7124
0.01612	100	83	267	3.79	0.003727	486	species	                Neisseria lactamica
0.002741	17	17	92	3.63	0.003741	489653	no rank	                  Neisseria lactamica 020-06
0.0009674	6	6	58	2.05	0.0005674	490	species	                Neisseria sicca
0.0004837	3	3	19	1.21	0.0001865	655307	species	                Neisseria sp. KEM232
0.0003225	2	0	29	1.14	0.0003246	495	species	                Neisseria elongata
0.0003225	2	0	29	1.14	0.0003246	88719	subspecies	                  Neisseria elongata subsp. glycolytica
0.0003225	2	2	29	1.14	0.0003246	546263	no rank	                    Neisseria elongata subsp. glycolytica ATCC 29315
0.0003225	2	2	24	1.04	0.0002233	1853278	species	                Neisseria sp. 10023
0.0003225	2	2	11	1.18	0.0001032	1853276	species	                Neisseria sp. 10022
0.0001612	1	1	13	1	0.0001223	326523	species	                Neisseria zoodegmatis
0.0001612	1	1	7	1.14	7.696e-05	28091	species	                Neisseria weaveri
0.0001612	1	0	10	1	0.0001084	538	genus	              Eikenella
0.0001612	1	1	10	1	0.0001084	539	species	                Eikenella corrodens
0.004998	31	0	355	1.08	6.986e-06	80840	order	          Burkholderiales
0.004676	29	0	331	1.08	1.245e-05	119060	family	            Burkholderiaceae
0.004515	28	0	314	1.05	0.0001324	48736	genus	              Ralstonia
0.00387	24	3	239	1.03	0.0006486	329	species	                Ralstonia pickettii
0.001774	11	11	76	1.04	0.0007108	402626	no rank	                  Ralstonia pickettii 12J
0.001612	10	10	67	1.01	0.0005317	428406	no rank	                  Ralstonia pickettii 12D
0.000645	4	4	40	1.15	0.0002444	105219	species	                Ralstonia mannitolilytica
0.0001612	1	0	4	4	2.73e-07	32008	genus	              Burkholderia
0.0001612	1	0	2	6.5	2.587e-07	87882	species group	                Burkholderia cepacia complex
0.0001612	1	0	1	12	0.003145	152500	species	                  Burkholderia dolosa
0.0001612	1	1	1	12	0.003984	1385930	no rank	                    Burkholderia dolosa PC543
0.0001612	1	0	10	1	1.372e-06	506	family	            Alcaligenaceae
0.0001612	1	0	2	1	2.267e-05	1472344	genus	              Basilea
0.0001612	1	0	2	1	2.267e-05	1472345	species	                Basilea psittacipulmonis
0.0001612	1	1	2	1	2.267e-05	1072685	no rank	                  Basilea psittacipulmonis DSM 24701
0.0001612	1	0	7	1	7.927e-07	80864	family	            Comamonadaceae
0.0001612	1	1	1	1	7.085e-07	12916	genus	              Acidovorax
0.9923	6154	15	56399	1.27	0.000369	1236	class	        Gammaproteobacteria
0.9895	6137	17	56087	1.27	0.001335	91347	order	          Enterobacterales
0.9866	6119	201	54411	1.27	0.002613	543	family	            Enterobacteriaceae
0.942	5842	46	49266	1.24	0.024	590	genus	              Salmonella
0.9345	5796	5525	44261	1.25	0.02464	28901	species	                Salmonella enterica
0.04321	268	125	1192	1.22	0.001583	59201	subspecies	                  Salmonella enterica subsp. enterica
0.02064	128	128	724	1.21	0.02734	90371	no rank	                    Salmonella enterica subsp. enterica serovar Typhimurium
0.00129	8	0	24	1.04	0.007597	340190	no rank	                    Salmonella enterica subsp. enterica serovar Schwarzengrund
0.00129	8	8	24	1.04	0.007597	439843	no rank	                      Salmonella enterica subsp. enterica serovar Schwarzengrund str. CVM19633
0.0003225	2	2	4	1.5	0.0001757	90370	no rank	                    Salmonella enterica subsp. enterica serovar Typhi
0.0001612	1	0	2	1	0.001669	58095	no rank	                    Salmonella enterica subsp. enterica serovar Agona
0.0001612	1	1	2	1	0.0303	1406860	no rank	                      Salmonella enterica subsp. enterica serovar Agona str. 24249
0.0001612	1	0	2	1	0.0001568	1242080	no rank	                    Salmonella enterica subsp. enterica serovar Djakarta
0.0001612	1	1	2	1	0.0001568	1242091	no rank	                      Salmonella enterica subsp. enterica serovar Djakarta str. S-1087
0.0001612	1	0	2	1	0.0001929	189201	no rank	                    Salmonella enterica subsp. enterica serovar Cubana
0.0001612	1	1	2	1	0.0001929	1271863	no rank	                      Salmonella enterica subsp. enterica serovar Cubana str. CFSAN002050
0.0001612	1	1	1	1	0.0001426	1243585	no rank	                    Salmonella enterica subsp. enterica serovar Ouakam
0.0001612	1	0	1	1	2.172e-05	1242085	no rank	                    Salmonella enterica subsp. enterica serovar Macclesfield
0.0001612	1	1	1	1	2.172e-05	1242107	no rank	                      Salmonella enterica subsp. enterica serovar Macclesfield str. S-1643
0.0001612	1	0	4	1	4.093e-05	59205	subspecies	                  Salmonella enterica subsp. houtenae
0.0001612	1	1	4	1	4.093e-05	523831	no rank	                    Salmonella enterica subsp. houtenae str. ATCC BAA-1581
0.0001612	1	0	2	1	1.177e-05	59202	subspecies	                  Salmonella enterica subsp. salamae
0.0001612	1	0	2	1	2.041e-05	1243601	no rank	                    Salmonella enterica subsp. salamae serovar 55:k:z39
0.0001612	1	1	2	1	2.041e-05	1243602	no rank	                      Salmonella enterica subsp. salamae serovar 55:k:z39 str. 1315K
0.0001612	1	1	1	1	6.837e-06	59203	subspecies	                  Salmonella enterica subsp. arizonae
0.008384	52	0	26	7.65	8.825e-06	570	genus	              Klebsiella
0.008062	50	50	19	7.89	2.202e-05	573	species	                Klebsiella pneumoniae
0.0003225	2	2	4	1.75	1.289e-05	548	species	                Klebsiella aerogenes
0.003709	23	0	27	2.07	1.266e-05	561	genus	              Escherichia
0.003709	23	21	27	2.07	1.613e-05	562	species	                Escherichia coli
0.0001612	1	1	1	2	0.0008628	741093	no rank	                  Escherichia coli Xuzhou21
0.0001612	1	0	1	1	0.0005666	1038927	no rank	                  Escherichia coli O104:H4
0.0001612	1	1	1	1	0.008475	1048254	no rank	                    Escherichia coli O104:H4 str. C227-11
0.0001612	1	0	7	2.71	1.833e-06	547	genus	              Enterobacter
0.0001612	1	0	6	2.83	2.083e-06	354276	species group	                Enterobacter cloacae complex
0.0001612	1	1	1	11	3.031e-06	61645	species	                  Enterobacter asburiae
0.0001612	1	0	3	1	7.492e-07	1903409	family	            Erwiniaceae
0.0001612	1	1	2	1	1.935e-06	551	genus	              Erwinia
0.0001612	1	0	10	1.1	2.289e-07	72274	order	          Pseudomonadales
0.0001612	1	0	1	1	1.725e-07	468	family	            Moraxellaceae
0.0001612	1	1	1	1	2.676e-07	469	genus	              Acinetobacter
0.0001612	1	0	2	1.5	4.568e-07	135613	order	          Chromatiales
0.0001612	1	0	2	1.5	1.046e-06	72276	family	            Ectothiorhodospiraceae
0.0001612	1	0	1	2	2.15e-06	1765964	genus	              Acidihalobacter
0.0001612	1	1	1	2	6.604e-06	1765967	species	                Acidihalobacter ferrooxidans
0.0003225	2	0	14	1	1.814e-07	28211	class	        Alphaproteobacteria
0.0003225	2	0	6	1	1.549e-07	356	order	          Rhizobiales
0.0001612	1	0	3	1	2.254e-07	82115	family	            Rhizobiaceae
0.0001612	1	0	2	1	5.277e-07	227292	no rank	              Sinorhizobium/Ensifer group
0.0001612	1	0	2	1	6.948e-07	28105	genus	                Sinorhizobium
0.0001612	1	1	2	1	2.433e-06	382	species	                  Sinorhizobium meliloti
0.0001612	1	0	1	1	2.362e-06	119042	no rank	            unclassified Rhizobiales
0.0001612	1	0	1	1	3.726e-06	1734920	genus	              Pseudorhodoplanes
0.0001612	1	1	1	1	3.726e-06	1235591	species	                Pseudorhodoplanes sinuspersici
0.1222	758	310	66	80.1	2.716e-07	1783272	no rank	      Terrabacteria group
0.07207	447	442	45	96.6	4.825e-07	1239	phylum	        Firmicutes
0.000645	4	0	15	1.13	2.287e-07	91061	class	          Bacilli
0.000645	4	0	11	1.09	5.84e-07	186826	order	            Lactobacillales
0.0003225	2	0	6	1	9.725e-07	1300	family	              Streptococcaceae
0.0003225	2	0	6	1	1.162e-06	1301	genus	                Streptococcus
0.0001612	1	0	4	1	2.393e-05	28037	species	                  Streptococcus mitis
0.0001612	1	1	4	1	7.833e-05	365659	no rank	                    Streptococcus mitis B6
0.0001612	1	1	2	1	9.108e-06	1311	species	                  Streptococcus agalactiae
0.0001612	1	0	3	1	4.072e-07	33958	family	              Lactobacillaceae
0.0001612	1	0	3	1	4.363e-07	1578	genus	                Lactobacillus
0.0001612	1	1	3	1	3.172e-05	1601	species	                  Lactobacillus agilis
0.0001612	1	0	1	2	4.072e-07	81852	family	              Enterococcaceae
0.0001612	1	0	1	2	5.077e-07	1350	genus	                Enterococcus
0.0001612	1	1	1	2	2.989e-06	1352	species	                  Enterococcus faecium
0.0001612	1	0	2	1	8.374e-08	186801	class	          Clostridia
0.0001612	1	0	2	1	9.869e-08	186802	order	            Clostridiales
0.0001612	1	0	1	1	1.245e-06	186804	family	              Peptostreptococcaceae
0.0001612	1	0	1	1	1.207e-05	44259	genus	                Filifactor
0.0001612	1	0	1	1	1.207e-05	143361	species	                  Filifactor alocis
0.0001612	1	1	1	1	1.207e-05	546269	no rank	                    Filifactor alocis ATCC 35896
0.0001612	1	0	12	1.67	1.066e-07	201174	phylum	        Actinobacteria
0.0001612	1	0	12	1.67	1.098e-07	1760	class	          Actinobacteria
0.0001612	1	0	9	1.89	5.163e-07	85006	order	            Micrococcales
0.0001612	1	0	9	1.89	1.651e-06	1268	family	              Micrococcaceae
0.0001612	1	0	9	1.89	2.656e-05	32207	genus	                Rothia
0.0001612	1	1	9	1.89	3.979e-05	43675	species	                  Rothia mucilaginosa
