name	taxID	taxRank	genomeSize	numReads	numUniqueReads	abundance
Shewanella	22	genus	5140018	60	0	0.0
Cystobacter fuscus	43	species	12349744	1	0	0.0
Archangium gephyra	48	species	12489432	1	1	0.0
Chondromyces crocatus	52	species	11388132	1	1	0.0
Azospirillum brasilense	192	species	13978806	1	0	0.0
Comamonas	283	genus	5695231	1	0	0.0
Pseudomonas	286	genus	6735709	4	0	0.0
Pseudomonas aeruginosa	287	species	6508174	8	0	4.52879e-40
Burkholderia cepacia	292	species	10707163	4	0	0.0
Pseudomonas fluorescens	294	species	6526868	1	0	0.0
Pseudomonas fragi	296	species	10253943	12	0	1.34755e-301
Hydrogenophilus thermoluteolus	297	species	2288780	1	1	0.0
Ralstonia solanacearum	305	species	5757294	16	1	0.0
Pseudomonas syringae	317	species	9277206	2	0	0.0
Pseudomonas syringae pv. syringae	321	leaf	17996541	3	0	0.0
Pseudomonas syringae pv. tomato	323	leaf	6523367	1	0	0.0
Ralstonia pickettii	329	species	5505543	12	2	0.0
Xanthomonas campestris pv. campestris	340	leaf	19971072	2	0	0.0
Xanthomonas oryzae	347	species	38998012	1	0	0.0
Agrobacterium tumefaciens	358	species	7273300	2	2	0.0
Sinorhizobium meliloti	382	species	7082772	1	1	0.0
Rhizobium leguminosarum	384	species	9732818	1	0	0.0
Rhizobium phaseoli	396	species	6665454	3	1	0.0
Methylobacillus flagellatus	405	species	2971517	1	0	0.0
Methylomonas	416	genus	5051681	1	0	0.0
Acetobacteraceae	433	family	3826783	1	0	0.0
Moraxellaceae	468	family	3802099	283	0	0.0
Acinetobacter	469	genus	4001637	157	0	0.0
Acinetobacter baumannii	470	species	3995919	6	0	0.0
Moraxella bovis	476	species	2911207	1	0	0.0
Moraxella catarrhalis	480	species	1863286	2	0	6.48427e-296
Neisseriaceae	481	family	2245252	284	0	0.0
Neisseria	482	genus	2223194	312	11	0.0
Neisseria cinerea	483	species	1832904	108	0	2.8469e-233
Neisseria gonorrhoeae	485	species	2209297	539092	328920	0.41207
Neisseria lactamica	486	species	2220606	1614	68	1.15461e-05
Neisseria meningitidis	487	species	2222288	10951	742	0.00013764
Neisseria mucosa	488	species	2688408	42	2	6.31743e-270
Neisseria polysaccharea	489	species	2024930	1060	66	3.78704e-06
Neisseria sicca	490	species	2783943	41	4	8.91055e-274
Neisseria elongata	495	species	2253031	36	2	2.98198e-260
Psychrobacter	497	genus	2875899	1	0	0.0
Alcaligenaceae	506	family	4001103	1	0	0.0
Eikenella corrodens	539	species	2192577	44	0	8.97563e-286
Enterobacteriaceae	543	family	8974696	808	39	0.0
Citrobacter	544	genus	5356580	258	2	0.0
Citrobacter koseri	545	species	4735357	37	0	7.27494e-136
Citrobacter freundii	546	species	5371331	411	23	3.68124e-77
Enterobacter	547	genus	8075228	253	0	0.0
Klebsiella aerogenes	548	species	5435727	173	18	6.26006e-94
Enterobacter cloacae	550	species	5160721	316	36	0
Erwinia	551	genus	4250482	1	0	0.0
Pectobacterium carotovorum	554	species	8172380	9	0	0.0
Escherichia	561	genus	7248177	2	0	0.0
Escherichia coli	562	species	7295430	2858	566	0.000832784
Hafnia	568	genus	4712721	31	0	0.0
Hafnia alvei	569	species	4712721	9	0	1.7662e-269
Klebsiella	570	genus	10431961	699	5	0.0
Klebsiella oxytoca	571	species	6684898	2511	44	3.8701e-06
Klebsiella pneumoniae	573	species	12022929	134096	115814	0.045685
Klebsiella pneumoniae subsp. ozaenae	574	subspecies	5651305	46	0	4.95733e-108
Raoultella planticola	575	species	5823931	221	1	4.68413e-159
Morganella	581	genus	3799539	106	0	0.0
Morganella morganii	582	species	3799539	6	0	2.80818e-246
Proteus	583	genus	3973324	331	0	0.0
Proteus mirabilis	584	species	3973324	21	1	1.81828e-59
Providencia	586	genus	4402109	8	0	0.0
Providencia rettgeri	587	species	13861830	18	0	5.38675e-310
Salmonella enterica subsp. enterica serovar Infantis	595	leaf	34245189	1	0	9.73775e-07
Serratia	613	genus	5337459	263	0	0.0
Serratia marcescens	615	species	5201904	101	5	3.21338e-156
Xenorhabdus nematophila	628	species	4586662	1	0	0.0
Yersinia	629	genus	5888768	31	0	0.0
Edwardsiella	635	genus	3906392	29	0	0.0
Edwardsiella tarda	636	species	3766483	6	0	0.0
Vibrionaceae	641	family	5361384	285	0	0.0
Aeromonas	642	genus	4922242	83	0	0.0
Aeromonas caviae	648	species	18457506	1	0	0.0
Aeromonas schubertii	652	species	4400034	2	0	0.0
Aeromonas veronii	654	species	4551783	2	1	0.0
Vibrio	662	genus	5428754	59	0	0.0
Vibrio cholerae	666	species	4899596	3	0	0.0
Vibrio parahaemolyticus	670	species	5172800	1	1	0.0
Vibrio vulnificus	672	species	5071151	1	0	0.0
Vibrio mimicus	674	species	8922712	1	0	0
Plesiomonas shigelloides	703	species	7376338	4	2	0.0
Pasteurellaceae	712	family	2311789	281	0	0.0
Haemophilus	724	genus	1907846	256	0	0.0
Haemophilus haemolyticus	726	species	7646594	10	0	0
Haemophilus influenzae	727	species	1910832	48	3	1.14651e-242
Haemophilus parainfluenzae	729	species	2086875	5	0	2.59558e-250
[Haemophilus] ducreyi	730	species	1698955	4	0	0.0
Rhodobacter sphaeroides	1063	species	4596850	2	0	0.0
Rhodospirillum	1081	genus	4371641	1	0	0.0
Porphyrobacter neustonensis	1112	species	3090363	1	1	0.0
Gammaproteobacteria	1236	class	7010314	204	1	0.0
Firmicutes	1239	phylum	3844509	184	0	0.0
Staphylococcus	1279	genus	4881238	1	0	0.0
Staphylococcus aureus	1280	species	5646514	1	0	0.0
Staphylococcus haemolyticus	1283	species	2697861	2	0	0
Streptococcus	1301	genus	2223762	183	0	0.0
Streptococcus salivarius	1304	species	2213879	1	0	4.04082e-09
Streptococcus agalactiae	1311	species	2111259	13	1	0.0
Streptococcus pneumoniae	1313	species	2114217	176	87	0
Streptococcus pyogenes	1314	species	1944914	37	3	0.0
Streptococcus anginosus	1328	species	2089210	21	0	0.0
Enterococcus	1350	genus	3026330	1	0	0.0
Enterococcus faecium	1352	species	2979896	27	24	0.0
Enterococcus gallinarum	1353	species	3821476	1	0	0.0
Bacillales	1385	order	4938247	298	0	0.0
Bacillus subtilis	1423	species	8099068	5	4	0.0
Clostridioides difficile	1496	species	5577066	72	70	2.46005e-05
Lactobacillus agilis	1601	species	2187209	1	1	0.0
Corynebacterium diphtheriae	1717	species	2464936	1	0	0.0
Cutibacterium acnes	1747	species	2515790	2	0	9.19561e-06
Actinobacteria	1760	class	4813989	2	0	0.0
Mycolicibacterium smegmatis	1772	species	14041927	1	1	0.0
Streptomyces actuosus	1885	species	8145579	1	1	0.0
Streptomyces albus	1888	species	6841649	1	1	0.0
Mycoplasmatales	2085	order	986199	11	0	0.0
Mycoplasmataceae	2092	family	986199	11	0	0.0
Mycoplasma hominis	2098	species	690305	188	0	6.30111e-50
Candidatus Sodalis pierantonius str. SOPE	2342	leaf	4513140	6	0	0.0
Homo sapiens	9606	species	3257319537	41	24	4.66008e-08
Azoarcus	12960	genus	0	1	0	0.0
Streptococcus mitis	28037	species	2146611	63	0	0
Prevotella intermedia	28131	species	2686803	2	0	0.0
Cronobacter sakazakii	28141	species	4439412	101	2	2.65144e-14
Salmonella enterica subsp. enterica serovar Senftenberg	28150	leaf	20218480	7	0	2.02242e-06
Alphaproteobacteria	28211	class	3938269	2	0	0.0
Betaproteobacteria	28216	class	5503525	1	0	0.0
Marinomonas	28253	genus	4292128	1	0	0.0
Neisseria subflava	28449	species	2321871	16	3	5.61307e-264
Burkholderia pseudomallei	28450	species	7741335	1	1	0.0
Euryarchaeota	28890	phylum	2854526	1	0	0.0
Salmonella enterica	28901	species	10337520	317	25	0.466407
Yersinia frederiksenii	29484	species	4550894	1	0	0.0
Mollicutes	31969	class	1031504	173	0	0.0
Clostridiaceae	31979	family	4483183	56	0	0.0
Nitrosomonadales	32003	order	3061161	2	0	0.0
Burkholderia	32008	genus	8293702	1	0	0.0
Parvimonas micra	33033	species	3288872	193	0	2.4269e-06
Zymobacter palmae	33074	species	3028543	1	0	0.0
Lactobacillus johnsonii	33959	species	1907846	1	0	0
Rahnella aquatilis	34038	species	5656799	1	0	0.0
Citrobacter amalonaticus	35703	species	5875351	11	0	4.59907e-152
Desulfitobacterium	36853	genus	4425788	1	0	0.0
Nocardia farcinica	37329	species	6292344	2	0	0.0
Photobacterium damselae subsp. piscicida	38294	subspecies	4293175	1	1	0.0
Stenotrophomonas maltophilia	40324	species	4684682	2	0	0.0
Sphingomonadaceae	41297	family	4153184	16	0	0.0
Burkholderia plantarii	41899	species	8081051	1	0	0.0
Polynucleobacter	44013	genus	1859979	1	0	0.0
Pseudomonas avellanae	46257	species	6576340	1	0	0.0
Serratia fonticola	47917	species	18051695	2	0	0.0
Pantoea	53335	genus	4926392	188	0	0.0
Tatumella citrea	53336	species	8982233	2	0	0.0
Raoultella ornithinolytica	54291	species	5398151	249	23	1.0129e-165
Streptomyces venezuelae	54571	species	26469547	1	0	0.0
Citrobacter braakii	57706	species	10079064	4	0	7.84314e-185
Salmonella enterica subsp. enterica serovar Weltevreden	57743	leaf	20446954	7	0	3.01833e-06
Burkholderia thailandensis	57975	species	7411824	1	0	0.0
Salmonella enterica subsp. houtenae serovar Houten	58100	leaf	4624613	8	0	4.5005e-215
Salmonella enterica subsp. enterica serovar Anatum	58712	leaf	19533469	7	0	1.82823e-06
Salmonella enterica subsp. enterica	59201	subspecies	142069846	104	1	2.36392e-06
Salmonella enterica subsp. salamae	59202	subspecies	10002039	1	0	1.28796e-07
Burkholderia vietnamiensis	60552	species	6930496	1	0	0.0
Enterobacter asburiae	61645	species	4787018	28	0	1.56257e-05
Lelliottia amnigena	61646	species	9085730	7	2	0.0
Pluralibacter gergoviae	61647	species	10897762	25	1	7.66281e-279
Serratia rubidaea	61652	species	9918189	2	0	0.0
Edwardsiella ictaluri	67780	species	3812301	1	1	1.08668e-283
Citrobacter farmeri	67824	species	5715629	31	0	2.95971e-145
Citrobacter rodentium	67825	species	5444283	2	0	0.0
Citrobacter werkmanii	67827	species	15089488	42	30	4.17069e-07
Streptomyces fungicidicus	68203	species	7667496	1	1	0.0
Enterobacter cancerogenus	69218	species	4796512	1	0	0.0
Lelliottia nimipressuralis	69220	species	4826854	7	1	1.07106e-230
Moritella yayanosii	69539	species	4433651	1	0	0.0
Caulobacter mirabilis	69666	species	4577265	1	0	0.0
Pseudomonadales	72274	order	6135410	1	0	0.0
Campylobacteraceae	72294	family	2371300	1	0	0.0
Klebsiella pneumoniae subsp. pneumoniae	72407	subspecies	172715673	1213	309	3.04709e-06
Dechloromonas	73029	genus	4501104	1	0	0.0
Prevotella enoeca	76123	species	2861432	1	1	0.0
Xanthobacter autotrophicus Py2	78245	leaf	5625098	1	1	0.0
Pseudomonas mosselii	78327	species	6247860	1	1	0.0
Erwinia pyrifoliae	79967	species	4072846	1	0	0.0
Burkholderiales	80840	order	6713841	26	0	0.0
Moritella viscosa	80854	species	5093989	1	0	0.0
Comamonadaceae	80864	family	5402391	15	0	0.0
Obesumbacterium	82982	genus	0	4	0	0.0
Obesumbacterium proteus	82983	species	5011796	1	0	0.0
Serratia plymuthica	82996	species	5447150	1	0	0.0
Escherichia coli K-12	83333	leaf	65191842	1	0	0.0
Escherichia coli O157:H7	83334	leaf	78215862	3	0	0
gamma proteobacterium HdN1	83406	species	4587455	1	0	0
Leclercia	83654	genus	0	2	0	0.0
Leclercia adecarboxylata	83655	species	4803917	2	0	1.4577e-227
Aeromonadaceae	84642	family	4831557	18	0	0.0
Micrococcales	85006	order	3661464	1	0	0.0
Propionibacteriales	85009	order	3144263	1	0	0.0
Achromobacter xylosoxidans	85698	species	7359146	3	0	0.0
Burkholderia multivorans	87883	species	10170089	1	0	1.15705e-06
Neisseria elongata subsp. glycolytica	88719	subspecies	2249415	10	0	6.09424e-264
Salmonella enterica subsp. enterica serovar Typhi	90370	leaf	505801019	43	1	5.14954e-06
Salmonella enterica subsp. enterica serovar Typhimurium	90371	leaf	150109640	48	0	5.92852e-06
Staphylococcaceae	90964	family	4837607	24	0	0.0
Bacilli	91061	class	3878588	25	0	0.0
Enterobacterales	91347	order	8015187	336	0	0.0
Ramlibacter tataouinensis	94132	species	4070193	1	0	0.0
Burkholderia cenocepacia	95486	species	7744804	2	0	0
Thauera chlorobenzoica	96773	species	3735506	1	1	0.0
Vitreoscilla sp. C1	96942	species	2610419	1	0	0.0
Salmonella enterica subsp. enterica serovar Dublin	98360	leaf	35415966	6	0	2.18305e-07
Burkholderia ubonensis	101571	species	7189071	2	0	0.0
Bordetella hinzii	103855	species	14686667	1	0	0.0
Serratia sp. ATCC 39006	104623	species	9943513	2	0	0.0
Ralstonia mannitolilytica	105219	species	9915295	36	18	1.5162e-05
Salmonella enterica subsp. enterica serovar Newport	108619	leaf	24036368	30	0	7.78165e-07
Burkholderiaceae	119060	family	7900732	3	0	0.0
Pectobacterium	122277	genus	6614713	1	0	0.0
Neisseria meningitidis MC58	122586	leaf	2272360	43	1	6.27907e-265
Neisseria meningitidis Z2491	122587	leaf	2184406	64	5	4.96592e-154
Providencia alcalifaciens	126385	species	8033032	1	1	0.0
Erysipelotrichaceae	128827	family	1770425	255	0	0.0
Pseudomonas amygdali pv. morsprunorum	129138	leaf	6445963	1	0	0.0
Citrobacter youngae	133448	species	4945156	1	0	5.26561e-144
Actinoplanes sp. SE50/110	134676	species	18480017	2	0	0.0
Pseudomonadaceae	135621	family	6675755	33	0	0.0
Vibrionales	135623	order	5361384	2	0	0.0
Paracoccus yeei	147645	species	14118684	16	4	4.44497e-07
Salmonella enterica subsp. enterica serovar Braenderup	149391	leaf	4734880	3	0	7.23915e-06
Salmonella enterica subsp. enterica serovar Enteritidis	149539	leaf	208834451	89	13	1.2371e-06
Burkholderia ambifaria	152480	species	11349840	1	0	0.0
Cedecea neteri	158822	species	19970488	10	1	0.0
Enterobacter hormaechei	158836	species	11512864	73	0	0
Raoultella	160674	genus	5398151	15	0	0.0
Laribacter	168470	genus	3169329	1	0	0.0
Escherichia coli O127:H6	168807	leaf	9641111	33	2	4.32805e-147
Pseudoalteromonas agarivorans	176102	species	4544962	1	0	0.0
Clostridia	186801	class	3819022	1	0	0.0
Clostridiales	186802	order	4169569	299	0	0.0
Lachnospiraceae	186803	family	3982220	1	0	0.0
Peptostreptococcaceae	186804	family	4343449	47	0	0.0
Bacillaceae	186817	family	5737603	15	0	0.0
Lactobacillales	186826	order	2681416	333	0	0.0
Ralstonia insidiosa	190721	species	12164766	17	3	2.06952e-111
Vibrio coralliilyticus	190893	species	23103305	1	0	0.0
Salmonella enterica subsp. enterica serovar Mbandaka	192954	leaf	9505961	4	4	0.0
Chlorobaculum tepidum TLS	194439	leaf	2154946	1	1	0.0
Sinorhizobium americanum	194963	species	6853050	1	0	0.0
Nocardioides sp. JS614	196162	species	5293685	1	0	0.0
Arcobacter halophilus	197482	species	2812536	1	0	0.0
Haemophilus aegyptius	197575	species	1993258	2	0	2.76103e-248
Shigella flexneri 2a str. 301	198214	leaf	4828820	2	0	2.76088e-06
Dickeya dadantii 3937	198628	leaf	4922802	1	1	0.0
Escherichia coli CFT073	199310	leaf	5231428	6	1	5.3371e-197
Sulfurimonas	202746	genus	2177379	1	0	0.0
Fusobacteriia	203490	class	2917471	17	0	0.0
Fusobacteriaceae	203492	family	2924149	1	0	0.0
Dickeya	204037	genus	4822257	2	0	0.0
Dickeya zeae	204042	species	4675379	2	0	0.0
Sphingomonadales	204457	order	4098145	1	0	0.0
Pseudomonas syringae pv. syringae B728a	205918	leaf	6093698	1	0	0.0
Pseudomonas fluorescens Pf0-1	205922	leaf	6438405	3	3	0.0
Neisseriales	206351	order	2372285	3	0	0.0
Rhodocyclales	206389	order	4186782	9	0	0.0
Enterobacter kobei	208224	species	10094268	349	0	1.28515e-143
Streptococcus agalactiae 2603V/R	208435	leaf	2160267	39	39	0.0
Escherichia albertii	208962	species	4701875	183	14	7.47363e-06
Erwinia sp. Ejp617	215689	species	3957675	1	0	0.0
Rhizobium leguminosarum bv. viciae 3841	216596	leaf	7751309	1	0	0.0
Achromobacter spanius	217203	species	12765991	1	0	0.0
Achromobacter insolitus	217204	species	13385742	1	0	0.0
Pectobacterium atrosepticum SCRI1043	218491	leaf	5064019	4	0	0.0
Pseudomonas protegens Pf-5	220664	leaf	7074893	1	0	0.0
Photorhabdus thracensis	230089	species	5147098	1	1	0.0
[Haemophilus] ducreyi 35000HP	233412	leaf	1698955	1	0	0.0
Neisseria gonorrhoeae FA 1090	242231	leaf	2153922	22217	2457	0.00136805
Klebsiella variicola	244366	species	5458505	2930	17	2.43457e-06
Prevotella intermedia 17	246198	leaf	2699437	1	0	0.0
Haemophilus pittmaniae	249188	species	2181355	10	0	2.30876e-252
Pseudomonas syringae group genomosp. 3	251701	species	6530813	1	0	0.0
Roseomonas gilardii	257708	species	5412463	1	0	0.0
Aeromonas virus 65	260149	species	235229	1	1	0.0
Haemophilus influenzae R2846	262727	leaf	1819370	2	0	0.0
Streptomyces hygroscopicus subsp. limoneus	264445	subspecies	10537932	1	0	0.0
Paraburkholderia xenovorans LB400	266265	leaf	19434089	1	1	0.0
Mesorhizobium japonicum MAFF 303099	266835	leaf	7596297	2	0	0.0
Shewanellaceae	267890	family	5140018	16	0	0.0
Nitratiruptor	269258	genus	0	1	0	0.0
Rhodospirillum rubrum ATCC 11170	269796	leaf	4406557	1	0	0.0
Methanosarcina barkeri str. Fusaro	269797	leaf	4873766	1	0	0.0
Gluconacetobacter diazotrophicus PA1 5	272568	leaf	7914538	2	0	0.0
Klebsiella pneumoniae subsp. pneumoniae MGH 78578	272620	leaf	5694894	143	28	1.70891e-107
Neisseria meningitidis FAM18	272831	leaf	2194961	32	0	4.25543e-252
Leifsonia xyli subsp. xyli str. CTCB07	281090	leaf	2584158	1	1	0.0
Kosakonia radicincitans	283686	species	6122453	21	1	2.58112e-243
Sulfuricurvum	286130	genus	2819357	1	0	0.0
Chlorobium phaeobacteroides DSM 266	290317	leaf	3133902	1	1	0.0
Citrobacter koseri ATCC BAA-895	290338	leaf	4735357	1	0	6.7834e-143
Enterobacter hormaechei subsp. steigerwaltii	299766	subspecies	20496016	3	1	8.28367e-236
Enterobacter ludwigii	299767	species	4952770	2	0	0.0
Shigella dysenteriae Sd197	300267	leaf	4560911	1	1	0.0
Enterobacter hormaechei subsp. oharae	301102	subspecies	14941448	5	0	3.09153e-216
Bifidobacterium animalis subsp. lactis	302911	subspecies	7762260	1	0	0.0
Bifidobacterium animalis subsp. animalis	302912	subspecies	3960056	1	0	0.0
Yangia pacifica	311180	species	5165968	1	1	0.0
Alteromonas mediterranea	314275	species	4576285	1	0	0.0
Psychromonas sp. CNPT3	314282	species	3052410	1	1	0.0
Xanthomonas campestris pv. campestris str. 8004	314565	leaf	5148708	1	0	0.0
Paracoccus denitrificans PD1222	318586	leaf	5236194	3	3	0.0
Salmonella enterica subsp. enterica serovar Choleraesuis str. SC-B67	321314	leaf	4944000	1	1	6.391e-07
Azotobacter vinelandii DJ	322710	leaf	5365318	2	0	0.0
Xanthomonas vasicola pv. vasculorum	325776	leaf	4909766	1	0	0.0
Neisseria zoodegmatis	326523	species	2552522	2	0	6.53754e-274
Escherichia coli HS	331112	leaf	4643538	9	0	9.43241e-168
Bradyrhizobium sp. S23321	335659	species	7231841	1	1	0.0
Rhodoferax ferrireducens T118	338969	leaf	4969784	1	0	0.0
Streptococcus salivarius JIM8777	347253	leaf	2210574	1	0	1.45805e-05
Burkholderia dolosa AU0158	350701	leaf	6409095	2	0	0.0
Xenorhabdus hominickii	351679	species	4522699	2	1	0.0
Psychromonas ingrahamii 37	357804	leaf	4559598	1	0	0.0
Acidovorax sp. KKS102	358220	species	5196935	1	1	0.0
Ramlibacter tataouinensis TTB310	365046	leaf	4070193	1	0	0.0
Neisseria meningitidis 053442	374833	leaf	2153416	255	9	2.00715e-06
Kocuria rhizophila DC2201	378753	leaf	2697540	1	0	0.0
Pseudomonas protegens	380021	species	6923588	1	0	0.0
Moraxella bovoculi	386891	species	15802199	1	0	0.0
Rhizobium leguminosarum bv. trifolii WSM1325	395491	leaf	7418122	1	0	0.0
Rhizobium leguminosarum bv. trifolii WSM2304	395492	leaf	6872702	1	1	0.0
Serratia proteamaculans 568	399741	leaf	5495657	1	0	0.0
Enterobacter sp. 638	399742	species	4676461	5	2	0.0
Ralstonia pickettii 12J	402626	leaf	5325729	126	72	0.000135287
Cronobacter	413496	genus	4479995	13	0	0.0
Cronobacter turicensis	413502	species	4599092	3	0	0.0
Cronobacter malonaticus	413503	species	4473761	8	0	5.06448e-218
Methylobacterium phyllosphaerae	418223	species	6316624	1	0	0.0
Shewanella sediminis HAW-EB3	425104	leaf	5517674	1	1	0.0
Methylobacterium sp. 4-46	426117	species	7737025	2	2	0.0
Ralstonia pickettii 12D	428406	leaf	5685358	140	87	4.56503e-05
Mycobacterium avium subsp. hominissuis	439334	subspecies	31569362	1	0	0.0
Salmonella enterica subsp. enterica serovar Dublin str. CT_02021853	439851	leaf	4917459	1	0	7.99288e-08
Nostoc sphaeroides	446679	species	6684490	1	0	0.0
Anaeromyxobacter sp. K	447217	species	5061632	1	0	0.0
Phytobacter	447792	genus	0	109	0	0.0
Phenylobacterium zucineum HLK1	450851	leaf	4379231	1	0	0.0
Anaeromyxobacter dehalogenans 2CP-1	455488	leaf	5029329	1	0	0.0
Actinoplanes teichomyceticus ATCC 31121	457423	leaf	8287152	1	1	0.0
Methylobacterium nodulans ORS 2060	460265	leaf	8839022	1	1	0.0
Micrococcus luteus NCTC 2665	465515	leaf	4996790	2	0	0.0
Erwinia tasmaniensis Et1/99	465817	leaf	4067864	2	1	0.0
Steroidobacter	469322	genus	0	1	0	0.0
Pantoea vagans	470934	species	4888338	4	4	0.0
Halomonas beimenensis	475662	species	4053030	1	0	0.0
Micromonospora tulbaghiae	479978	species	7228472	1	0	0.0
Escherichia coli ATCC 8739	481805	leaf	9493136	24	0	0.0
Myxococcus fulvus HW-1	483219	leaf	9003593	1	0	0.0
Klebsiella pneumoniae subsp. pneumoniae NTUH-K2044	484021	leaf	5472672	20	6	0.0
Burkholderia latens	488446	species	6614478	1	0	0.0
Burkholderia seminalis	488731	species	7648944	1	0	0.0
Neisseria lactamica 020-06	489653	leaf	2220606	883	33	4.17587e-51
Rhizobium etli CIAT 652	491916	leaf	6448048	1	0	0.0
Kosakonia oryzae	497725	species	5303342	2	1	0.0
Klebsiella pneumoniae 342	507522	leaf	5920257	39	1	0.0
Oceanimonas sp. GK1	511062	species	3527244	2	1	0.0
Actinoplanes missouriensis 431	512565	leaf	8773466	1	1	0.0
Streptococcus pneumoniae G54	512566	leaf	2078953	4	0	0.0
[Eubacterium] rectale ATCC 33656	515619	leaf	3449685	1	1	6.16732e-06
Streptococcus pneumoniae CGSP14	516950	leaf	2209198	53	49	0.000173271
Rhodothermus marinus DSM 4252	518766	leaf	3386737	1	0	0.0
Neisseria gonorrhoeae NCCP11945	521006	leaf	2236178	27143	2252	0.00175819
Candidatus Accumulibacter phosphatis clade IIA str. UW-1	522306	leaf	5306133	1	1	0.0
Erysipelotrichales	526525	order	1770425	18	0	0.0
Neisseria gonorrhoeae MS11	528354	leaf	2237793	61806	10865	0.0262843
Variovorax paradoxus S110	543728	leaf	6754997	1	0	0.0
Neisseria elongata subsp. glycolytica ATCC 29315	546263	leaf	2256647	10	0	3.92022e-264
Rhodobacter sphaeroides KD131	557760	leaf	4711139	1	1	0.0
Escherichia coli W	566546	leaf	10014211	12	0	0.0
Streptococcus suis BM407	568814	leaf	2170808	3	0	0.0
Escherichia coli O127:H6 str. E2348/69	574521	leaf	5069678	16	0	1.30561e-128
Polynucleobacter necessarius	576610	species	1560469	10	10	0.0
Escherichia coli S88	585035	leaf	5166121	16	0	1.37553e-222
Escherichia fergusonii ATCC 35469	585054	leaf	4643861	1	0	1.42133e-204
Escherichia coli IAI39	585057	leaf	5132068	4	1	1.22551e-06
Dickeya zeae Ech586	590409	leaf	4818394	2	0	0.0
Escherichia coli LF82	591946	leaf	4773108	6	3	4.69796e-06
Pantoea sp. At-9b	592316	species	6312783	2	1	0.0
Salmonella enterica subsp. enterica serovar Corvallis	593905	leaf	5359100	1	0	4.57816e-06
Tolumonas auensis DSM 9187	595494	leaf	3471292	1	0	0.0
Escherichia coli KO11FL	595495	leaf	10056495	8	0	0.0
Burkholderia glumae PG1	595500	leaf	7896538	1	0	0.0
Methylosinus trichosporium OB3b	595536	leaf	5183433	1	1	0.0
Alicycliphilus denitrificans BC	596153	leaf	4835713	1	0	1.23438e-06
Neisseria meningitidis 8013	604162	leaf	2277550	125	7	6.12844e-139
Hydrogenobacter thermophilus TK-6	608538	leaf	3486067	10	0	0.0
Neisseria meningitidis alpha710	630588	leaf	2242947	220	2	2.20769e-153
Shimwellia blattae DSM 4481 = NBRC 105725	630626	leaf	4158725	3	3	0.0
Erwinia billingiae Eb661	634500	leaf	5372268	2	1	0.0
Citrobacter rodentium ICC168	637910	leaf	5444283	3	3	0.0
Klebsiella variicola At-22	640131	leaf	5458505	128	10	1.17061e-06
Burkholderia sp. CCGE1002	640511	species	7884858	1	1	0.0
Burkholderia sp. CCGE1003	640512	species	7043595	1	0	0.0
Enterobacter asburiae LF7a	640513	leaf	5012132	2	1	0.0
Simonsiella muelleri ATCC 29453	641147	leaf	2469862	50	49	0.0
Micromonospora sp. L5	648999	species	6962533	1	0	0.0
Neisseria sp. KEM232	655307	species	2371912	3	0	2.10169e-268
Pantoea stewartii subsp. stewartii DC283	660596	leaf	5314092	2	1	0.0
Neisseria meningitidis alpha14	662598	leaf	2145295	253	7	1.10321e-06
Arcobacter suis CECT 7833	663365	leaf	2639269	3	3	0.0
Azospirillum sp. TSH58	664962	species	7244074	1	0	0.0
Mixta calida	665913	species	4308453	13	1	1.47521e-272
Mixta gaviniae	665914	species	4527605	6	0	0.0
Propionibacterium sp. oral taxon 193	671223	species	2649207	1	1	3.85231e-06
Serratia sp. FGI94	671990	species	4858216	1	0	0.0
Candidatus Hamiltonella defensa (Bemisia tabaci)	672795	leaf	1739504	1	1	0.0
Phaeobacter sp. LSS9	681157	species	4038237	1	1	0.0
Cronobacter turicensis z3032	693216	leaf	4599092	7	3	0.0
Enterobacteriaceae bacterium strain FGI 57	693444	species	4762179	3	0	2.3438e-229
Escherichia coli UMNK88	696406	leaf	5666764	3	1	1.90901e-153
[Enterobacter] lignolyticus SCF1	701347	leaf	4814049	12	5	1.29996e-228
Rahnella sp. Y9602	741091	species	5614252	1	0	0.0
Salmonella enterica subsp. enterica serovar Senftenberg str. 361154004	749965	leaf	5114779	1	0	0.0
Burkholderia insecticola	758793	species	6964487	3	1	0.0
Streptococcus parasanguinis ATCC 15912	760570	leaf	2153652	1	0	0.0
Rhodothermus marinus SG0.5JP17-172	762570	leaf	3334122	1	0	0.0
Serratia sp. AS12	768490	species	5443009	1	0	0.0
Serratia sp. AS13	768493	species	5442549	1	0	0.0
Streptococcus anginosus C238	862971	leaf	2233640	21	0	0.0
Escherichia coli DSM 30083 = JCM 1649 = ATCC 11775	866789	leaf	5034833	1	1	0.0
Arcobacter molluscorum LMG 25693	870501	leaf	2800582	1	0	0.0
Cupriavidus sp. USMAA2-4	876364	species	8698226	1	0	1.82133e-176
Bernardetia litoralis DSM 6794	880071	leaf	4919337	1	1	0.0
Caldithrix abyssi DSM 13497	880073	leaf	4978541	1	1	0.0
Enterobacter bugandensis	881260	species	4717613	2	0	1.67554e-06
Neisseria meningitidis H44/76	909420	leaf	2240883	32	0	8.43371e-263
Negativicutes	909932	class	2939259	1	0	0.0
Methylobacterium sp. AMS5	925818	species	5599206	1	0	0.0
Gibbsiella quercinecans	929813	species	5548506	6	0	0.0
Salmonella phage RE-2010	929814	species	34117	10	0	4.72727e-32
Klebsiella aerogenes EA1509E	935296	leaf	5591105	6	0	2.08235e-103
Neisseria meningitidis M01-240355	935588	leaf	2287777	178	9	1.54518e-06
Neisseria meningitidis NZ-05/33	935589	leaf	2248966	88	0	2.97668e-100
Neisseria meningitidis M0579	935590	leaf	2324822	181	19	2.87566e-06
Neisseria meningitidis M01-240149	935591	leaf	2223518	81	1	8.59062e-119
Neisseria meningitidis M04-240196	935593	leaf	2250449	173	4	1.52488e-181
Neisseria meningitidis G2136	935599	leaf	2184862	71	2	1.73995e-256
Haemophilus influenzae F3047	935897	leaf	2007018	3	1	1.07379e-248
Salmonella enterica subsp. enterica serovar Chester str. ATCC 11997	941190	leaf	4660922	6	0	4.21359e-06
Escherichia coli O25b:H4	941280	leaf	5483091	24	0	3.09126e-196
Neisseria meningitidis WUE 2594	942513	leaf	2227255	180	17	1.35653e-91
Cronobacter sakazakii SP291	956149	leaf	4518784	3	3	0.0
Salmonella enterica subsp. enterica serovar Oranienburg str. 0250	997333	leaf	4648879	1	0	0
Paenibacillus mucilaginosus K02	997761	leaf	8819200	1	1	0.0
Alteromonas mediterranea DE1	1004786	leaf	4947126	1	0	0.0
Klebsiella michiganensis KCTC 1686	1006551	leaf	5974109	2	2	0.0
Salmonella enterica subsp. enterica serovar Typhimurium str. 798	1008297	leaf	4970096	1	0	8.04373e-06
Klebsiella aerogenes KCTC 2190	1028307	leaf	5280350	17	1	1.99487e-101
Psychrobacter sp. DAB_AL43B	1028416	species	3309148	1	1	0.0
Pseudomonas sp. StFLB209	1028989	species	6332373	2	0	0.0
Salmonella enterica subsp. enterica serovar Pullorum str. ATCC 9120	1029979	leaf	4781492	21	1	4.33782e-35
Ralstonia solanacearum Po82	1031711	leaf	5430263	2	0	0.0
Arcobacter mytili LMG 24559	1032238	leaf	3037595	1	0	0.0
Rhodospirillum rubrum F11	1036743	leaf	4352825	1	0	0.0
Enterobacter cloacae EcWSU1	1045856	leaf	4798091	1	0	0.0
Klebsiella pneumoniae KCTC 2242	1049565	leaf	5462423	124	28	5.0922e-06
Sulfuritalea	1054211	genus	3802648	1	0	0.0
Streptococcus pseudopneumoniae IS7493	1054460	leaf	2195458	24	2	1.02782e-65
Escherichia coli O7:K1 str. CE10	1072459	leaf	5378729	4	0	5.08652e-225
Cronobacter condimenti 1330	1073999	leaf	4499482	6	2	0.0
Cronobacter universalis NCTC 9529	1074000	leaf	4436873	2	1	0.0
Pantoea rwandensis	1076550	species	4327607	1	0	0.0
Streptococcus oralis subsp. tigurinus	1077464	subspecies	1889005	64	0	0.000315522
Paracoccus zhejiangensis	1077935	species	4637247	1	1	0.0
Klebsiella pneumoniae subsp. pneumoniae KPNIH1	1087440	leaf	5766615	1	0	0.0
Dickeya solani	1089444	species	4920704	5	0	0.0
Cutibacterium acnes subsp. defendens ATCC 11828	1091045	leaf	2488626	1	0	0
Klebsiella pneumoniae subsp. pneumoniae KPNIH10	1094170	leaf	5767822	1	0	0.0
Neisseria meningitidis M7124	1095685	leaf	2179483	1	1	0.0
Burkholderia sp. YI23	1097668	species	8896411	1	1	0.0
Enterobacter cloacae subsp. dissolvens SDM	1104326	leaf	4968248	1	0	0.0
Brenneria goodwinii	1109412	species	5360730	1	1	0.0
Streptococcus parasanguinis FW213	1114965	leaf	2171609	1	0	0.0
Klebsiella pneumoniae subsp. pneumoniae Kp13	1123862	leaf	5739888	44	10	6.94119e-07
Salmonella enterica subsp. enterica serovar Poona str. ATCC BAA-1673	1124962	leaf	5091833	1	1	0.000172075
Pseudomonas protegens CHA0	1124983	leaf	6867980	1	0	0.0
Klebsiella pneumoniae subsp. pneumoniae HS11286	1125630	leaf	5682322	55	40	0.0
Ralstonia solanacearum FJAT-1458	1130828	leaf	6059899	1	0	0.0
Ralstonia solanacearum FJAT-91	1130829	leaf	5874087	2	0	0.0
Streptomyces hygroscopicus subsp. jinggangensis 5008	1133850	leaf	10383684	1	0	0.0
Cutibacterium acnes HL096PA1	1134454	leaf	2549775	1	0	0.0
Klebsiella michiganensis	1134687	species	6150064	528	1	6.12121e-80
Corallococcus coralloides DSM 2259	1144275	leaf	10080619	1	0	0.0
Blastococcus saxobsidens DD2	1146883	leaf	4875340	1	1	0.0
Rahnella aquatilis HX2	1151116	leaf	5656799	1	0	0.0
Kosakonia sacchari	1158459	species	4902027	8	3	1.35028e-231
Cronobacter malonaticus LMG 23826	1159491	leaf	4473761	4	0	0.0
Cronobacter dublinensis subsp. dublinensis LMG 23823	1159554	leaf	4628405	3	0	2.40463e-224
Cronobacter muytjensii ATCC 51329	1159613	leaf	4364114	5	1	0.0
Enterobacter sp. R4-368	1166130	species	5155034	3	0	0.0
Salmonella enterica subsp. enterica serovar Bareilly str. CFSAN000189	1173427	leaf	4808805	3	0	7.68887e-06
Salmonella enterica subsp. enterica serovar Bareilly str. CFSAN000191	1173457	leaf	4723270	3	0	6.66888e-48
Salmonella enterica subsp. enterica serovar Weltevreden str. 1655	1173939	leaf	5129059	2	0	2.47462e-07
Pectobacterium wasabiae CFBP 3304	1175631	leaf	5043228	2	0	1.278e-304
Kosakonia radicincitans DSM 16656	1177180	leaf	6122453	3	1	8.36141e-245
Halomonas huangheensis	1178482	species	4757486	1	0	0.0
Klebsiella michiganensis E718	1191061	leaf	6561678	2	0	7.35069e-117
Flammeovirga sp. MY04	1191459	species	7327614	1	1	0.0
Klebsiella pneumoniae subsp. pneumoniae 1084	1193292	leaf	5386705	491	408	6.96057e-06
Streptomyces hygroscopicus subsp. jinggangensis TL01	1203460	leaf	10077952	1	0	0.0
Aeromonas media WS	1208104	leaf	4788430	1	0	0.0
Enterobacter cloacae subsp. cloacae ENHKU01	1211025	leaf	4726582	4	3	0.0
Gluconobacter oxydans H24	1224746	leaf	3816232	1	1	0.0
Pseudomonas mendocina S5.2	1225174	leaf	5372474	1	1	0.0
Dickeya solani D s0432-1	1231725	leaf	4919812	4	0	0.0
Haemophilus influenzae 2019	1232659	leaf	1969659	1	0	3.57594e-248
Nocardiopsis gilva YIM 90087	1235441	leaf	6142152	1	1	0.0
Kosakonia sacchari SP1	1235834	leaf	4902027	1	0	1.35028e-231
Sodalis praecaptivus	1239307	species	5159425	7	1	0.0
Salmonella enterica subsp. enterica serovar Macclesfield str. S-1643	1242107	leaf	5268613	1	1	1.35863e-05
Salmonella enterica subsp. salamae serovar 55:k:z39 str. 1315K	1243602	leaf	5051440	1	1	1.40048e-06
Salmonella bongori serovar 66:z41:- str. SA19983605	1243617	leaf	4468959	1	0	1.02206e-207
Klebsiella pneumoniae CG43	1244085	leaf	5166857	77	17	4.61157e-103
Salmonella enterica subsp. enterica serovar Enteritidis str. EC20110361	1244119	leaf	4682911	1	1	0.0
endosymbiont of unidentified scaly snail isolate Monju	1248727	species	2597759	1	1	0.0
Burkholderia thailandensis H0587	1249663	leaf	6768375	1	1	0.0
Pelagibaca abyssi	1250539	species	5259072	1	1	0.0
Citrobacter amalonaticus Y19	1261127	leaf	5875351	3	0	2.04458e-154
Edwardsiella piscicida	1263550	species	3857040	1	0	0.0
Cupriavidus gilardii CR3	1267562	leaf	5578743	1	1	0.0
Salmonella enterica subsp. enterica serovar Cubana str. CFSAN002050	1271863	leaf	5267011	1	1	1.57436e-05
Azotobacter vinelandii CA	1283330	leaf	5366370	2	0	0.0
Azotobacter vinelandii CA6	1283331	leaf	5323210	2	0	0.0
Klebsiella pneumoniae UHKPC33	1284802	leaf	5663117	15	6	0.0
Raoultella ornithinolytica B6	1286170	leaf	5398151	13	0	0.0
Edwardsiella piscicida C07-087	1288122	leaf	3857040	1	0	0.0
Melittangium boletus DSM 14713	1294270	leaf	9910441	1	0	0.0
Haemophilus influenzae CGSHiCZ412602	1295140	leaf	1811802	2	0	0.0
Enterobacter hormaechei subsp. xiangfangensis	1296536	subspecies	20054814	2	0	0.0
Kosakonia cowanii JCM 10956 = DSM 18146	1300165	leaf	4857324	9	0	2.84278e-231
Alteromonas mediterranea UM7	1300258	leaf	4931660	1	0	0.0
Rhizobium sp. IE4771	1301032	species	7057405	1	0	0.0
Klebsiella pneumoniae 500_1420	1304922	leaf	5547643	13	13	0.0
Salinivirga cyanobacteriivorans	1307839	species	4812386	1	1	0.0
Klebsiella michiganensis HKOPL1	1308980	leaf	5914407	6	2	0.0
Ralstonia pseudosolanacearum	1310165	species	11622205	2	1	0.0
Escherichia coli ACN001	1311757	leaf	4936576	17	1	6.38398e-195
Pseudomonas syringae pv. syringae B301D	1324931	leaf	6094819	1	0	0.0
Nitrospira japonica	1325564	species	4084817	1	1	0.0
Klebsiella pneumoniae subsp. pneumoniae KPNIH27	1328324	leaf	6132443	67	15	7.13935e-07
Klebsiella pneumoniae subsp. pneumoniae KPR0928	1328325	leaf	5436785	1	0	0.0
Escherichia coli APEC IMT5155	1329907	leaf	5126057	7	7	1.64456e-214
Lelliottia	1330545	genus	0	3	0	0.0
Pluralibacter	1330546	genus	4814049	4	0	0.0
Citrobacter freundii CFNIH1	1333848	leaf	5371331	112	0	3.43839e-62
Enterobacter hormaechei subsp. hoffmannii ECR091	1333849	leaf	4959888	8	0	4.29354e-152
Klebsiella oxytoca KONIH1	1333852	leaf	6684898	19	0	1.17327e-116
[Enterobacter] lignolyticus	1334193	species	4814049	15	2	7.86201e-230
Serratia marcescens SM39	1334564	leaf	5326023	3	0	0.0
Serratia liquefaciens ATCC 27592	1346614	leaf	5282719	1	1	0.0
Enterobacter cloacae P101	1354030	leaf	5369929	3	0	0.0
Escherichia coli PCN061	1358422	leaf	4901825	5	0	1.20436e-118
Klebsiella pneumoniae KP-1	1365186	leaf	5375667	137	20	1.03879e-06
Paracoccus aminophilus JCM 7686	1367847	leaf	4873118	2	0	0.0
Klebsiella pneumoniae JM45	1380908	leaf	5603174	30	23	2.13396e-06
Neisseria meningitidis LNP21362	1386087	leaf	2139957	28	0	2.63616e-261
Sulfitobacter sp. SK012	1389005	species	5176795	1	1	0.0
Sphingomonas sp. LK11	1390395	species	3938206	1	1	0.0
Klebsiella pneumoniae subsp. pneumoniae 1158	1392499	leaf	5341039	25	6	2.67753e-19
Klebsiella pneumoniae HK787	1392500	leaf	5329385	26	5	8.53089e-105
Klebsiella pneumoniae subsp. pneumoniae PittNDM01	1406314	leaf	5812304	3	0	0.0
Pseudomonas aeruginosa LES431	1408272	leaf	6550070	1	0	0.0
Salmonella enterica subsp. enterica serovar Enteritidis str. EC20090698	1412454	leaf	4680996	1	0	0.0
Candidatus Walczuchella monophlebidarum	1415657	species	309299	1	1	0.0
Oceanisphaera profunda	1416627	species	3508860	1	0	0.0
Klebsiella pneumoniae 30660/NJST258_1	1420012	leaf	5540936	1	1	0.0
Pseudomonas protegens Cab57	1420599	leaf	6827892	1	0	0.0
Enterobacter asburiae L1	1421338	leaf	4561905	4	0	0.0
Dickeya zeae EC1	1427366	leaf	4532364	1	0	0.0
Rhizobium etli bv. phaseoli str. IE4803	1432049	leaf	6997434	1	0	0.0
Methanosarcina barkeri str. Wiesmoor	1434109	leaf	4907186	1	0	0.0
Streptomyces leeuwenhoekii	1437453	species	8122491	1	1	0.0
Xenorhabdus nematophila AN6/1	1437823	leaf	4586662	2	0	0.0
Castellaniella defragrans 65Phen	1437824	leaf	3952818	1	0	0.0
Escherichia albertii KF1	1440052	leaf	4701875	34	6	3.6726e-06
Nitrospirillum amazonense CBAmc	1441467	leaf	7382386	1	1	0.0
Escherichia coli str. Sanji	1441627	leaf	5428586	4	0	1.7086e-225
Yersinia enterocolitica LC20	1443113	leaf	4850874	2	0	0.0
Gynuella sunshinyii	1445505	species	6475959	1	0	0.0
Escherichia coli O6:H16	1446746	leaf	15266711	31	0	7.76444e-132
Salmonella enterica subsp. enterica serovar Anatum str. USDA-ARS-USMARC-1727	1454584	leaf	4980540	1	1	3.29481e-20
Salmonella enterica subsp. enterica serovar Anatum str. USDA-ARS-USMARC-1736	1454586	leaf	4864598	1	1	5.39492e-57
Salmonella enterica subsp. enterica serovar Montevideo str. USDA-ARS-USMARC-1904	1454604	leaf	4598213	1	0	0.0
Salmonella enterica subsp. enterica serovar Montevideo str. CDC 2010K-0257	1454613	leaf	4814175	3	0	3.70433e-21
Klebsiella quasipneumoniae subsp. similipneumoniae	1463164	subspecies	5514898	105	1	4.43769e-101
Klebsiella quasipneumoniae	1463165	species	5528721	1950	8	2.5519e-60
Pantoea sp. PSNIH2	1484157	species	4967343	7	0	5.66482e-273
Pantoea sp. PSNIH1	1484158	species	4410683	1	1	0.0
Paracoccus mutanolyticus	1499308	species	3592357	3	0	0.0
Burkholderia stagnalis	1503054	species	7583807	2	2	0.0
Blastomonas fulva	1550728	species	4123210	1	0	0.0
Citrobacter pasteurii	1563222	species	4654874	3	0	3.53191e-141
Peptoniphilaceae	1570339	family	1992686	316	0	0.0
Lentzea guizhouensis	1586287	species	9997872	1	1	0.0
Candidatus Filomicrobium marinum	1608628	species	7939883	12	0	0.0
Pararhodospirillum	1612157	genus	3876289	1	0	0.0
Erwinia gerundensis	1619313	species	4481256	1	0	0.0
Aeromonas sp. ASNIH2	1636607	species	4864532	1	1	0.0
Aeromonas sp. ASNIH4	1636609	species	5480196	1	0	0.0
Devosia sp. H5989	1643450	species	4594249	1	1	0.0
Mitsuaria sp. 7	1658665	species	6085092	1	1	0.0
Magnetospirillum sp. XM-1	1663591	species	4992477	1	1	0.0
Klebsiella quasipneumoniae subsp. quasipneumoniae	1667327	subspecies	5542544	86	5	3.09262e-104
Caulobacter flavus	1679497	species	5659202	1	0	0.0
Enterobacter sp. FY-07	1692238	species	5138701	35	33	1.64488e-05
Kocuria sp. BT304	1702043	species	2763150	1	0	0.0
Citrobacter sp. FDAARGOS_156	1702170	species	4727498	2	1	3.20859e-140
Citrobacter sp. CRE-46	1703250	species	6081860	13	1	1.49936e-155
Methylovulum psychrotolerans	1704499	species	4923400	1	0	0.0
Burkholderia sp. IDO3	1705310	species	8003806	1	0	0
Massilia sp. WG5	1707785	species	6216151	1	0	0.0
Tissierellales	1737405	order	2364540	24	0	0.0
Burkholderia sp. Bp7605	1740163	species	5705688	1	0	0.0
Streptomyces sp. 4F	1751294	species	8047771	1	1	0.0
Phytobacter sp. SCO41	1756993	species	5599325	9	0	0.0
Achromobacter sp. AONIH1	1758194	species	6648943	1	0	0.0
Serratia sp. SSNIH1	1758196	species	5388594	12	0	1.68249e-206
Serinicoccus sp. JLT9	1758689	species	3597394	1	1	0.0
Serratia sp. YD25	1759437	species	5117644	1	1	0.0
Salinicola tamaricis	1771309	species	4276240	1	0	0.0
Candidatus Hoaglandella endobia	1778263	species	636713	1	0	0.0
Dickeya fangzhongdai	1778540	species	10011670	1	0	0.0
Bosea sp. PAMC 26642	1792307	species	5510355	1	1	0.0
Enterobacter roggenkampii	1812935	species	10176893	6	0	0.0
Shigella sp. PAMC 28760	1813821	species	4558287	6	0	5.81289e-221
Synechococcus sp. NIES-970	1827144	species	3123859	1	1	0.0
Enterobacter sp. ODB01	1827481	species	4534036	2	0	1.2303e-146
Acidovorax sp. RAC01	1842533	species	4574859	1	0	2.17993e-26
Blastomonas sp. RAC04	1842535	species	4403499	1	0	0.0
Bosea sp. RAC05	1842539	species	5620120	1	1	0.0
Rhodoferax koreense	1842727	species	5895641	1	1	0.0
Neisseria sp. 10022	1853276	species	2511904	5	2	1.76418e-272
Neisseria sp. 10023	1853278	species	2496444	1	1	0.0
Enterobacter sp. HK169	1868135	species	4551186	4	0	2.85071e-146
Candidatus Fukatsuia symbiotica	1878942	species	3131594	2	1	0.0
Pantoea alhagi	1891675	species	4316301	1	0	0.0
Amycolatopsis sp. AA4	1896961	species	9172799	5	5	0.0
Rhodocyclaceae bacterium	1898103	species	3192379	2	1	0.0
Erwiniaceae	1903409	family	1800752	1	0	0.0
Yersiniaceae	1903411	family	5752198	11	0	0.0
Morganellaceae	1903414	family	5691351	8	0	0.0
Oceanisphaera avium	1903694	species	2902896	2	0	0.0
Klebsiella sp. LTGPAF-6F	1905288	species	6790399	19	0	2.7766e-117
Pectobacterium parmentieri	1905730	species	5063892	12	0	0.0
Enterobacter sp. SA187	1914861	species	4429597	5	1	0.0
Enterobacter cloacae complex sp. ECNIH7	1915310	species	5388828	12	1	3.19467e-154
Enterobacteriaceae bacterium ENNIH2	1920109	species	6262406	121	8	2.79662e-35
Citrobacter sp. CFNIH10	1920110	species	5738233	167	0	2.28001e-130
Leclercia sp. LSNIH1	1920114	species	5411940	24	5	1.77154e-232
Leclercia sp. LSNIH3	1920116	species	5389886	3	0	6.02221e-234
Enterobacteriaceae bacterium ENNIH3	1920128	species	6079128	90	0	9.07083e-07
Candidatus Erwinia sp. ErCipseudotaxifoliae	1922217	species	1094672	1	0	0.0
Klebsiella sp. M5al	1934254	species	5800138	7	0	0.0
Aquaspirillum sp. LM1	1938604	species	3962240	1	1	0.0
Sphingomonas sp. LM7	1938607	species	4155514	1	1	0.0
Phytobacter ursingii	1972431	species	6166452	151	53	4.01845e-05
Streptomyces sp. Sge12	1972846	species	8110698	1	1	0.0
Enterobacter sp. Crenshaw	1977566	species	4630785	1	0	0.0
Sagittula sp. P11	2009329	species	5576178	1	1	0.0
Citrobacter sp. 86	2013114	species	5048670	27	0	8.46377e-145
Roseomonas sp. FDAARGOS_362	2018065	species	5174209	1	0	0.0
Shewanella bicestrii	2018305	species	5004414	25	0	9.7185e-297
Citrobacter sp. 92	2019568	species	5109913	31	2	1.68686e-145
Plantactinospora sp. KBS50	2024580	species	6689726	1	1	0.0
Paraburkholderia aromaticivorans	2026199	species	8907716	1	1	0.0
Klebsiella quasivariicola	2026240	species	5946706	1564	27	7.65894e-55
Enterobacter cloacae complex sp.	2027919	species	10167193	139	2	1.92615e-16
Serratia sp. MYb239	2033438	species	4986519	1	0	0.0
Actinoplanes sp. SE50	2033844	species	9239482	1	0	0.0
Dickeya sp. Secpp 1600	2037915	species	5108113	1	0	0.0
Nostoc flagelliforme CCNUN1	2038116	leaf	10231233	1	0	0.0
Gemella sp. ND 6198	2040624	species	1797925	193	0	0
Pectobacterium polaris	2042057	species	9835240	3	3	0.0
Escherichia coli O128:H27	2048776	leaf	5130625	5	4	2.44232e-125
Escherichia coli O15:H11	2048777	leaf	5181145	3	1	2.7747e-222
Enterobacter sp. CRENT-193	2051905	species	5196641	63	0	3.57388e-144
Enterobacteriaceae bacterium S05	2052938	species	5157054	665	0	3.67537e-145
Enterococcus sp. CR-Ec1	2057791	species	3889849	1	0	0.0
Planococcus sp. MB-3u-03	2058136	species	3614431	1	1	0.0
Gordonia sp. YC-JH1	2059875	species	4193324	1	1	0.0
Enterococcus sp. FDAARGOS_375	2060307	species	3549293	1	0	0.0
Paracoccus sp. CBA4604	2065379	species	3299166	2	2	0.0
Citrobacter freundii complex sp. CFNIH2	2066049	species	5340584	3	0	5.7329e-147
Enterobacteriaceae bacterium ENNIH1	2066051	species	5666332	8	0	0.0
Pseudomonas sp. NC02	2067572	species	6890566	1	1	0.0
Pseudomonas sp. XWY-1	2069256	species	6297253	1	0	0.0
Enterobacter cloacae complex sp. FDA-CDC-AR_0164	2077136	species	4849791	3	0	0.0
Enterobacter cloacae complex sp. FDA-CDC-AR_0132	2077137	species	4971441	2	0	0.0
Citrobacter freundii complex sp. CFNIH3	2077147	species	5634842	62	0	5.01759e-147
Citrobacter freundii complex sp. CFNIH4	2077148	species	5629494	12	0	3.15698e-151
Citrobacter freundii complex sp. CFNIH9	2077149	species	5688355	35	1	7.32196e-152
Zoogloeaceae bacteirum Par-f-2	2080469	species	3127098	1	0	0.0
Clostridiaceae bacterium 14S0207	2082193	species	3151275	2	0	0
Mixta	2100764	genus	0	76	0	0.0
Plantactinospora sp. BC1	2108470	species	8333965	1	1	0.0
Lelliottia sp. WB101	2153385	species	4734070	2	0	0.0
Saccharospirillum mangrovi	2161747	species	3686911	1	0	0.0
Dialister sp. Marseille-P5638	2161821	species	2320245	1	0	0.0
Gemmobacter sp. HYN0069	2169400	species	4206589	1	1	0.0
Limnobaculum parvum	2172103	species	3841771	1	1	0.0
Luteimonas sp. 83-4	2172536	species	2592821	1	1	0.0
Thauera hydrothermalis	2184083	species	3059321	1	0	0.0
Azospirillum sp. CFH 70021	2202148	species	6776313	1	1	0.0
Methylobacterium sp. 17Sr1-1	2202826	species	6542583	1	0	0.0
Pseudomonas sp. R2A2	2213057	species	4559447	1	0	0.0
Sphingomonas sp. FARSPH	2219696	species	3761538	1	1	0.0
Raoultella sp. X13	2259647	species	5448479	22	0	0.0
Hydromonas sp. F02	2268024	species	2723407	1	1	0.0
Enterobacteriaceae bacterium w17	2282309	species	5125645	56	1	3.08473e-205
Enterobacteriaceae bacterium w6	2282310	species	4945486	4	1	0.0
Achromobacter sp. B7	2282475	species	6236552	1	0	0.0
Chryseolinea sp. KIS68-18	2321403	species	8241389	1	0	0.0
Serratia sp. 3ACOL1	2448483	species	5876609	2	0	0.0
