# KrakenUniq v0.5.7 DATE:2019-04-15T17:34:59Z DB:/home/biouser/SAM/DBDIR/LIBRARY_MINIKRAKEN/minikraken_20171019_8GB DB_SIZE:8053064728 WD:/home/biouser/SAM
# CL:perl /home/biouser/miniconda3/bin/krakenuniq --db /home/biouser/SAM/DBDIR/LIBRARY_MINIKRAKEN/minikraken_20171019_8GB -paired /home/biouser/SAM/data/7-GC_S7_mixed_with_25%_10-KPN_S9_R1.fastq.gz /home/biouser/SAM/data/7-GC_S7_mixed_with_25%_10-KPN_S9_R2.fastq.gz --report-file /home/biouser/SAM/data/7-GC_S7_mixed_with_25%_10-KPN_S9.krakenuniq.report.tsv

%	reads	taxReads	kmers	dup	cov	taxID	rank	taxName
0.6722	4169	4169	13526424	13.3	1.576	0	no rank	unclassified
99.33	616025	63	340968	24	0.0005147	1	no rank	root
99.32	615962	2	340411	24	0.0005211	131567	no rank	  cellular organisms
99.32	615960	1999	340411	24	0.000539	2	superkingdom	    Bacteria
98.9	613365	3423	339128	23.9	0.001067	1224	phylum	      Proteobacteria
73.66	456857	33	98940	60	0.001654	28216	class	        Betaproteobacteria
73.62	456581	110	96778	61.1	0.03415	206351	order	          Neisseriales
73.6	456471	187	96778	61.1	0.06352	481	family	            Neisseriaceae
73.57	456283	35070	95925	61.1	0.08311	482	genus	              Neisseria
67.82	420594	412002	42356	72.3	0.6478	485	species	                Neisseria gonorrhoeae
1.095	6791	6791	105	131	0.1517	528354	no rank	                  Neisseria gonorrhoeae MS11
0.1827	1133	1133	8	230	0.03636	521006	no rank	                  Neisseria gonorrhoeae NCCP11945
0.1077	668	668	52	29.6	0.03709	242231	no rank	                  Neisseria gonorrhoeae FA 1090
0.08481	526	445	887	6.25	0.004459	487	species	                Neisseria meningitidis
0.005966	37	37	8	40.9	0.00404	942513	no rank	                  Neisseria meningitidis WUE 2594
0.004031	25	0	7	8.71	0.003248	491	no rank	                  Neisseria meningitidis serogroup B
0.004031	25	25	7	8.71	0.003853	630588	no rank	                    Neisseria meningitidis alpha710
0.001612	10	0	9	3.78	0.005933	65699	no rank	                  Neisseria meningitidis serogroup A
0.001612	10	10	9	3.78	0.005933	122587	no rank	                    Neisseria meningitidis Z2491
0.0004837	3	0	26	1.08	0.002844	135720	no rank	                  Neisseria meningitidis serogroup C
0.0003225	2	2	17	1.06	0.003267	374833	no rank	                    Neisseria meningitidis 053442
0.0001612	1	1	7	1.14	0.002041	604162	no rank	                    Neisseria meningitidis 8013
0.0003225	2	2	29	1.14	0.004387	662598	no rank	                  Neisseria meningitidis alpha14
0.0001612	1	1	11	5.73	0.003551	935588	no rank	                  Neisseria meningitidis M01-240355
0.0001612	1	1	2	20	0.001584	935590	no rank	                  Neisseria meningitidis M0579
0.0001612	1	1	1	3	0.0025	935599	no rank	                  Neisseria meningitidis G2136
0.0001612	1	1	1	1	0.025	1095685	no rank	                  Neisseria meningitidis M7124
0.01274	79	66	220	3.5	0.003071	486	species	                Neisseria lactamica
0.002096	13	13	72	3.44	0.002928	489653	no rank	                  Neisseria lactamica 020-06
0.000645	4	4	48	1.9	0.0004695	490	species	                Neisseria sicca
0.0003225	2	0	24	1.12	0.0002686	495	species	                Neisseria elongata
0.0003225	2	0	24	1.12	0.0002686	88719	subspecies	                  Neisseria elongata subsp. glycolytica
0.0003225	2	2	24	1.12	0.0002686	546263	no rank	                    Neisseria elongata subsp. glycolytica ATCC 29315
0.0003225	2	2	15	1.27	0.0001472	655307	species	                Neisseria sp. KEM232
0.0003225	2	2	15	1.07	0.0001396	1853278	species	                Neisseria sp. 10023
0.0003225	2	2	9	1.22	8.442e-05	1853276	species	                Neisseria sp. 10022
0.0001612	1	1	9	1	8.469e-05	326523	species	                Neisseria zoodegmatis
0.0001612	1	1	7	1.14	7.696e-05	28091	species	                Neisseria weaveri
0.0001612	1	0	8	1	8.671e-05	538	genus	              Eikenella
0.0001612	1	1	8	1	8.671e-05	539	species	                Eikenella corrodens
0.03918	243	1	2038	1.11	4.011e-05	80840	order	          Burkholderiales
0.03854	239	3	1989	1.12	7.483e-05	119060	family	            Burkholderiaceae
0.03789	235	14	1904	1.11	0.0008025	48736	genus	              Ralstonia
0.03209	199	55	1514	1.11	0.004109	329	species	                Ralstonia pickettii
0.01242	77	77	387	1.13	0.003071	428406	no rank	                  Ralstonia pickettii 12D
0.0108	67	67	481	1.09	0.004499	402626	no rank	                  Ralstonia pickettii 12J
0.00258	16	16	123	1.15	0.0007514	105219	species	                Ralstonia mannitolilytica
0.0008062	5	4	15	1.07	1.399e-05	305	species	                Ralstonia solanacearum
0.0001612	1	1	1	2	4.9e-05	267608	no rank	                  Ralstonia solanacearum GMI1000
0.0001612	1	1	10	1	2.731e-05	190721	species	                Ralstonia insidiosa
0.0001612	1	0	7	2	4.777e-07	32008	genus	              Burkholderia
0.0001612	1	0	3	3.33	3.88e-07	87882	species group	                Burkholderia cepacia complex
0.0001612	1	0	1	8	0.003145	152500	species	                  Burkholderia dolosa
0.0001612	1	1	1	8	0.003984	1385930	no rank	                    Burkholderia dolosa PC543
0.0001612	1	0	12	1	1.647e-06	506	family	            Alcaligenaceae
0.0001612	1	0	2	1	2.267e-05	1472344	genus	              Basilea
0.0001612	1	0	2	1	2.267e-05	1472345	species	                Basilea psittacipulmonis
0.0001612	1	1	2	1	2.267e-05	1072685	no rank	                  Basilea psittacipulmonis DSM 24701
0.0001612	1	0	9	1	1.019e-06	80864	family	            Comamonadaceae
0.0001612	1	1	1	1	7.085e-07	12916	genus	              Acidovorax
0.0001612	1	0	3	1	1.058e-06	119065	no rank	            unclassified Burkholderiales
0.0001612	1	1	1	1	3.516e-06	413882	species	              [Polyangium] brachysporum
24.68	153066	513	242639	8.53	0.001587	1236	class	        Gammaproteobacteria
24.57	152400	1462	240063	8.51	0.005712	91347	order	          Enterobacterales
24.33	150866	4105	231604	8.48	0.01112	543	family	            Enterobacteriaceae
23.34	144726	14402	201869	8.59	0.06852	570	genus	              Klebsiella
20.94	129883	127692	105503	8.55	0.1223	573	species	                Klebsiella pneumoniae
0.2699	1674	1068	486	6.92	0.00581	72407	subspecies	                  Klebsiella pneumoniae subsp. pneumoniae
0.04079	253	253	80	6.65	0.01112	1123862	no rank	                    Klebsiella pneumoniae subsp. pneumoniae Kp13
0.02628	163	163	42	6.5	0.00516	272620	no rank	                    Klebsiella pneumoniae subsp. pneumoniae MGH 78578
0.0229	142	142	41	6.78	0.004585	1328324	no rank	                    Klebsiella pneumoniae subsp. pneumoniae KPNIH27
0.005805	36	36	11	5.82	0.003059	1392499	no rank	                    Klebsiella pneumoniae subsp. pneumoniae 1158
0.001451	9	9	3	3.67	0.001479	1125630	no rank	                    Klebsiella pneumoniae subsp. pneumoniae HS11286
0.0004837	3	3	2	1.5	0.002774	1193292	no rank	                    Klebsiella pneumoniae subsp. pneumoniae 1084
0.04386	272	0	172	8.86	0.00782	39831	subspecies	                  Klebsiella pneumoniae subsp. rhinoscleromatis
0.04386	272	272	172	8.86	0.00782	861365	no rank	                    Klebsiella pneumoniae subsp. rhinoscleromatis SB3432
0.02064	128	128	66	5.3	0.01574	1365186	no rank	                  Klebsiella pneumoniae KP-1
0.01258	78	78	42	4.45	0.01025	1049565	no rank	                  Klebsiella pneumoniae KCTC 2242
0.005643	35	35	7	7.43	0.0002991	507522	no rank	                  Klebsiella pneumoniae 342
0.0003225	2	2	3	1	0.00297	1380908	no rank	                  Klebsiella pneumoniae JM45
0.0001612	1	1	2	1	0.007605	1420012	no rank	                  Klebsiella pneumoniae 30660/NJST258_1
0.0001612	1	1	1	1	0.001908	1244085	no rank	                  Klebsiella pneumoniae CG43
0.02967	184	179	103	8.5	0.000332	548	species	                Klebsiella aerogenes
0.0008062	5	5	6	3.83	0.0001317	1028307	no rank	                  Klebsiella aerogenes KCTC 2190
0.01177	73	73	107	4.13	0.0009062	2026240	species	                Klebsiella quasivariicola
0.01129	70	62	53	5.08	0.0007265	244366	species	                Klebsiella variicola
0.00129	8	8	11	6.27	0.000758	640131	no rank	                  Klebsiella variicola At-22
0.009836	61	61	50	6.1	0.001468	1463165	species	                Klebsiella quasipneumoniae
0.006772	42	42	49	5.8	0.0001408	571	species	                Klebsiella oxytoca
0.0008062	5	1	7	1.86	3.327e-05	1134687	species	                Klebsiella michiganensis
0.000645	4	4	1	5	0.0002068	1006551	no rank	                  Klebsiella michiganensis KCTC 1686
0.000645	4	4	3	4.33	8.98e-05	1934254	species	                Klebsiella sp. M5al
0.0003225	2	2	6	8.17	0.0002942	1905288	species	                Klebsiella sp. LTGPAF-6F
0.1833	1137	88	635	8.6	0.0002977	561	genus	              Escherichia
0.1629	1010	952	549	8.32	0.000328	562	species	                Escherichia coli
0.006772	42	0	64	8.97	0.003426	168807	no rank	                  Escherichia coli O127:H6
0.006772	42	42	64	8.97	0.003426	574521	no rank	                    Escherichia coli O127:H6 str. E2348/69
0.001451	9	9	3	7	0.0002633	696406	no rank	                  Escherichia coli UMNK88
0.000645	4	4	1	4	0.0003908	1329907	no rank	                  Escherichia coli APEC IMT5155
0.0001612	1	0	2	1	0.0007599	498388	no rank	                  Escherichia coli C
0.0001612	1	1	2	1	0.000771	481805	no rank	                    Escherichia coli ATCC 8739
0.0001612	1	1	1	2	0.0008628	741093	no rank	                  Escherichia coli Xuzhou21
0.0001612	1	1	1	1	0.0004587	1358422	no rank	                  Escherichia coli PCN061
0.006288	39	18	12	10.5	5.093e-05	208962	species	                Escherichia albertii
0.003386	21	21	3	11.3	0.0001193	1440052	no rank	                  Escherichia albertii KF1
0.05466	339	2	225	6.97	5.891e-05	547	genus	              Enterobacter
0.04144	257	8	182	6.79	6.318e-05	354276	species group	                Enterobacter cloacae complex
0.03064	190	173	109	7.84	0.0001009	550	species	                  Enterobacter cloacae
0.001612	10	10	3	12	6.374e-05	1354030	no rank	                    Enterobacter cloacae P101
0.001129	7	0	4	8.75	7.93e-05	336306	subspecies	                    Enterobacter cloacae subsp. cloacae
0.0009674	6	6	3	11.3	0.0002044	1211025	no rank	                      Enterobacter cloacae subsp. cloacae ENHKU01
0.0001612	1	1	1	1	2.801e-05	716541	no rank	                      Enterobacter cloacae subsp. cloacae ATCC 13047
0.005482	34	0	15	11.3	7.303e-05	158836	species	                  Enterobacter hormaechei
0.005482	34	34	14	11.2	0.0003678	299766	subspecies	                    Enterobacter hormaechei subsp. steigerwaltii
0.002419	15	5	14	4.14	5.704e-05	1334193	species	                  Enterobacter lignolyticus
0.001612	10	10	3	10	5.245e-05	701347	no rank	                    Enterobacter lignolyticus SCF1
0.001612	10	10	8	5.62	0.0003624	208224	species	                  Enterobacter kobei
0.006933	43	43	13	11.5	0.0005608	1827481	species	                Enterobacter sp. ODB01
0.004031	25	25	7	14.1	0.0001723	1868135	species	                Enterobacter sp. HK169
0.001935	12	12	7	6.57	3.385e-05	1692238	species	                Enterobacter sp. FY-07
0.0474	294	0	280	4.63	0.0001364	590	genus	              Salmonella
0.0474	294	29	276	4.68	0.0001537	28901	species	                Salmonella enterica
0.0395	245	133	121	7.89	0.0001607	59201	subspecies	                  Salmonella enterica subsp. enterica
0.005321	33	0	9	12.3	0.003031	29482	no rank	                    Salmonella enterica subsp. enterica serovar Abony
0.005321	33	33	9	12.3	0.003031	1029983	no rank	                      Salmonella enterica subsp. enterica serovar Abony str. 0014
0.002902	18	18	4	15	0.000237	595	no rank	                    Salmonella enterica subsp. enterica serovar Infantis
0.002902	18	0	11	5.18	0.00221	58096	no rank	                    Salmonella enterica subsp. enterica serovar Bareilly
0.002902	18	18	11	5.18	0.00221	1173427	no rank	                      Salmonella enterica subsp. enterica serovar Bareilly str. CFSAN000189
0.001612	10	0	4	13.5	0.0003759	1242081	no rank	                    Salmonella enterica subsp. enterica serovar Hillingdon
0.001612	10	10	4	13.5	0.0003759	1242096	no rank	                      Salmonella enterica subsp. enterica serovar Hillingdon str. N1529-D3
0.001451	9	0	4	7.75	0.0002665	192954	no rank	                    Salmonella enterica subsp. enterica serovar Mbandaka
0.001451	9	9	4	7.75	0.0002665	984237	no rank	                      Salmonella enterica subsp. enterica serovar Mbandaka str. ATCC 51958
0.0009674	6	0	1	20	0.0001063	1242079	no rank	                    Salmonella enterica subsp. enterica serovar Apapa
0.0009674	6	6	1	20	0.0001063	1242088	no rank	                      Salmonella enterica subsp. enterica serovar Apapa str. SA20060561
0.000645	4	0	1	15	0.0001384	82689	no rank	                    Salmonella enterica subsp. enterica serovar Muenster
0.000645	4	4	1	15	0.0001384	1124958	no rank	                      Salmonella enterica subsp. enterica serovar Muenster str. 0315
0.0004837	3	3	6	2.67	0.0002636	90370	no rank	                    Salmonella enterica subsp. enterica serovar Typhi
0.0004837	3	0	2	4	0.0003679	115981	no rank	                    Salmonella enterica subsp. enterica serovar Montevideo
0.0004837	3	3	2	4	0.0009005	859199	no rank	                      Salmonella enterica subsp. enterica serovar Montevideo str. 507440-20
0.0003225	2	2	1	6	3.776e-05	90371	no rank	                    Salmonella enterica subsp. enterica serovar Typhimurium
0.0003225	2	1	4	1	0.0002175	58712	no rank	                    Salmonella enterica subsp. enterica serovar Anatum
0.0001612	1	1	3	1	0.004127	1454584	no rank	                      Salmonella enterica subsp. enterica serovar Anatum str. USDA-ARS-USMARC-1727
0.0001612	1	0	1	4	0.0003166	340190	no rank	                    Salmonella enterica subsp. enterica serovar Schwarzengrund
0.0001612	1	1	1	4	0.0003166	439843	no rank	                      Salmonella enterica subsp. enterica serovar Schwarzengrund str. CVM19633
0.0001612	1	1	2	1	9.071e-05	108619	no rank	                    Salmonella enterica subsp. enterica serovar Newport
0.0001612	1	1	1	1	7.196e-05	28150	no rank	                    Salmonella enterica subsp. enterica serovar Senftenberg
0.0001612	1	1	1	1	5.678e-05	57743	no rank	                    Salmonella enterica subsp. enterica serovar Weltevreden
0.002902	18	17	12	8.17	9.194e-05	59204	subspecies	                  Salmonella enterica subsp. diarizonae
0.0001612	1	0	1	1	5.215e-05	1243615	no rank	                    Salmonella enterica subsp. diarizonae serovar 65:c:z
0.0001612	1	1	1	1	5.215e-05	1243616	no rank	                      Salmonella enterica subsp. diarizonae serovar 65:c:z str. SA20044251
0.0003225	2	0	6	4.5	3.531e-05	59202	subspecies	                  Salmonella enterica subsp. salamae
0.0003225	2	0	3	3.67	3.061e-05	1243601	no rank	                    Salmonella enterica subsp. salamae serovar 55:k:z39
0.0003225	2	2	3	3.67	3.061e-05	1243602	no rank	                      Salmonella enterica subsp. salamae serovar 55:k:z39 str. 1315K
0.02741	170	2	169	5.53	6.537e-05	544	genus	              Citrobacter
0.02435	151	5	140	6	0.000112	1344959	species group	                Citrobacter freundii complex
0.02048	127	112	112	6.15	0.0002029	546	species	                  Citrobacter freundii
0.002419	15	15	6	8.33	5.417e-05	1333848	no rank	                    Citrobacter freundii CFNIH1
0.002902	18	18	15	5.4	5.207e-05	67827	species	                  Citrobacter werkmanii
0.0001612	1	1	6	6	3.523e-05	57706	species	                  Citrobacter braakii
0.001774	11	0	2	13.5	1.001e-05	67825	species	                Citrobacter rodentium
0.001774	11	11	2	13.5	1.001e-05	637910	no rank	                  Citrobacter rodentium ICC168
0.0009674	6	6	5	4.6	3.035e-05	67824	species	                Citrobacter farmeri
0.009836	61	0	69	6.12	0.0002992	579	genus	              Kluyvera
0.009836	61	61	69	6.12	0.0002992	61648	species	                Kluyvera intermedia
0.001935	12	0	9	5.67	1.357e-05	158483	genus	              Cedecea
0.001935	12	12	9	5.67	1.357e-05	158822	species	                Cedecea neteri
0.001129	7	0	35	2.31	6.443e-05	160674	genus	              Raoultella
0.001129	7	7	35	2.31	6.443e-05	54291	species	                Raoultella ornithinolytica
0.0009674	6	0	15	4.93	1.55e-05	1330547	genus	              Kosakonia
0.0009674	6	6	11	5.64	3.439e-05	208223	species	                Kosakonia cowanii
0.0004837	3	1	4	4.25	7.877e-06	1330545	genus	              Lelliottia
0.0003225	2	2	2	5.5	1.144e-05	1907578	species	                Lelliottia sp. PFL01
0.0003225	2	0	21	3.38	1.727e-05	413496	genus	              Cronobacter
0.0003225	2	0	2	3	1.532e-05	413502	species	                Cronobacter turicensis
0.0003225	2	2	2	3	1.532e-05	693216	no rank	                  Cronobacter turicensis z3032
0.0003225	2	0	3	1	3.447e-05	620	genus	              Shigella
0.0001612	1	0	2	1	9.683e-05	622	species	                Shigella dysenteriae
0.0001612	1	1	2	1	9.683e-05	300267	no rank	                  Shigella dysenteriae Sd197
0.0001612	1	1	1	1	5.201e-05	621	species	                Shigella boydii
0.0001612	1	0	3	2	3.149e-06	191675	no rank	              unclassified Enterobacteriaceae
0.0001612	1	0	3	2	8.56e-06	36866	no rank	                unclassified Enterobacteriaceae (miscellaneous)
0.0001612	1	1	1	1	6.21e-06	891974	species	                  Plautia stali symbiont
0.0001612	1	0	4	1	2.294e-05	1335483	genus	              Shimwellia
0.0001612	1	0	4	1	2.294e-05	563	species	                Shimwellia blattae
0.0001612	1	1	4	1	2.294e-05	630626	no rank	                  Shimwellia blattae DSM 4481 = NBRC 105725
0.006288	39	0	50	6.74	7.409e-06	1903411	family	            Yersiniaceae
0.006288	39	0	37	7.84	1.02e-05	613	genus	              Serratia
0.004676	29	17	22	9.5	2.124e-05	615	species	                Serratia marcescens
0.001935	12	12	4	11.5	4.156e-05	1249634	no rank	                  Serratia marcescens FGI94
0.001612	10	10	4	9.5	4.02e-05	61652	species	                Serratia rubidaea
0.004515	28	0	27	7.48	8.196e-06	1903414	family	            Morganellaceae
0.004192	26	0	20	9.25	8.374e-05	581	genus	              Morganella
0.004192	26	26	20	9.25	8.374e-05	582	species	                Morganella morganii
0.0001612	1	0	2	6	1.917e-06	626	genus	              Xenorhabdus
0.0001612	1	1	1	1	5.435e-06	628	species	                Xenorhabdus nematophila
0.0001612	1	0	3	1	3.021e-06	586	genus	              Providencia
0.0001612	1	0	2	1	1.278e-05	516075	species	                Providencia sneebia
0.0001612	1	1	2	1	1.278e-05	1141660	no rank	                  Providencia sneebia DSM 19967
0.0004837	3	0	18	4	3.635e-06	1903410	family	            Pectobacteriaceae
0.0004837	3	1	12	5	4.76e-06	204037	genus	              Dickeya
0.0003225	2	2	1	18	1.038e-05	568766	species	                Dickeya sp. NCPPB 3274
0.0001612	1	0	18	2.56	4.495e-06	1903409	family	            Erwiniaceae
0.0001612	1	0	5	3.8	4.837e-06	551	genus	              Erwinia
0.0001612	1	0	1	1	5.919e-06	338565	species	                Erwinia tasmaniensis
0.0001612	1	1	1	1	5.919e-06	465817	no rank	                  Erwinia tasmaniensis Et1/99
0.0001612	1	0	11	1	7.075e-06	1903412	family	            Hafniaceae
0.0001612	1	1	10	1	1.234e-05	635	genus	              Edwardsiella
0.02209	137	0	88	12.8	8.47e-06	135623	order	          Vibrionales
0.02209	137	0	88	12.8	8.47e-06	641	family	            Vibrionaceae
0.02209	137	0	88	12.8	1.035e-05	662	genus	              Vibrio
0.01967	122	122	78	13.4	0.0002986	674	species	                Vibrio mimicus
0.002419	15	0	5	14.4	2.542e-05	29494	species	                Vibrio furnissii
0.002419	15	15	5	14.4	2.542e-05	903510	no rank	                  Vibrio furnissii NCTC 11218
0.0009674	6	0	16	3.5	9.896e-07	135622	order	          Alteromonadales
0.0008062	5	0	9	5.44	1.729e-06	72275	family	            Alteromonadaceae
0.000645	4	0	5	8.2	2.434e-06	2742	genus	              Marinobacter
0.000645	4	0	4	9.75	1.404e-05	2743	species	                Marinobacter hydrocarbonoclasticus
0.000645	4	4	4	9.75	3.612e-05	351348	no rank	                  Marinobacter hydrocarbonoclasticus VT8
0.0001612	1	0	3	2.33	1.441e-06	226	genus	              Alteromonas
0.0001612	1	1	2	3	4.054e-06	314275	species	                Alteromonas mediterranea
0.0001612	1	0	2	1	5.922e-06	267894	family	            Psychromonadaceae
0.0001612	1	0	2	1	5.922e-06	67572	genus	              Psychromonas
0.0001612	1	0	1	1	4.952e-06	357794	species	                Psychromonas ingrahamii
0.0001612	1	1	1	1	4.952e-06	357804	no rank	                  Psychromonas ingrahamii 37
0.0008062	5	0	9	4.89	3.135e-06	135624	order	          Aeromonadales
0.0008062	5	0	9	4.89	3.135e-06	84642	family	            Aeromonadaceae
0.0008062	5	0	9	4.89	4.289e-06	642	genus	              Aeromonas
0.0008062	5	5	4	9.75	2.222e-05	652	species	                Aeromonas schubertii
0.0003225	2	0	18	2.61	4.121e-07	72274	order	          Pseudomonadales
0.0001612	1	0	17	2.71	4.487e-07	135621	family	            Pseudomonadaceae
0.0001612	1	0	15	2.93	4.038e-07	286	genus	              Pseudomonas
0.0001612	1	0	3	1	9.214e-07	136845	species group	                Pseudomonas putida group
0.0001612	1	0	3	1	1.39e-06	303	species	                  Pseudomonas putida
0.0001612	1	1	1	1	0.000108	1193499	no rank	                    Pseudomonas putida SJTE-1
0.0001612	1	0	1	1	1.725e-07	468	family	            Moraxellaceae
0.0001612	1	1	1	1	2.676e-07	469	genus	              Acinetobacter
0.0001612	1	0	6	1.17	8.119e-07	135619	order	          Oceanospirillales
0.0001612	1	0	5	1.2	1.429e-06	28256	family	            Halomonadaceae
0.0001612	1	1	2	1.5	6.535e-06	504090	genus	              Kushneria
0.0001612	1	0	3	1.67	1.162e-06	72273	order	          Thiotrichales
0.0001612	1	0	2	2	2.116e-06	135616	family	            Piscirickettsiaceae
0.0001612	1	0	2	2	1.82e-05	28884	genus	              Hydrogenovibrio
0.0001612	1	0	2	2	1.82e-05	39765	species	                Hydrogenovibrio crunogenus
0.0001612	1	1	2	2	1.82e-05	317025	no rank	                  Hydrogenovibrio crunogenus XCL-2
0.0001612	1	0	2	1.5	4.568e-07	135613	order	          Chromatiales
0.0001612	1	0	2	1.5	1.046e-06	72276	family	            Ectothiorhodospiraceae
0.0001612	1	0	1	2	2.15e-06	1765964	genus	              Acidihalobacter
0.0001612	1	1	1	2	6.604e-06	1765967	species	                Acidihalobacter ferrooxidans
0.003064	19	1	42	1.81	5.442e-07	28211	class	        Alphaproteobacteria
0.00129	8	0	14	1	1.127e-06	204455	order	          Rhodobacterales
0.00129	8	0	14	1	1.189e-06	31989	family	            Rhodobacteraceae
0.000645	4	0	7	1	9.085e-06	265	genus	              Paracoccus
0.0003225	2	2	3	1	1.5e-05	147645	species	                Paracoccus yeei
0.0001612	1	0	3	1	1.36e-05	266	species	                Paracoccus denitrificans
0.0001612	1	1	3	1	1.36e-05	318586	no rank	                  Paracoccus denitrificans PD1222
0.0001612	1	0	1	1	4.668e-06	34003	species	                Paracoccus aminophilus
0.0001612	1	1	1	1	4.668e-06	1367847	no rank	                  Paracoccus aminophilus JCM 7686
0.0003225	2	0	2	1	1.802e-06	1060	genus	              Rhodobacter
0.0001612	1	0	1	1	1.683e-06	1063	species	                Rhodobacter sphaeroides
0.0001612	1	1	1	1	5.498e-06	349102	no rank	                  Rhodobacter sphaeroides ATCC 17025
0.0001612	1	0	1	1	5.986e-06	1061	species	                Rhodobacter capsulatus
0.0001612	1	1	1	1	5.986e-06	272942	no rank	                  Rhodobacter capsulatus SB 1003
0.0001612	1	0	1	1	4.513e-06	367771	genus	              Marinovum
0.0001612	1	0	1	1	4.513e-06	42444	species	                Marinovum algicola
0.0001612	1	1	1	1	4.513e-06	988812	no rank	                  Marinovum algicola DG 898
0.0001612	1	0	1	1	1.577e-06	34008	genus	              Rhodovulum
0.0001612	1	1	1	1	6.596e-06	308754	species	                Rhodovulum sp. MB263
0.001129	7	0	13	1.08	3.356e-07	356	order	          Rhizobiales
0.0004837	3	0	3	1.33	3.059e-07	41294	family	            Bradyrhizobiaceae
0.0003225	2	0	2	1.5	3.318e-07	374	genus	              Bradyrhizobium
0.0001612	1	1	1	2	9.098e-07	1437360	species	                Bradyrhizobium erythrophlei
0.0001612	1	1	1	1	3.686e-06	335659	species	                Bradyrhizobium sp. S23321
0.0001612	1	0	1	1	9.668e-07	85413	genus	              Bosea
0.0001612	1	1	1	1	4.205e-06	1792307	species	                Bosea sp. PAMC 26642
0.0001612	1	1	2	1	2.89e-06	335928	family	            Xanthobacteraceae
0.0001612	1	0	2	1	5.186e-07	69277	family	            Phyllobacteriaceae
0.0001612	1	1	2	1	7.259e-07	68287	genus	              Mesorhizobium
0.0001612	1	0	2	1	1.503e-07	82115	family	            Rhizobiaceae
0.0001612	1	0	2	1	2.253e-07	227290	no rank	              Rhizobium/Agrobacterium group
0.0001612	1	1	2	1	3.116e-07	379	genus	                Rhizobium
0.0001612	1	0	1	1	2.362e-06	119042	no rank	            unclassified Rhizobiales
0.0001612	1	0	1	1	3.726e-06	1734920	genus	              Pseudorhodoplanes
0.0001612	1	1	1	1	3.726e-06	1235591	species	                Pseudorhodoplanes sinuspersici
0.0003225	2	0	7	3.43	8.189e-07	204441	order	          Rhodospirillales
0.0001612	1	0	6	3.83	1.414e-06	433	family	            Acetobacteraceae
0.0001612	1	0	1	1	4.149e-06	125216	genus	              Roseomonas
0.0001612	1	1	1	1	4.149e-06	257708	species	                Roseomonas gilardii
0.0001612	1	0	1	1	2.323e-07	41295	family	            Rhodospirillaceae
0.0001612	1	0	1	1	5.819e-07	191	genus	              Azospirillum
0.0001612	1	1	1	1	1.403e-06	192	species	                Azospirillum brasilense
0.0001612	1	0	3	1	2.659e-07	204457	order	          Sphingomonadales
0.0001612	1	0	2	1	2.274e-07	41297	family	            Sphingomonadaceae
0.0001612	1	0	1	1	5.155e-06	150203	genus	              Blastomonas
0.0001612	1	1	1	1	5.155e-06	1842535	species	                Blastomonas sp. RAC04
0.09594	595	245	135	29.9	5.555e-07	1783272	no rank	      Terrabacteria group
0.05531	343	337	76	43.1	8.15e-07	1239	phylum	        Firmicutes
0.0008062	5	0	29	2.1	4.422e-07	91061	class	          Bacilli
0.0008062	5	0	21	1.43	1.115e-06	186826	order	            Lactobacillales
0.0004837	3	0	11	1.45	1.783e-06	1300	family	              Streptococcaceae
0.0004837	3	0	11	1.45	2.13e-06	1301	genus	                Streptococcus
0.0001612	1	0	4	1	2.393e-05	28037	species	                  Streptococcus mitis
0.0001612	1	1	4	1	7.833e-05	365659	no rank	                    Streptococcus mitis B6
0.0001612	1	1	2	1	9.108e-06	1311	species	                  Streptococcus agalactiae
0.0001612	1	1	1	2	4.203e-06	1304	species	                  Streptococcus salivarius
0.0001612	1	0	8	1.38	1.086e-06	33958	family	              Lactobacillaceae
0.0001612	1	0	8	1.38	1.163e-06	1578	genus	                Lactobacillus
0.0001612	1	1	3	1	3.172e-05	1601	species	                  Lactobacillus agilis
0.0001612	1	0	1	2	4.072e-07	81852	family	              Enterococcaceae
0.0001612	1	0	1	2	5.077e-07	1350	genus	                Enterococcus
0.0001612	1	1	1	2	2.989e-06	1352	species	                  Enterococcus faecium
0.0001612	1	0	19	1.37	7.956e-07	186801	class	          Clostridia
0.0001612	1	0	19	1.37	9.376e-07	186802	order	            Clostridiales
0.0001612	1	0	19	1.37	6.807e-06	186803	family	              Lachnospiraceae
0.0001612	1	0	19	1.37	0.0001273	186928	no rank	                unclassified Lachnospiraceae
0.0001612	1	0	19	1.37	0.0001273	39491	species	                  [Eubacterium] rectale
0.0001612	1	1	19	1.37	0.0001273	515619	no rank	                    [Eubacterium] rectale ATCC 33656
0.001129	7	0	53	1.09	4.71e-07	201174	phylum	        Actinobacteria
0.001129	7	0	52	1.1	4.758e-07	1760	class	          Actinobacteria
0.0004837	3	0	17	1.06	3.334e-06	85009	order	            Propionibacteriales
0.0004837	3	0	17	1.06	6.561e-06	31957	family	              Propionibacteriaceae
0.0003225	2	0	9	1.11	1.875e-05	1912216	genus	                Cutibacterium
0.0003225	2	2	9	1.11	4.614e-05	1747	species	                  Cutibacterium acnes
0.0001612	1	0	8	1	3.038e-05	1743	genus	                Propionibacterium
0.0001612	1	1	8	1	7.26e-05	671223	species	                  Propionibacterium sp. oral taxon 193
0.0003225	2	0	3	1.67	3.256e-07	85010	order	            Pseudonocardiales
0.0003225	2	0	3	1.67	3.256e-07	2070	family	              Pseudonocardiaceae
0.0003225	2	0	2	1.5	9.746e-07	1813	genus	                Amycolatopsis
0.0001612	1	0	1	2	3.191e-06	1814	species	                  Amycolatopsis methanolica
0.0001612	1	1	1	2	3.191e-06	1068978	no rank	                    Amycolatopsis methanolica 239
0.0001612	1	1	1	1	1.732e-06	31958	species	                  Amycolatopsis orientalis
0.0001612	1	0	23	1.09	1.319e-06	85006	order	            Micrococcales
0.0001612	1	0	23	1.09	4.219e-06	1268	family	              Micrococcaceae
0.0001612	1	0	22	1.09	0.0002045	1269	genus	                Micrococcus
0.0001612	1	1	22	1.09	0.0002045	1270	species	                  Micrococcus luteus
0.0001612	1	0	2	1	2.906e-06	1643682	order	            Geodermatophilales
0.0001612	1	0	2	1	2.906e-06	85030	family	              Geodermatophilaceae
0.0001612	1	0	1	1	4.337e-06	1860	genus	                Geodermatophilus
0.0001612	1	0	1	1	4.337e-06	1861	species	                  Geodermatophilus obscurus
0.0001612	1	1	1	1	4.337e-06	526225	no rank	                    Geodermatophilus obscurus DSM 43160
0.0001612	1	0	12	1.5	2.612e-07	1783270	no rank	      FCB group
0.0001612	1	0	12	1.5	2.653e-07	68336	no rank	        Bacteroidetes/Chlorobi group
0.0001612	1	0	11	1.55	2.547e-07	976	phylum	          Bacteroidetes
0.0001612	1	0	8	1.75	1.05e-06	200643	class	            Bacteroidia
0.0001612	1	0	8	1.75	1.191e-06	171549	order	              Bacteroidales
0.0001612	1	0	8	1.75	6.025e-06	171552	family	                Prevotellaceae
0.0001612	1	0	8	1.75	6.025e-06	838	genus	                  Prevotella
0.0001612	1	1	8	1.75	3.294e-05	28131	species	                    Prevotella intermedia
