name	taxID	taxRank	genomeSize	numReads	numUniqueReads	abundance
Shewanella	22	genus	5140018	21	0	0.0
Shewanella putrefaciens	24	species	4749735	2	0	0.0
Comamonas	283	genus	5695231	8	0	0.0
Pseudomonas	286	genus	6735709	14	0	0.0
Pseudomonas fluorescens	294	species	6526868	3	0	0.0
Ralstonia solanacearum	305	species	5757294	1	1	0.0
Pseudomonas syringae	317	species	9277206	1	0	0.0
Xanthomonas oryzae	347	species	38998012	1	0	0.0
Azotobacter chroococcum	353	species	5192286	1	0	0.0
Acetobacteraceae	433	family	3826783	1	0	0.0
Moraxellaceae	468	family	3802099	337	0	0.0
Acinetobacter	469	genus	4001637	155	0	0.0
Acinetobacter baumannii	470	species	3995919	17	1	0.0
Moraxella catarrhalis	480	species	1863286	2	0	1.40469e-313
Neisseriaceae	481	family	2245252	358	0	0.0
Neisseria	482	genus	2223194	380	15	0.0
Neisseria cinerea	483	species	1832904	120	0	4.72161e-239
Neisseria gonorrhoeae	485	species	2209297	646928	394800	0.37203
Neisseria lactamica	486	species	2220606	1886	81	1.05297e-05
Neisseria meningitidis	487	species	2222288	12942	856	0.000122546
Neisseria mucosa	488	species	2688408	53	2	1.21968e-276
Neisseria polysaccharea	489	species	2024930	1271	85	3.23907e-06
Neisseria sicca	490	species	2783943	50	6	1.27911e-280
Neisseria elongata	495	species	2253031	41	2	1.24281e-266
Eikenella corrodens	539	species	2192577	45	0	2.8929e-292
Enterobacteriaceae	543	family	8974696	367	0	0.0
Citrobacter	544	genus	5356580	11	4	0.0
Citrobacter koseri	545	species	4735357	17	0	1.29226e-139
Citrobacter freundii	546	species	5371331	20	2	5.01173e-78
Enterobacter	547	genus	8075228	7	0	0.0
Klebsiella aerogenes	548	species	5435727	11	2	4.49179e-96
Pantoea agglomerans	549	species	10099709	1	1	0.0
Enterobacter cloacae	550	species	5160721	39	1	0
Pectobacterium carotovorum	554	species	8172380	1	0	0.0
Escherichia	561	genus	7248177	13	0	0.0
Escherichia coli	562	species	7295430	783	48	0.000882469
Klebsiella	570	genus	10431961	20	0	0.0
Klebsiella oxytoca	571	species	6684898	17	0	3.99593e-06
Klebsiella pneumoniae	573	species	12022929	1582	857	0.0477109
Morganella	581	genus	3799539	19	0	0.0
Morganella morganii	582	species	3799539	19	0	2.86549e-254
Proteus	583	genus	3973324	310	0	0.0
Proteus mirabilis	584	species	3973324	16	1	1.07334e-59
Proteus vulgaris	585	species	3961988	2	0	0.0
Providencia	586	genus	4402109	1	0	0.0
Salmonella	590	genus	10241433	8	0	0.0
Salmonella enterica subsp. enterica serovar Infantis	595	leaf	34245189	41	14	1.05665e-06
Salmonella enterica subsp. enterica serovar Thompson	600	leaf	23736161	26	10	2.15261e-07
Salmonella enterica subsp. enterica serovar Pullorum	605	leaf	4882929	7	0	5.05284e-06
Salmonella enterica subsp. enterica serovar Heidelberg	611	leaf	97441747	17	0	0
Serratia	613	genus	5337459	6	0	0.0
Serratia liquefaciens	614	species	5282719	1	0	0.0
Serratia marcescens	615	species	5201904	5	1	7.06215e-161
Shigella	620	genus	4694865	1	0	0.0
Shigella flexneri	623	species	4828820	1	0	0.0
Edwardsiella tarda	636	species	3766483	1	0	0.0
Vibrionaceae	641	family	5361384	359	0	0.0
Aeromonas hydrophila	644	species	4976268	1	1	0.0
Photobacterium	657	genus	5287613	2	0	0.0
Vibrio	662	genus	5428754	77	0	0.0
Vibrio cholerae	666	species	4899596	4	0	0.0
Vibrio vulnificus	672	species	5071151	1	0	0.0
Pasteurellaceae	712	family	2311789	375	0	0.0
Haemophilus	724	genus	1907846	304	0	0.0
Haemophilus haemolyticus	726	species	7646594	15	0	0
Haemophilus influenzae	727	species	1910832	51	4	3.14901e-251
Haemophilus parainfluenzae	729	species	2086875	8	0	3.32144e-259
Aggregatibacter aphrophilus	732	species	4626291	1	1	0.0
Rhodospirillum	1081	genus	4371641	1	0	0.0
Gammaproteobacteria	1236	class	7010314	225	0	0.0
Firmicutes	1239	phylum	3844509	217	0	0.0
Staphylococcus	1279	genus	4881238	1	0	0.0
Staphylococcus aureus	1280	species	5646514	1	0	0.0
Staphylococcus haemolyticus	1283	species	2697861	4	0	0
Streptococcus	1301	genus	2223762	210	0	0.0
Streptococcus agalactiae	1311	species	2111259	17	1	0.0
Streptococcus pneumoniae	1313	species	2114217	198	100	2.58149e-38
Streptococcus pyogenes	1314	species	1944914	44	4	0.0
Streptococcus anginosus	1328	species	2089210	25	0	0.0
Enterococcus	1350	genus	3026330	1	0	0.0
Enterococcus faecium	1352	species	2979896	31	28	0.0
Bacillales	1385	order	4938247	355	0	0.0
Bacillus subtilis	1423	species	8099068	6	5	0.0
Clostridioides difficile	1496	species	5577066	83	81	2.21016e-05
Lactobacillus agilis	1601	species	2187209	1	1	0.0
Actinobacteria	1760	class	4813989	2	0	0.0
Mycolicibacterium smegmatis	1772	species	14041927	1	1	0.0
Mycoplasmatales	2085	order	986199	14	0	0.0
Mycoplasmataceae	2092	family	986199	11	0	0.0
Mycoplasma hominis	2098	species	690305	216	0	2.12762e-20
Candidatus Sodalis pierantonius str. SOPE	2342	leaf	4513140	3	0	0.0
Homo sapiens	9606	species	3257319537	41	24	5.00433e-08
Myoviridae	10662	family	137496	2	0	0.0
Escherichia virus P2	10679	species	33593	1	0	3.09545e-103
Azoarcus	12960	genus	0	1	0	0.0
Streptococcus mitis	28037	species	2146611	72	0	0
Alteromonas macleodii	28108	species	4602757	1	1	0.0
Cronobacter sakazakii	28141	species	4439412	5	0	2.32674e-18
Salmonella enterica subsp. enterica serovar Derby	28144	leaf	9935604	284	7	0.000768944
Salmonella enterica subsp. enterica serovar Oranienburg	28147	leaf	4651134	6	0	0
Salmonella enterica subsp. enterica serovar Senftenberg	28150	leaf	20218480	34	8	2.17116e-06
Vibrio nigripulchritudo	28173	species	6322155	1	1	0.0
Neisseria subflava	28449	species	2321871	21	5	2.73222e-270
Burkholderia pseudomallei	28450	species	7741335	1	1	0.0
Euryarchaeota	28890	phylum	2854526	1	0	0.0
Salmonella enterica	28901	species	10337520	45459	43687	0.503455
Lactobacillus delbrueckii subsp. lactis	29397	subspecies	8524041	2	0	0.0
Mollicutes	31969	class	1031504	202	0	0.0
Clostridiaceae	31979	family	4483183	62	0	0.0
Burkholderia	32008	genus	8293702	1	0	0.0
Parvimonas micra	33033	species	3288872	224	0	2.62618e-06
Lactobacillus johnsonii	33959	species	1907846	1	0	0
Citrobacter amalonaticus	35703	species	5875351	7	0	2.18686e-156
Xenorhabdus bovienii	40576	species	4225498	1	0	0.0
Salmonella enterica subsp. arizonae serovar 62:z4,z23:-	41514	leaf	4600800	10	0	1.57604e-06
Polynucleobacter	44013	genus	1859979	1	0	0.0
Salmonella enterica subsp. enterica serovar Give	46626	leaf	9538123	13	1	1.45692e-39
Borrelia miyamotoi	47466	species	937966	1	1	0.0
Acinetobacter pittii	48296	species	3862530	3	0	0.0
Raoultella ornithinolytica	54291	species	5398151	1	0	9.98405e-171
Salmonella enterica subsp. enterica serovar Paratyphi A	54388	leaf	13799394	10	0	7.35139e-07
Salmonella bongori	54736	species	4524275	1	0	0.0
Enterobacteria phage SfV	55884	species	37074	36	1	0.0299255
Citrobacter braakii	57706	species	10079064	2	0	2.40674e-190
Salmonella enterica subsp. enterica serovar Weltevreden	57743	leaf	20446954	41	3	3.27512e-06
Salmonella enterica subsp. houtenae serovar Houten	58100	leaf	4624613	13	4	3.00711e-222
Salmonella enterica subsp. enterica serovar Waycross	58101	leaf	4812886	7	3	1.4054e-05
Salmonella enterica subsp. enterica serovar Anatum	58712	leaf	19533469	9	6	1.96197e-06
Salmonella enterica subsp. enterica	59201	subspecies	142069846	512	52	2.5568e-06
Salmonella enterica subsp. salamae	59202	subspecies	10002039	14	1	1.39518e-07
Salmonella enterica subsp. diarizonae	59204	subspecies	24824988	25	0	3.43023e-07
Enterobacter asburiae	61645	species	4787018	107	68	1.69555e-05
Lelliottia amnigena	61646	species	9085730	1	0	0.0
Pluralibacter gergoviae	61647	species	10897762	10	2	1.06024e-288
Shigella phage SfII	66284	species	41475	12	0	2.89057e-62
Edwardsiella ictaluri	67780	species	3812301	2	0	5.14609e-294
Citrobacter farmeri	67824	species	5715629	3	0	2.50779e-149
Citrobacter werkmanii	67827	species	15089488	12	1	4.24264e-07
Lelliottia nimipressuralis	69220	species	4826854	3	0	8.32463e-239
Caulobacter mirabilis	69666	species	4577265	1	0	0.0
Klebsiella pneumoniae subsp. pneumoniae	72407	subspecies	172715673	1	0	3.16805e-06
Dechloromonas	73029	genus	4501104	1	0	0.0
Paraburkholderia caribensis	75105	species	9482704	1	0	0.0
Erwinia pyrifoliae	79967	species	4072846	2	0	0.0
Comamonadaceae	80864	family	5402391	1	0	0.0
Serratia plymuthica	82996	species	5447150	1	0	0.0
gamma proteobacterium HdN1	83406	species	4587455	3	0	0
Leclercia adecarboxylata	83655	species	4803917	6	0	1.83943e-235
Propionibacteriales	85009	order	3144263	1	0	0.0
Neisseria elongata subsp. glycolytica	88719	subspecies	2249415	11	0	2.42028e-270
Salmonella enterica subsp. enterica serovar Saintpaul	90105	leaf	29368410	14	5	1.62501e-06
Salmonella enterica subsp. enterica serovar Typhi	90370	leaf	505801019	15	6	5.56289e-06
Salmonella enterica subsp. enterica serovar Typhimurium	90371	leaf	150109640	1740	199	6.42739e-06
Staphylococcaceae	90964	family	4837607	28	0	0.0
Bacilli	91061	class	3878588	29	0	0.0
Enterobacterales	91347	order	8015187	379	0	0.0
Edwardsiella hoshinae	93378	species	3811650	2	0	0.0
Shewanella sp. ANA-3	94122	species	5251146	26	0	1.66918e-294
Salmonella enterica subsp. enterica serovar Dublin	98360	leaf	35415966	9	4	2.36999e-07
Escherichia virus Wphi	103216	species	32684	1	0	4.33702e-107
Ralstonia mannitolilytica	105219	species	9915295	4	4	1.6191e-05
Cupriavidus necator	106590	species	7948767	1	0	0.0
Salmonella enterica subsp. enterica serovar Newport	108619	leaf	24036368	16	2	8.43871e-07
Salmonella enterica subsp. enterica serovar Montevideo	115981	leaf	4694373	1	0	3.64752e-19
Salmonella enterica subsp. enterica serovar Choleraesuis	119912	leaf	4751585	12	1	3.7826e-19
Neisseria meningitidis MC58	122586	leaf	2272360	52	1	2.02161e-271
Neisseria meningitidis Z2491	122587	leaf	2184406	79	6	1.48564e-160
Providencia alcalifaciens	126385	species	8033032	2	1	0.0
Erysipelotrichaceae	128827	family	1770425	309	0	0.0
Pseudomonas amygdali pv. morsprunorum	129138	leaf	6445963	1	0	0.0
Citrobacter youngae	133448	species	4945156	2	0	4.84332e-148
Salmonella enterica subsp. enterica serovar Bredeney	134047	leaf	4627083	1	0	3.37007e-218
Vibrionales	135623	order	5361384	2	0	0.0
P2virus	140410	genus	0	3	0	0.0
Salmonella enterica subsp. enterica serovar Tennessee	143221	leaf	24316845	4	0	3.09728e-07
Salmonella enterica subsp. enterica serovar Braenderup	149391	leaf	4734880	7	6	7.85504e-06
Salmonella enterica subsp. enterica serovar Enteritidis	149539	leaf	208834451	332	96	1.33746e-06
Cedecea neteri	158822	species	19970488	2	0	0.0
Enterobacter hormaechei	158836	species	11512864	26	0	0
Salmonella phage ST64B	175950	species	40149	55	0	6.88816e-15
Clostridia	186801	class	3819022	1	0	0.0
Clostridiales	186802	order	4169569	358	0	0.0
Lachnospiraceae	186803	family	3982220	1	0	0.0
Peptostreptococcaceae	186804	family	4343449	53	0	0.0
Bacillaceae	186817	family	5737603	18	0	0.0
Lactobacillales	186826	order	2681416	394	0	0.0
Thalassolituus oleivorans	187493	species	3842190	1	1	0.0
Ralstonia insidiosa	190721	species	12164766	1	1	2.31067e-116
Salmonella enterica subsp. enterica serovar Stanley	192953	leaf	4791042	5	3	2.04856e-05
Salmonella enterica subsp. enterica serovar Mbandaka	192954	leaf	9505961	16	13	0.0
Salmonella enterica subsp. enterica serovar Kentucky	192955	leaf	4900326	11	9	1.05424e-05
Haemophilus aegyptius	197575	species	1993258	2	0	3.85833e-257
Shigella flexneri 2a str. 301	198214	leaf	4828820	10	1	2.99656e-06
Fusobacteriia	203490	class	2917471	21	0	0.0
Fusobacteriaceae	203492	family	2924149	1	0	0.0
Dickeya zeae	204042	species	4675379	1	0	0.0
Neisseriales	206351	order	2372285	4	0	0.0
Kosakonia cowanii	208223	species	4857324	1	0	0.0
Streptococcus agalactiae 2603V/R	208435	leaf	2160267	44	44	0.0
Escherichia albertii	208962	species	4701875	117	3	7.77836e-06
Erwinia sp. Ejp617	215689	species	3957675	4	1	0.0
Salmonella bongori NCTC 12419	218493	leaf	4460105	34	0	1.3864e-214
Oceanobacillus iheyensis HTE831	221109	leaf	3630528	1	1	0.0
Mycobacterium chimaera	222805	species	49908161	4	3	0.0
Salmonella enterica subsp. enterica serovar Java	224729	leaf	4756780	5	2	6.45567e-06
Shewanella piezotolerans WP3	225849	leaf	5396476	1	0	0.0
Yersinia virus L413C	227940	species	30728	10	0	1.47361e-67
Neisseria gonorrhoeae FA 1090	242231	leaf	2153922	26669	2963	0.00123887
Klebsiella variicola	244366	species	5458505	2	0	2.6416e-06
Haemophilus pittmaniae	249188	species	2181355	14	0	2.42861e-261
Microbulbifer thermotolerans	252514	species	3938396	1	1	0.0
Aeromonas virus 65	260149	species	235229	1	1	0.0
Salmonella enterica subsp. enterica serovar Aberdeen	260367	leaf	4644636	7	3	2.19987e-18
Buchnera aphidicola (Cinara tujafilina)	261317	leaf	444925	1	0	0.0
Haemophilus influenzae R2846	262727	leaf	1819370	2	0	0.0
Pseudomonas savastanoi pv. phaseolicola 1448A	264730	leaf	6112448	1	0	0.0
Klebsiella pneumoniae subsp. pneumoniae MGH 78578	272620	leaf	5694894	2	0	4.46383e-110
Mycoplasma penetrans HF-2	272633	leaf	1358633	1	0	0.0
Neisseria meningitidis FAM18	272831	leaf	2194961	39	0	2.588e-258
Pasteurella multocida subsp. multocida str. Pm70	272843	leaf	2257487	1	0	0.0
Kosakonia radicincitans	283686	species	6122453	2	0	6.30246e-252
Salmonella enterica subsp. enterica serovar Indiana	286783	leaf	5119391	11	0	2.75978e-233
Citrobacter koseri ATCC BAA-895	290338	leaf	4735357	6	1	7.46495e-147
Salmonella enterica subsp. enterica serovar Paratyphi A str. ATCC 9150	295319	leaf	4585229	1	0	1.60544e-17
Salmonella enterica subsp. salamae serovar Greenside	297361	leaf	4732250	6	2	3.0818e-06
Enterobacter hormaechei subsp. steigerwaltii	299766	subspecies	20496016	1	0	4.92695e-243
Enterobacter ludwigii	299767	species	4952770	1	0	0.0
Enterobacter hormaechei subsp. oharae	301102	subspecies	14941448	1	0	9.39956e-223
Enterobacter hormaechei subsp. hormaechei	301105	subspecies	5063734	1	0	1.43941e-157
Yangia pacifica	311180	species	5165968	1	1	0.0
Streptomyces peucetius subsp. caesius ATCC 27952	316280	leaf	8023114	1	1	0.0
Escherichia coli ETEC H10407	316401	leaf	5325888	15	0	2.266e-176
Shewanella putrefaciens CN-32	319224	leaf	4659220	25	0	9.40047e-283
Salmonella enterica subsp. enterica serovar Choleraesuis str. SC-B67	321314	leaf	4944000	16	4	6.97787e-07
Xanthomonas vasicola pv. vasculorum	325776	leaf	4909766	1	0	0.0
Neisseria zoodegmatis	326523	species	2552522	2	0	1.26199e-280
Escherichia coli O139:H28 str. E24377A	331111	leaf	5249288	1	0	2.25769e-231
Salmonella enterica subsp. enterica serovar Cerro	340188	leaf	4602439	6	0	3.82394e-43
Salmonella enterica subsp. enterica serovar Manhattan	340189	leaf	4802602	7	1	3.24528e-06
Zobellella denitrificans	347534	species	4174222	1	1	0.0
Xenorhabdus doucetiae	351671	species	4203651	1	0	0.0
Neisseria meningitidis 053442	374833	leaf	2153416	299	9	1.782e-06
Cupriavidus necator H16	381666	leaf	7416678	1	0	0.0
Yersinia pestis Pestoides F	386656	leaf	9454180	1	1	0.0
Shewanella woodyi ATCC 51908	392500	leaf	5935403	1	0	0.0
Shewanella pealeana ATCC 700345	398579	leaf	5174581	1	0	0.0
Enterobacter sp. 638	399742	species	4676461	1	0	0.0
Ralstonia pickettii 12J	402626	leaf	5325729	16	12	0.00014369
Escherichia coli APEC O1	405955	leaf	5497653	1	0	1.43758e-234
Cronobacter	413496	genus	4479995	1	0	0.0
Enterobacteria phage cdtI	414970	species	47021	2	0	0.000623134
Methylobacterium sp. 4-46	426117	species	7737025	1	1	0.0
Ralstonia pickettii 12D	428406	leaf	5685358	14	10	4.81149e-05
Mycobacterium avium subsp. hominissuis	439334	subspecies	31569362	1	0	0.0
Salmonella enterica subsp. enterica serovar Schwarzengrund str. CVM19633	439843	leaf	4823887	379	206	0.00351093
Salmonella enterica subsp. enterica serovar Dublin str. CT_02021853	439851	leaf	4917459	1	1	8.67263e-08
Escherichia coli SMS-3-5	439855	leaf	5215377	1	0	4.34809e-226
Phytobacter	447792	genus	0	8	0	0.0
Salmonella enterica subsp. enterica serovar Agona str. SL483	454166	leaf	4836638	6	0	4.44322e-17
Actinoplanes teichomyceticus ATCC 31121	457423	leaf	8287152	1	1	0.0
Shewanella halifaxensis HAW-EB4	458817	leaf	5226917	1	0	0.0
Steroidobacter denitrificans	465721	species	3467246	1	1	0.0
Erwinia tasmaniensis Et1/99	465817	leaf	4067864	1	1	0.0
Steroidobacter	469322	genus	0	1	0	0.0
Salmonella enterica subsp. enterica serovar Paratyphi C str. RKS4594	476213	leaf	4888494	17	8	2.20523e-05
Methylacidiphilum infernorum V4	481448	leaf	2287145	1	1	0.0
Escherichia coli ATCC 8739	481805	leaf	9493136	2	0	0.0
Salmonella enterica subsp. enterica serovar Concord	483687	leaf	5277621	9	0	4.20423e-236
Neisseria lactamica 020-06	489653	leaf	2220606	1048	39	5.22149e-51
Kosakonia oryzae	497725	species	5303342	1	0	0.0
Haliangium ochraceum DSM 14365	502025	leaf	9446314	1	1	0.0
Streptococcus pneumoniae G54	512566	leaf	2078953	4	0	0.0
Streptococcus pneumoniae CGSP14	516950	leaf	2209198	60	56	0.000154998
Neisseria gonorrhoeae NCCP11945	521006	leaf	2236178	32708	2724	0.00159644
Erysipelotrichales	526525	order	1770425	20	0	0.0
Neisseria gonorrhoeae MS11	528354	leaf	2237793	74305	13130	0.0237217
Variovorax paradoxus S110	543728	leaf	6754997	1	0	0.0
Neisseria elongata subsp. glycolytica ATCC 29315	546263	leaf	2256647	11	0	1.53236e-270
Salmonella enterica subsp. enterica serovar Gallinarum str. 287/91	550538	leaf	4658697	4	0	0
Salmonella enterica subsp. enterica serovar Paratyphi A str. AKU_12601	554290	leaf	4581797	1	0	1.76878e-06
Salmonella enterica subsp. enterica serovar Typhimurium str. D23580	568708	leaf	4879400	2	0	0.0
Salmonella enterica subsp. enterica serovar Typhimurium str. DT2	568709	leaf	4908645	6	6	1.477e-06
Streptococcus suis BM407	568814	leaf	2170808	3	0	0.0
Polynucleobacter necessarius	576610	species	1560469	1	0	0.0
Hirschia baltica ATCC 49814	582402	leaf	3540114	1	1	0.0
Escherichia fergusonii ATCC 35469	585054	leaf	4643861	6	2	3.0043e-211
Escherichia coli IAI39	585057	leaf	5132068	1	1	1.24663e-06
Escherichia coli O103:H2 str. 12009	585395	leaf	5524860	1	0	0.0
Escherichia coli O111:H- str. 11128	585396	leaf	5766081	5	0	2.26703e-15
Salmonella enterica subsp. enterica serovar Typhimurium str. 14028S	588858	leaf	4964097	2	2	0.0
Dickeya zeae Ech586	590409	leaf	4818394	1	0	0.0
Salmonella enterica subsp. enterica serovar Corvallis	593905	leaf	5359100	7	5	4.97166e-06
Neisseria meningitidis 8013	604162	leaf	2277550	147	8	2.61573e-132
Neisseria meningitidis alpha710	630588	leaf	2242947	255	2	4.47766e-161
Erwinia pyrifoliae Ep1/96	634499	leaf	4072846	2	1	0.0
Erwinia billingiae Eb661	634500	leaf	5372268	1	0	0.0
Citrobacter rodentium ICC168	637910	leaf	5444283	4	2	0.0
Simonsiella muelleri ATCC 29453	641147	leaf	2469862	63	62	0.0
Neisseria sp. KEM232	655307	species	2371912	3	0	5.64572e-275
Neisseria meningitidis alpha14	662598	leaf	2145295	298	8	1.19674e-06
Erwinia amylovora CFBP1430	665029	leaf	3833832	2	0	0.0
Edwardsiella anguillarum ET080813	667120	leaf	4329652	1	1	0.0
Phaeobacter sp. LSS9	681157	species	4038237	1	0	0.0
Salmonella enterica subsp. enterica serovar Gallinarum str. 9184	685040	leaf	4609911	4	0	6.46646e-06
Salmonella enterica subsp. enterica serovar Dublin str. ATCC 39184	687860	leaf	4917142	10	7	1.89126e-06
Cronobacter turicensis z3032	693216	leaf	4599092	3	0	0.0
Enterobacteriaceae bacterium strain FGI 57	693444	species	4762179	2	0	1.991e-237
Pseudomonas savastanoi pv. savastanoi NCPPB 3335	693985	leaf	6016828	1	0	0.0
Escherichia coli UMNK88	696406	leaf	5666764	8	3	6.22856e-158
Vibrio owensii	696485	species	24994462	3	3	0.0
Salmonella enterica subsp. enterica serovar Enteritidis str. 18569	696867	leaf	4745329	1	1	1.90085e-07
Salmonella enterica subsp. enterica serovar Saintpaul str. SARA26	702982	leaf	4686793	12	5	9.86383e-06
Mycoplasma gallisepticum str. F	708616	leaf	977612	1	0	0.0
Thioalkalivibrio paradoxus ARh 1	713585	leaf	3756729	1	1	0.0
Escherichia coli IHE3034	714962	leaf	5108383	2	0	1.51299e-179
Enterobacter cloacae subsp. cloacae ATCC 13047	716541	leaf	5598796	4	1	2.21723e-162
Salmonella enterica subsp. enterica serovar Typhimurium str. T000240	718274	leaf	5069994	2	2	9.00009e-06
Pseudomonas fulva 12-X	743720	leaf	4920769	1	0	0.0
Salmonella enterica subsp. enterica serovar Montevideo str. 531954	745022	leaf	4694397	1	0	0.0
Pseudogulbenkiania sp. NH8B	748280	species	4332995	1	0	0.0
Thiocystis violascens DSM 198	765911	leaf	5017071	1	0	0.0
Salmonella enterica subsp. enterica serovar Newport str. CVM 22425	796730	leaf	4991133	9	4	1.63211e-16
Salmonella enterica subsp. enterica serovar Newport str. CVM 21538	796731	leaf	4875940	13	5	4.26267e-06
Salmonella enterica subsp. enterica serovar Newport str. CVM 22513	796732	leaf	4951115	6	0	0.0
Salmonella enterica subsp. enterica serovar Montevideo str. 507440-20	859199	leaf	4694375	2	1	0.0
Streptococcus anginosus C238	862971	leaf	2233640	25	0	0.0
Escherichia coli DSM 30083 = JCM 1649 = ATCC 11775	866789	leaf	5034833	1	0	0.0
Escherichia coli UM146	869729	leaf	5107563	1	0	0.0
Neisseria meningitidis H44/76	909420	leaf	2240883	37	0	3.31275e-269
Negativicutes	909932	class	2939259	1	0	0.0
Salmonella enterica subsp. enterica serovar Gaminara	913070	leaf	5030148	3	1	3.48138e-40
Gibbsiella quercinecans	929813	species	5548506	1	0	0.0
Escherichia coli O157:H16	930406	leaf	5104557	1	0	2.98159e-33
Salmonella enterica subsp. enterica serovar Newport str. Levine 1	930778	leaf	4841916	16	3	8.37331e-06
Salmonella enterica subsp. enterica serovar Newport str. Levine 15	930779	leaf	4883715	14	6	1.97168e-06
Salmonella enterica subsp. enterica serovar Bardo	932733	leaf	4849139	17	1	3.50089e-06
Klebsiella aerogenes EA1509E	935296	leaf	5591105	5	0	6.81787e-106
Neisseria meningitidis M01-240355	935588	leaf	2287777	203	9	1.3041e-06
Neisseria meningitidis NZ-05/33	935589	leaf	2248966	103	0	7.87806e-106
Neisseria meningitidis M0579	935590	leaf	2324822	222	22	2.38605e-06
Neisseria meningitidis M01-240149	935591	leaf	2223518	96	2	2.34419e-124
Neisseria meningitidis M04-240196	935593	leaf	2250449	207	4	2.19424e-188
Neisseria meningitidis G2136	935599	leaf	2184862	77	2	8.35731e-263
Salmonella enterica subsp. enterica serovar Thompson str. ATCC 8391	935705	leaf	4690430	1	0	0.0
Haemophilus influenzae F3047	935897	leaf	2007018	3	1	1.45013e-257
Salmonella enterica subsp. enterica serovar Sloterdijk str. ATCC 15791	938141	leaf	4817791	5	2	1.37061e-06
Salmonella enterica subsp. enterica serovar Choleraesuis str. ATCC 10708	938142	leaf	4801679	11	1	3.92867e-06
Salmonella enterica subsp. enterica serovar Rubislaw str. ATCC 10717	938143	leaf	4769795	3	1	1.52009e-06
Salmonella enterica subsp. enterica serovar Inverness str. ATCC 10720	941187	leaf	4989883	13	5	4.76164e-06
Salmonella enterica subsp. enterica serovar Pomona str. ATCC 10729	941188	leaf	4678025	4	1	5.49318e-06
Salmonella enterica subsp. enterica serovar Paratyphi A str. ATCC 11511	941189	leaf	4580689	8	0	7.02371e-06
Salmonella enterica subsp. enterica serovar Chester str. ATCC 11997	941190	leaf	4660922	13	6	4.57292e-06
Escherichia coli O25b:H4	941280	leaf	5483091	1	0	2.1734e-203
Neisseria meningitidis WUE 2594	942513	leaf	2227255	225	25	1.28777e-90
Glaciecola sp. 4H-3-7+YE-5	983545	species	5393591	3	3	0.0
Salmonella enterica subsp. enterica serovar Mbandaka str. ATCC 51958	984237	leaf	4905181	12	7	7.7858e-06
Salmonella enterica subsp. enterica serovar Typhimurium str. UK-1	990282	leaf	4911145	1	0	4.46757e-232
Salmonella enterica subsp. enterica serovar Typhimurium str. L-3553	996633	leaf	5184452	141	7	3.11019e-05
Salmonella enterica subsp. enterica serovar Oranienburg str. 0250	997333	leaf	4648879	6	0	0
Salmonella enterica subsp. enterica serovar Newport str. WA_14882	997339	leaf	4712541	8	0	4.9778e-06
Salmonella enterica subsp. enterica serovar Enteritidis str. RM2968	998822	leaf	4792035	4	0	1.62219e-42
Escherichia coli PCN033	1001989	leaf	5156873	2	0	2.24241e-230
Salmonella enterica subsp. enterica serovar Tennessee str. TXSC_TXSC08-19	1003191	leaf	4864410	1	1	6.87138e-233
Salmonella enterica subsp. enterica serovar Typhimurium str. 798	1008297	leaf	4970096	25	20	8.72954e-06
Salmonella enterica subsp. enterica serovar Paratyphi B str. SPB7	1016998	leaf	4858887	12	10	7.7648e-06
Salmonella enterica subsp. enterica serovar Typhimurium str. SARA13	1029978	leaf	4913633	18	6	6.73596e-06
Salmonella enterica subsp. enterica serovar Pullorum str. ATCC 9120	1029979	leaf	4781492	9	1	0
Salmonella enterica subsp. enterica serovar Abony str. 0014	1029983	leaf	4737447	10	8	6.15853e-06
Salmonella enterica subsp. enterica serovar Heidelberg str. SARA35	1029997	leaf	4751206	17	5	5.92764e-24
Cupriavidus necator N-1	1042878	leaf	8480857	1	0	0.0
Sulfuritalea	1054211	genus	3802648	1	0	0.0
Streptococcus pseudopneumoniae IS7493	1054460	leaf	2195458	24	2	9.38481e-17
Escherichia coli O91 str. RM7190	1055545	leaf	5030336	1	0	1.35917e-179
Salmonella enterica subsp. enterica serovar Thompson str. RM6836	1064551	leaf	4707648	6	0	7.281e-230
Salmonella enterica subsp. enterica serovar Agona str. 392869-2	1072590	leaf	4798530	7	1	6.57714e-06
Cronobacter condimenti 1330	1073999	leaf	4499482	1	1	0.0
Cronobacter universalis NCTC 9529	1074000	leaf	4436873	2	0	0.0
Pantoea rwandensis	1076550	species	4327607	2	1	0.0
Salmonella enterica subsp. enterica serovar Fresno	1077085	leaf	4822167	12	5	1.40621e-05
Streptococcus oralis subsp. tigurinus	1077464	subspecies	1889005	73	0	0.000281494
Dickeya solani	1089444	species	4920704	1	1	0.0
Neisseria meningitidis M7124	1095685	leaf	2179483	1	1	0.0
Enterobacter cloacae subsp. dissolvens SDM	1104326	leaf	4968248	2	2	0.0
Salmonella enterica subsp. enterica serovar Agona str. 460004 2-1	1124917	leaf	4797171	6	0	3.17195e-18
Salmonella enterica subsp. enterica serovar Heidelberg str. 41578	1124936	leaf	4951478	151	3	0.000491049
Salmonella enterica subsp. enterica serovar Minnesota str. ATCC 49284	1124956	leaf	4592393	4	4	1.30992e-06
Salmonella enterica subsp. enterica serovar Muenster str. 0315	1124958	leaf	4972820	5	0	6.15928e-42
Salmonella enterica subsp. enterica serovar Muenster str. 420	1124959	leaf	4756014	5	0	2.55001e-06
Salmonella enterica subsp. enterica serovar Panama str. ATCC 7378	1124961	leaf	4555576	3	1	1.1423e-06
Salmonella enterica subsp. enterica serovar Poona str. ATCC BAA-1673	1124962	leaf	5091833	125	1	0.000186786
Klebsiella pneumoniae subsp. pneumoniae HS11286	1125630	leaf	5682322	3	3	0.0
Salmonella enterica subsp. enterica serovar Nitra	1129117	leaf	4691807	8	6	3.82785e-06
Klebsiella michiganensis	1134687	species	6150064	13	0	1.52562e-81
Salmonella phage SPN3UB	1147140	species	47355	22	0	2.71314e-60
Enterobacteria phage mEp460	1147152	species	44510	2	0	7.18504e-15
Kosakonia sacchari	1158459	species	4902027	2	0	9.71456e-240
Cronobacter dublinensis subsp. dublinensis LMG 23823	1159554	leaf	4628405	1	1	3.28097e-232
Salmonella enterica subsp. enterica serovar Heidelberg str. B182	1160717	leaf	4788046	28	24	7.62083e-06
Enterobacter sp. R4-368	1166130	species	5155034	3	0	0.0
Salmonella enterica subsp. enterica serovar Typhimurium str. U288	1171376	leaf	5017059	4	1	1.78502e-06
Salmonella enterica subsp. enterica serovar Bareilly str. CFSAN000189	1173427	leaf	4808805	5	1	8.15161e-06
Salmonella enterica subsp. enterica serovar Bareilly str. CFSAN000191	1173457	leaf	4723270	2	0	1.7449e-18
Salmonella phage FSL SP-004	1173769	species	29742	2	0	1.30551e-84
Salmonella enterica subsp. enterica serovar Albany str. ATCC 51960	1173798	leaf	4805448	2	2	3.09097e-06
Salmonella enterica subsp. enterica serovar Weltevreden str. 1655	1173939	leaf	5129059	11	2	2.68491e-07
Kosakonia radicincitans DSM 16656	1177180	leaf	6122453	4	2	1.99816e-253
Klebsiella michiganensis E718	1191061	leaf	6561678	3	0	1.01576e-119
Klebsiella pneumoniae subsp. pneumoniae 1084	1193292	leaf	5386705	2	1	7.15069e-06
Gilliamella	1193503	genus	0	1	0	0.0
Salmonella enterica subsp. enterica serovar Bredeney str. CFSAN001080	1194154	leaf	4603849	3	0	8.15292e-06
Salmonella enterica subsp. enterica serovar Stanleyville str. CFSAN000624	1194159	leaf	5102976	6	5	1.33707e-06
Gilliamella apicola	1196095	species	3139412	1	0	0.0
Salmonella bongori N268-08	1197719	leaf	4773537	61	1	2.24792e-209
Salmonella enterica subsp. enterica serovar Abaetetuba str. ATCC 35640	1208611	leaf	4547600	5	1	2.34019e-18
Enterobacter cloacae subsp. cloacae ENHKU01	1211025	leaf	4726582	1	1	0.0
Salmonella enterica subsp. enterica serovar Gallinarum/pullorum str. CDC1983-67	1225522	leaf	4623089	5	0	9.40795e-07
Enterobacteria phage SfI	1225789	species	38389	5	0	0.000289501
Haemophilus influenzae 2019	1232659	leaf	1969659	1	0	4.92991e-257
Sodalis praecaptivus	1239307	species	5159425	3	0	0.0
Orbaceae	1240483	family	0	26	0	0.0
Salmonella enterica subsp. enterica serovar Bergen str. ST350	1240708	leaf	4801835	9	4	7.04975e-06
Salmonella enterica subsp. enterica serovar Antsalova str. S01-0511	1242087	leaf	4648086	3	0	4.01493e-06
Salmonella enterica subsp. enterica serovar Apapa str. SA20060561	1242088	leaf	4801658	7	4	5.96632e-06
Salmonella enterica subsp. enterica serovar Borreze str. SA20041063	1242089	leaf	4777558	7	1	4.58942e-18
Salmonella enterica subsp. enterica serovar Crossness str. 1422-74	1242090	leaf	4847468	6	0	1.41517e-06
Salmonella enterica subsp. enterica serovar Djakarta str. S-1087	1242091	leaf	4668861	12	9	8.55991e-06
Salmonella enterica subsp. enterica serovar Gaminara str. SA20063285	1242094	leaf	4957986	1	0	1.37683e-06
Salmonella enterica subsp. enterica serovar Hillingdon str. N1529-D3	1242096	leaf	4618056	6	4	7.11181e-06
Salmonella enterica subsp. enterica serovar Hvittingfoss str. SA20014981	1242097	leaf	4940239	19	5	8.35174e-06
Salmonella enterica subsp. enterica serovar Johannesburg str. ST203	1242101	leaf	4651794	5	2	3.57591e-06
Salmonella enterica subsp. enterica serovar Kentucky str. SA20030505	1242102	leaf	4850980	6	1	1.55479e-06
Salmonella enterica subsp. enterica serovar Koessen str. S-1501	1242105	leaf	4566169	3	1	1.24682e-13
Salmonella enterica subsp. enterica serovar Krefeld str. SA20030536	1242106	leaf	4942273	13	7	5.82889e-06
Salmonella enterica subsp. enterica serovar Macclesfield str. S-1643	1242107	leaf	5268613	33	22	1.47455e-05
Salmonella enterica subsp. enterica serovar Manchester str. ST278	1242108	leaf	4532753	13	7	7.32428e-06
Salmonella enterica subsp. enterica serovar Milwaukee str. SA19950795	1243578	leaf	5102439	8	1	2.50267e-06
Salmonella enterica subsp. enterica serovar Moscow str. S-1843	1243579	leaf	4690402	14	13	2.27334e-06
Salmonella enterica subsp. enterica serovar Onderstepoort str. SA20060086	1243584	leaf	5005424	3	1	3.07115e-06
Salmonella enterica subsp. enterica serovar Ouakam str. SA20034636	1243586	leaf	4874915	8	5	8.2157e-06
Salmonella enterica subsp. enterica serovar Quebec str. S-1267	1243591	leaf	4645312	13	1	6.76078e-19
Salmonella enterica subsp. enterica serovar Wandsworth str. SA20092095	1243595	leaf	4916040	11	10	1.59811e-05
Salmonella enterica subsp. enterica serovar Yovokome str. S-1850	1243600	leaf	4640929	6	1	1.07099e-23
Salmonella enterica subsp. salamae serovar 55:k:z39 str. 1315K	1243602	leaf	5051440	15	8	1.51959e-06
Salmonella enterica subsp. diarizonae serovar 50:k:z str. MZ0080	1243612	leaf	5076950	4	0	0.0
Salmonella enterica subsp. diarizonae serovar 65:c:z str. SA20044251	1243616	leaf	5066092	5	2	8.08658e-215
Salmonella bongori serovar 66:z41:- str. SA19983605	1243617	leaf	4468959	34	2	1.04713e-214
Salmonella enterica subsp. enterica serovar Enteritidis str. EC20110354	1243619	leaf	4711160	2	0	0.0
Escherichia coli O145:H28 str. RM12761	1248903	leaf	5559014	1	0	1.8362e-234
Escherichia coli O145:H28 str. RM13516	1248915	leaf	5559008	1	0	1.83648e-234
Burkholderia thailandensis H0587	1249663	leaf	6768375	1	1	0.0
Thioalkalivibrio nitratireducens DSM 14787	1255043	leaf	4002350	1	0	0.0
Citrobacter amalonaticus Y19	1261127	leaf	5875351	1	0	8.01924e-159
Frischella perrara	1267021	species	2692351	1	0	0.0
Salmonella enterica subsp. enterica serovar Javiana str. CFSAN001992	1267753	leaf	4675267	1	0	2.53832e-06
Salmonella enterica subsp. enterica serovar Typhimurium var. 5- str. CFSAN001921	1271862	leaf	5089224	10	1	1.3407e-06
Salmonella enterica subsp. enterica serovar Cubana str. CFSAN002050	1271863	leaf	5267011	27	7	1.70829e-05
Escherichia coli APEC O78	1274814	leaf	4798435	12	1	1.21165e-05
Haemophilus influenzae CGSHiCZ412602	1295140	leaf	1811802	2	0	0.0
Enterobacter hormaechei subsp. xiangfangensis	1296536	subspecies	20054814	1	0	0.0
Kosakonia cowanii JCM 10956 = DSM 18146	1300165	leaf	4857324	2	1	2.14025e-239
Isoptericola dokdonensis DS-3	1300344	leaf	3826972	1	1	0.0
Klebsiella michiganensis HKOPL1	1308980	leaf	5914407	3	0	0.0
Serratia sp. FS14	1327989	species	5249875	2	0	0.0
Escherichia coli APEC IMT5155	1329907	leaf	5126057	2	2	1.0856e-221
Citrobacter freundii CFNIH1	1333848	leaf	5371331	2	0	5.03623e-64
[Enterobacter] lignolyticus	1334193	species	4814049	1	0	7.02867e-238
Bacillus megaterium NBRC 15308 = ATCC 14581	1348623	leaf	5746640	1	1	0.0
Serratia plymuthica S13	1348660	leaf	5467306	1	0	0.0
Enterobacter cloacae P101	1354030	leaf	5369929	1	0	0.0
Xenorhabdus poinarii G6	1354304	leaf	3659523	1	0	0.0
Enterobacteria phage fiAA91-ss	1357825	species	33628	1	0	6.1959e-94
Escherichia coli PCN061	1358422	leaf	4901825	713	115	7.97922e-120
Salmonella bongori serovar 48:z41:-- str. RKS3044	1382510	leaf	4394500	36	1	3.13722e-213
Neisseria meningitidis LNP21362	1386087	leaf	2139957	33	0	1.33202e-267
Salmonella enterica subsp. arizonae serovar 62:z36:- str. RKS2983	1386967	leaf	4574846	7	0	0.0
Salmonella enterica subsp. enterica serovar Agona str. 24249	1406860	leaf	4762840	7	1	3.83585e-18
Shigella phage SfIV	1407493	species	39758	46	0	0.00603604
Salmonella enterica subsp. enterica serovar Cerro str. CFSAN001588	1410916	leaf	4768236	11	3	8.28565e-06
Salmonella enterica subsp. enterica serovar Enteritidis str. SA19992322	1412452	leaf	4685849	1	0	0.0
Salmonella enterica subsp. enterica serovar Enteritidis str. EC20090641	1412453	leaf	4712309	2	0	0.0
Salmonella enterica subsp. enterica serovar Enteritidis str. EC20120008	1412470	leaf	4711924	1	1	0.0
Dickeya zeae EC1	1427366	leaf	4532364	1	0	0.0
Methylocaldum marinum	1432792	species	6088916	1	1	0.0
Escherichia albertii KF1	1440052	leaf	4701875	12	0	3.89126e-06
Escherichia coli str. Sanji	1441627	leaf	5428586	1	0	4.05902e-233
Chania multitudinisentens RB-25	1441930	leaf	5488183	1	0	0.0
Yersinia enterocolitica LC20	1443113	leaf	4850874	2	1	0.0
Escherichia coli O169:H41	1446701	leaf	10379449	2	0	3.49329e-175
Escherichia coli O25:NM	1446707	leaf	5042926	1	0	5.77616e-202
Salmonella enterica subsp. enterica serovar Anatum str. USDA-ARS-USMARC-1783	1454583	leaf	4804699	3	3	0.0
Salmonella enterica subsp. enterica serovar Anatum str. USDA-ARS-USMARC-1727	1454584	leaf	4980540	54	1	4.18663e-15
Salmonella enterica subsp. enterica serovar Anatum str. USDA-ARS-USMARC-1735	1454585	leaf	4945533	10	0	3.58859e-58
Salmonella enterica subsp. enterica serovar Anatum str. USDA-ARS-USMARC-1736	1454586	leaf	4864598	10	1	7.77013e-58
Salmonella enterica subsp. enterica serovar Anatum str. USDA-ARS-USMARC-1676	1454587	leaf	4676958	102	1	2.5055e-05
Salmonella enterica subsp. enterica serovar Anatum str. USDA-ARS-USMARC-1677	1454588	leaf	4836393	3	0	5.17999e-06
Salmonella enterica subsp. enterica serovar Anatum str. USDA-ARS-USMARC-1728	1454589	leaf	4783492	4	1	1.17538e-40
Salmonella enterica subsp. enterica serovar Anatum str. USDA-ARS-USMARC-1175	1454590	leaf	4731596	2	2	3.20195e-34
Salmonella enterica subsp. enterica serovar Anatum str. USDA-ARS-USMARC-1765	1454593	leaf	4954715	54	0	2.47538e-15
Salmonella enterica subsp. enterica serovar Montevideo str. USDA-ARS-USMARC-1903	1454603	leaf	4565462	26	0	4.72863e-06
Salmonella enterica subsp. enterica serovar Montevideo str. CDC 2012K-1544	1454611	leaf	4726140	1	0	0.0
Salmonella enterica subsp. enterica serovar Montevideo str. CDC 2013K-0218	1454612	leaf	4655223	3	3	1.09947e-06
Salmonella enterica subsp. enterica serovar Montevideo str. CDC 2010K-0257	1454613	leaf	4814175	4	3	0
Salmonella enterica subsp. enterica serovar Newport str. USDA-ARS-USMARC-1927	1454620	leaf	4695514	6	0	6.21896e-21
Salmonella enterica subsp. enterica serovar Newport str. CDC 2010K-2159	1454627	leaf	4790388	8	4	4.95483e-06
Salmonella enterica subsp. enterica serovar Typhimurium str. USDA-ARS-USMARC-1808	1454630	leaf	5030908	5	0	0.0
Salmonella enterica subsp. enterica serovar Typhimurium str. USDA-ARS-USMARC-1880	1454634	leaf	4815208	9	3	1.77143e-06
Salmonella enterica subsp. enterica serovar Typhimurium str. USDA-ARS-USMARC-1896	1454636	leaf	5003736	54	34	2.74049e-06
Salmonella enterica subsp. enterica serovar Typhimurium str. USDA-ARS-USMARC-1898	1454638	leaf	5010079	8	2	4.39069e-160
Salmonella enterica subsp. enterica serovar Typhimurium str. USDA-ARS-USMARC-1899	1454639	leaf	4856438	5	5	1.05382e-05
Salmonella enterica subsp. enterica serovar Typhimurium str. CDC H2662	1454640	leaf	4978429	9	4	0.0
Salmonella enterica subsp. enterica serovar Typhimurium str. CDC 2010K-1587	1454641	leaf	5016195	8	0	1.36026e-06
Salmonella enterica subsp. enterica serovar Typhimurium str. CDC 2011K-0870	1454642	leaf	4769471	8	2	0
Salmonella enterica subsp. enterica serovar Typhimurium str. CDC 2011K-1702	1454643	leaf	5000337	5	0	0.0
Salmonella enterica subsp. enterica serovar Typhimurium str. CDC 2009K-1640	1454644	leaf	5027726	8	0	1.15398e-17
Salmonella enterica subsp. enterica serovar Typhimurium str. CDC 2009K-2059	1454645	leaf	4823793	3	0	0.0
Salmonella enterica subsp. enterica serovar Typhimurium str. USDA-ARS-USMARC-1810	1454647	leaf	4927145	186	36	0.000583415
Klebsiella quasipneumoniae	1463165	species	5528721	8	6	2.48185e-61
Escherichia marmotae	1499973	species	4896291	1	0	1.07152e-227
Woeseia oceani	1548547	species	4059891	1	0	0.0
Enterobacter sp. E20	1560339	species	4763114	1	0	1.36243e-154
Citrobacter pasteurii	1563222	species	4654874	3	0	4.22711e-145
Peptoniphilaceae	1570339	family	1992686	374	0	0.0
Phaeobacter piscinae	1580596	species	29607336	1	0	0.0
Candidatus Filomicrobium marinum	1608628	species	7939883	14	0	0.0
Pararhodospirillum	1612157	genus	3876289	1	0	0.0
Erwinia gerundensis	1619313	species	4481256	1	1	0.0
Aeromonas sp. ASNIH2	1636607	species	4864532	2	2	0.0
Escherichia phage pro147	1649239	species	32675	2	0	1.85044e-100
Escherichia phage pro483	1649240	species	29237	2	0	1.24124e-86
Enterobacter sp. FY-07	1692238	species	5138701	1	0	1.70972e-05
Citrobacter sp. FDAARGOS_156	1702170	species	4727498	3	0	3.7902e-144
Citrobacter sp. CRE-46	1703250	species	6081860	6	0	5.17663e-160
Salmonella enterica subsp. salamae serovar 57:z29:z42	1710356	leaf	4719375	13	2	8.18753e-06
Tissierellales	1737405	order	2364540	28	0	0.0
Streptomyces sp. 4F	1751294	species	8047771	1	1	0.0
Phytobacter sp. SCO41	1756993	species	5599325	3	0	0.0
Serratia sp. SSNIH1	1758196	species	5388594	1	0	7.83476e-213
Salmonella phage 118970_sal3	1813771	species	77375	277	0	2.66606e-26
Shigella sp. PAMC 28760	1813821	species	4558287	1	0	1.14112e-228
Enterobacter sp. ODB01	1827481	species	4534036	1	0	1.16473e-150
secondary endosymbiont of Trabutina mannipara	1835721	species	298471	1	1	0.0
Gordonibacter massiliensis	1841863	species	3948172	1	0	0.0
Rhodoferax koreense	1842727	species	5895641	1	1	0.0
Neisseria sp. 10022	1853276	species	2511904	5	2	3.86855e-279
Neisseria sp. 10023	1853278	species	2496444	1	1	0.0
Enterobacter sp. HK169	1868135	species	4551186	1	0	2.61126e-150
Acinetobacter defluvii	1871111	species	3812088	1	0	0.0
Buchnera aphidicola (Cinara confinis)	1878935	leaf	451961	1	0	0.0
Amycolatopsis sp. AA4	1896961	species	9172799	1	1	0.0
Morganellaceae	1903414	family	5691351	20	0	0.0
Klebsiella sp. LTGPAF-6F	1905288	species	6790399	1	0	3.36862e-120
Lelliottia jeotgali	1907578	species	4603334	1	0	1.35268e-235
Salmonella enterica subsp. enterica serovar Hayindogo	1911681	leaf	4765719	1	1	0.0
Enterobacter cloacae complex sp. ECNIH7	1915310	species	5388828	2	0	1.57481e-158
Enterobacteriaceae bacterium ENNIH2	1920109	species	6262406	3	0	3.4065e-41
Citrobacter sp. CFNIH10	1920110	species	5738233	1	0	6.45235e-134
Leclercia sp. LSNIH1	1920114	species	5411940	1	0	1.41232e-240
Leclercia sp. LSNIH3	1920116	species	5389886	6	0	4.4049e-242
Enterobacteriaceae bacterium ENNIH3	1920128	species	6079128	4	0	9.8425e-07
Sodalis endosymbiont of Henestaris halophilus	1929246	species	1622395	1	1	0.0
Klebsiella sp. M5al	1934254	species	5800138	1	0	0.0
Escherichia coli APEC O2-211	1954351	leaf	5318341	3	0	5.51891e-212
Phytobacter ursingii	1972431	species	6166452	1	0	4.22157e-05
Enterobacter sp. Crenshaw	1977566	species	4630785	1	0	0.0
Cellvibrio sp. PSBB006	1987723	species	5257074	1	1	0.0
Citrobacter sp. 86	2013114	species	5048670	3	0	6.99453e-149
Citrobacter sp. 92	2019568	species	5109913	3	0	1.31666e-149
Providencia sp. WCHPr000369	2027290	species	4799915	1	0	0.0
Enterobacter cloacae complex sp.	2027919	species	10167193	1	0	0
Gemella sp. ND 6198	2040624	species	1797925	224	0	5.15108e-34
Escherichia coli O128:H27	2048776	leaf	5130625	2	0	1.10226e-128
Enterobacter sp. CRENT-193	2051905	species	5196641	2	0	4.18634e-148
Planococcus sp. MB-3u-03	2058136	species	3614431	1	1	0.0
Chromobacterium sp. ATCC 53434	2059672	species	5138981	1	0	0.0
Gordonia sp. YC-JH1	2059875	species	4193324	1	1	0.0
Citrobacter freundii complex sp. CFNIH2	2066049	species	5340584	4	0	4.85647e-151
Enterobacteriaceae bacterium ENNIH1	2066051	species	5666332	2	0	0.0
Enterobacter cloacae complex sp. FDA-CDC-AR_0164	2077136	species	4849791	1	0	0.0
Enterobacter cloacae complex sp. FDA-CDC-AR_0132	2077137	species	4971441	1	0	0.0
Citrobacter freundii complex sp. CFNIH3	2077147	species	5634842	1	0	3.46552e-151
Citrobacter freundii complex sp. CFNIH4	2077148	species	5629494	2	0	1.60092e-155
Clostridiaceae bacterium 14S0207	2082193	species	3151275	2	0	0
Melaminivora sp. SC2-9	2109913	species	3754020	1	0	0.0
Lelliottia sp. WB101	2153385	species	4734070	2	1	0.0
Luteimonas sp. 83-4	2172536	species	2592821	1	1	0.0
Planococcus sp. Y42	2213202	species	4149733	1	1	0.0
Photorhabdus laumondii	2218628	species	11301093	1	0	0.0
Enterobacteriaceae bacterium w17	2282309	species	5125645	3	1	3.53911e-212
Enterobacteriaceae bacterium w6	2282310	species	4945486	3	0	0.0
Buttiauxella sp. 3AFRM03	2479367	species	5498356	2	2	0.0
