ID,Organism Code,Organism Name,MIC,Drug
G18000015,EKPN,K.pneumoniae,<=2,Amikacin
G18000015,EKPN,K.pneumoniae,2,Ceftazidime
G18000015,EKPN,K.pneumoniae,<=0.25,Ciprofloxacin
G18000015,EKPN,K.pneumoniae,<=1,Ceftriaxone
G18000015,EKPN,K.pneumoniae,>=8,Doripenem
G18000015,EKPN,K.pneumoniae,<=0.5,Ertapenem
G18000015,EKPN,K.pneumoniae,<=1,Cefepime
G18000015,EKPN,K.pneumoniae,<=4,Cefoxitin
G18000015,EKPN,K.pneumoniae,<=1,Gentamicin
G18000015,EKPN,K.pneumoniae,8,Imipenem
G18000015,EKPN,K.pneumoniae,>=16,Meropenem
G18000015,EKPN,K.pneumoniae,>=32,Ampicillin/Sulbactam
G18000015,EKPN,K.pneumoniae,<=0.5,Tigecycline
G18000015,EKPN,K.pneumoniae,64,Piperacillin/Tazobactam
G18000020,EKPN,K.pneumoniae,>=64,Amikacin
G18000020,EKPN,K.pneumoniae,>=64,Ceftazidime
G18000020,EKPN,K.pneumoniae,>=4,Ciprofloxacin
G18000020,EKPN,K.pneumoniae,>=64,Ceftriaxone
G18000020,EKPN,K.pneumoniae,>=8,Doripenem
G18000020,EKPN,K.pneumoniae,>=8,Ertapenem
G18000020,EKPN,K.pneumoniae,>=64,Cefepime
G18000020,EKPN,K.pneumoniae,>=64,Cefoxitin
G18000020,EKPN,K.pneumoniae,>=16,Gentamicin
G18000020,EKPN,K.pneumoniae,>=16,Imipenem
G18000020,EKPN,K.pneumoniae,>=16,Meropenem
G18000020,EKPN,K.pneumoniae,>=32,Ampicillin/Sulbactam
G18000020,EKPN,K.pneumoniae,2,Tigecycline
G18000020,EKPN,K.pneumoniae,>=128,Piperacillin/Tazobactam
G18000021,EKPN,K.pneumoniae,>=64,Amikacin
G18000021,EKPN,K.pneumoniae,>=64,Ceftazidime
G18000021,EKPN,K.pneumoniae,>=4,Ciprofloxacin
G18000021,EKPN,K.pneumoniae,>=64,Ceftriaxone
G18000021,EKPN,K.pneumoniae,>=8,Doripenem
G18000021,EKPN,K.pneumoniae,>=8,Ertapenem
G18000021,EKPN,K.pneumoniae,>=64,Cefepime
G18000021,EKPN,K.pneumoniae,>=64,Cefoxitin
G18000021,EKPN,K.pneumoniae,>=16,Gentamicin
G18000021,EKPN,K.pneumoniae,>=16,Imipenem
G18000021,EKPN,K.pneumoniae,>=16,Meropenem
G18000021,EKPN,K.pneumoniae,>=32,Ampicillin/Sulbactam
G18000021,EKPN,K.pneumoniae,2,Tigecycline
G18000021,EKPN,K.pneumoniae,>=128,Piperacillin/Tazobactam
G18000023,EKPN,K.pneumoniae,16,Amikacin
G18000023,EKPN,K.pneumoniae,>=64,Ceftazidime
G18000023,EKPN,K.pneumoniae,>=4,Ciprofloxacin
G18000023,EKPN,K.pneumoniae,>=64,Ceftriaxone
G18000023,EKPN,K.pneumoniae,>=8,Doripenem
G18000023,EKPN,K.pneumoniae,>=8,Ertapenem
G18000023,EKPN,K.pneumoniae,32,Cefepime
G18000023,EKPN,K.pneumoniae,>=64,Cefoxitin
G18000023,EKPN,K.pneumoniae,>=16,Gentamicin
G18000023,EKPN,K.pneumoniae,8,Imipenem
G18000023,EKPN,K.pneumoniae,>=16,Meropenem
G18000023,EKPN,K.pneumoniae,>=32,Ampicillin/Sulbactam
G18000023,EKPN,K.pneumoniae,2,Tigecycline
G18000023,EKPN,K.pneumoniae,>=128,Piperacillin/Tazobactam
G18000024,EKPN,K.pneumoniae,>=64,Amikacin
G18000024,EKPN,K.pneumoniae,>=64,Ceftazidime
G18000024,EKPN,K.pneumoniae,>=4,Ciprofloxacin
G18000024,EKPN,K.pneumoniae,>=64,Ceftriaxone
G18000024,EKPN,K.pneumoniae,>=8,Doripenem
G18000024,EKPN,K.pneumoniae,>=8,Ertapenem
G18000024,EKPN,K.pneumoniae,>=64,Cefepime
G18000024,EKPN,K.pneumoniae,>=64,Cefoxitin
G18000024,EKPN,K.pneumoniae,>=16,Gentamicin
G18000024,EKPN,K.pneumoniae,8,Imipenem
G18000024,EKPN,K.pneumoniae,>=16,Meropenem
G18000024,EKPN,K.pneumoniae,>=32,Ampicillin/Sulbactam
G18000024,EKPN,K.pneumoniae,2,Tigecycline
G18000024,EKPN,K.pneumoniae,>=128,Piperacillin/Tazobactam
G18000027,EKPN,K.pneumoniae,<=2,Amikacin
G18000027,EKPN,K.pneumoniae,16,Ceftazidime
G18000027,EKPN,K.pneumoniae,<=0.25,Ciprofloxacin
G18000027,EKPN,K.pneumoniae,>=64,Ceftriaxone
G18000027,EKPN,K.pneumoniae,2,Doripenem
G18000027,EKPN,K.pneumoniae,>=8,Ertapenem
G18000027,EKPN,K.pneumoniae,>=64,Cefepime
G18000027,EKPN,K.pneumoniae,>=64,Cefoxitin
G18000027,EKPN,K.pneumoniae,>=16,Gentamicin
G18000027,EKPN,K.pneumoniae,0.5,Imipenem
G18000027,EKPN,K.pneumoniae,8,Meropenem
G18000027,EKPN,K.pneumoniae,>=32,Ampicillin/Sulbactam
G18000027,EKPN,K.pneumoniae,<=0.5,Tigecycline
G18000027,EKPN,K.pneumoniae,>=128,Piperacillin/Tazobactam
G18000031,EKPN,K.pneumoniae,<=2,Amikacin
G18000031,EKPN,K.pneumoniae,4,Ceftazidime
G18000031,EKPN,K.pneumoniae,<=0.25,Ciprofloxacin
G18000031,EKPN,K.pneumoniae,>=64,Ceftriaxone
G18000031,EKPN,K.pneumoniae,>=8,Doripenem
G18000031,EKPN,K.pneumoniae,>=8,Ertapenem
G18000031,EKPN,K.pneumoniae,4,Cefepime
G18000031,EKPN,K.pneumoniae,16,Cefoxitin
G18000031,EKPN,K.pneumoniae,<=1,Gentamicin
G18000031,EKPN,K.pneumoniae,>=16,Imipenem
G18000031,EKPN,K.pneumoniae,>=16,Meropenem
G18000031,EKPN,K.pneumoniae,>=32,Ampicillin/Sulbactam
G18000031,EKPN,K.pneumoniae,<=0.5,Tigecycline
G18000031,EKPN,K.pneumoniae,>=128,Piperacillin/Tazobactam
G18000049,EKPN,K.pneumoniae,<=2,Amikacin
G18000049,EKPN,K.pneumoniae,2,Ceftazidime
G18000049,EKPN,K.pneumoniae,2,Ciprofloxacin
G18000049,EKPN,K.pneumoniae,>=64,Ceftriaxone
G18000049,EKPN,K.pneumoniae,>=8,Doripenem
G18000049,EKPN,K.pneumoniae,>=8,Ertapenem
G18000049,EKPN,K.pneumoniae,<=1,Cefepime
G18000049,EKPN,K.pneumoniae,<=4,Cefoxitin
G18000049,EKPN,K.pneumoniae,<=1,Gentamicin
G18000049,EKPN,K.pneumoniae,>=16,Imipenem
G18000049,EKPN,K.pneumoniae,>=16,Meropenem
G18000049,EKPN,K.pneumoniae,>=32,Ampicillin/Sulbactam
G18000049,EKPN,K.pneumoniae,<=0.5,Tigecycline
G18000049,EKPN,K.pneumoniae,>=128,Piperacillin/Tazobactam
G18000059,EKPN,K.pneumoniae,>=64,Amikacin
G18000059,EKPN,K.pneumoniae,>=64,Ceftazidime
G18000059,EKPN,K.pneumoniae,>=4,Ciprofloxacin
G18000059,EKPN,K.pneumoniae,>=64,Ceftriaxone
G18000059,EKPN,K.pneumoniae,>=8,Doripenem
G18000059,EKPN,K.pneumoniae,>=8,Ertapenem
G18000059,EKPN,K.pneumoniae,>=64,Cefepime
G18000059,EKPN,K.pneumoniae,>=64,Cefoxitin
G18000059,EKPN,K.pneumoniae,8,Gentamicin
G18000059,EKPN,K.pneumoniae,8,Imipenem
G18000059,EKPN,K.pneumoniae,>=16,Meropenem
G18000059,EKPN,K.pneumoniae,>=32,Ampicillin/Sulbactam
G18000059,EKPN,K.pneumoniae,2,Tigecycline
G18000059,EKPN,K.pneumoniae,>=128,Piperacillin/Tazobactam
G18000063,EKPN,K.pneumoniae,>=64,Amikacin
G18000063,EKPN,K.pneumoniae,>=64,Ceftazidime
G18000063,EKPN,K.pneumoniae,>=4,Ciprofloxacin
G18000063,EKPN,K.pneumoniae,>=64,Ceftriaxone
G18000063,EKPN,K.pneumoniae,0.5,Doripenem
G18000063,EKPN,K.pneumoniae,<=0.5,Ertapenem
G18000063,EKPN,K.pneumoniae,>=64,Cefepime
G18000063,EKPN,K.pneumoniae,<=4,Cefoxitin
G18000063,EKPN,K.pneumoniae,>=16,Gentamicin
G18000063,EKPN,K.pneumoniae,>=16,Imipenem
G18000063,EKPN,K.pneumoniae,>=16,Meropenem
G18000063,EKPN,K.pneumoniae,>=32,Ampicillin/Sulbactam
G18000063,EKPN,K.pneumoniae,1,Tigecycline
G18000063,EKPN,K.pneumoniae,>=128,Piperacillin/Tazobactam
G18000065,EKPN,K.pneumoniae,<=2,Amikacin
G18000065,EKPN,K.pneumoniae,4,Ceftazidime
G18000065,EKPN,K.pneumoniae,<=0.25,Ciprofloxacin
G18000065,EKPN,K.pneumoniae,32,Ceftriaxone
G18000065,EKPN,K.pneumoniae,>=8,Doripenem
G18000065,EKPN,K.pneumoniae,>=8,Ertapenem
G18000065,EKPN,K.pneumoniae,2,Cefepime
G18000065,EKPN,K.pneumoniae,16,Cefoxitin
G18000065,EKPN,K.pneumoniae,<=1,Gentamicin
G18000065,EKPN,K.pneumoniae,8,Imipenem
G18000065,EKPN,K.pneumoniae,>=16,Meropenem
G18000065,EKPN,K.pneumoniae,>=32,Ampicillin/Sulbactam
G18000065,EKPN,K.pneumoniae,<=0.5,Tigecycline
G18000065,EKPN,K.pneumoniae,>=128,Piperacillin/Tazobactam
G18000073,EKP,K.pneum.pneumoniae,>=64,Amikacin
G18000073,EKP,K.pneum.pneumoniae,>=64,Ceftazidime
G18000073,EKP,K.pneum.pneumoniae,>=4,Ciprofloxacin
G18000073,EKP,K.pneum.pneumoniae,>=64,Ceftriaxone
G18000073,EKP,K.pneum.pneumoniae,>=8,Doripenem
G18000073,EKP,K.pneum.pneumoniae,>=8,Ertapenem
G18000073,EKP,K.pneum.pneumoniae,>=64,Cefepime
G18000073,EKP,K.pneum.pneumoniae,>=64,Cefoxitin
G18000073,EKP,K.pneum.pneumoniae,4,Gentamicin
G18000073,EKP,K.pneum.pneumoniae,>=16,Imipenem
G18000073,EKP,K.pneum.pneumoniae,>=16,Meropenem
G18000073,EKP,K.pneum.pneumoniae,>=32,Ampicillin/Sulbactam
G18000073,EKP,K.pneum.pneumoniae,>=8,Tigecycline
G18000073,EKP,K.pneum.pneumoniae,>=128,Piperacillin/Tazobactam
G18000074,EKP,K.pneum.pneumoniae,>=64,Amikacin
G18000074,EKP,K.pneum.pneumoniae,>=64,Ceftazidime
G18000074,EKP,K.pneum.pneumoniae,>=4,Ciprofloxacin
G18000074,EKP,K.pneum.pneumoniae,>=64,Ceftriaxone
G18000074,EKP,K.pneum.pneumoniae,>=8,Doripenem
G18000074,EKP,K.pneum.pneumoniae,>=8,Ertapenem
G18000074,EKP,K.pneum.pneumoniae,>=64,Cefepime
G18000074,EKP,K.pneum.pneumoniae,>=64,Cefoxitin
G18000074,EKP,K.pneum.pneumoniae,4,Gentamicin
G18000074,EKP,K.pneum.pneumoniae,>=16,Imipenem
G18000074,EKP,K.pneum.pneumoniae,>=16,Meropenem
G18000074,EKP,K.pneum.pneumoniae,>=32,Ampicillin/Sulbactam
G18000074,EKP,K.pneum.pneumoniae,>=8,Tigecycline
G18000074,EKP,K.pneum.pneumoniae,>=128,Piperacillin/Tazobactam
G18000074,EKP,K.pneum.pneumoniae,>=64,Amikacin
G18000074,EKP,K.pneum.pneumoniae,>=64,Ceftazidime
G18000074,EKP,K.pneum.pneumoniae,>=4,Ciprofloxacin
G18000074,EKP,K.pneum.pneumoniae,>=64,Ceftriaxone
G18000074,EKP,K.pneum.pneumoniae,>=8,Doripenem
G18000074,EKP,K.pneum.pneumoniae,>=8,Ertapenem
G18000074,EKP,K.pneum.pneumoniae,>=64,Cefepime
G18000074,EKP,K.pneum.pneumoniae,>=64,Cefoxitin
G18000074,EKP,K.pneum.pneumoniae,>=16,Gentamicin
G18000074,EKP,K.pneum.pneumoniae,8,Imipenem
G18000074,EKP,K.pneum.pneumoniae,>=16,Meropenem
G18000074,EKP,K.pneum.pneumoniae,>=32,Ampicillin/Sulbactam
G18000074,EKP,K.pneum.pneumoniae,2,Tigecycline
G18000074,EKP,K.pneum.pneumoniae,>=128,Piperacillin/Tazobactam
G18000078,EKP,K.pneum.pneumoniae,>=64,Amikacin
G18000078,EKP,K.pneum.pneumoniae,>=64,Ceftazidime
G18000078,EKP,K.pneum.pneumoniae,>=4,Ciprofloxacin
G18000078,EKP,K.pneum.pneumoniae,>=64,Ceftriaxone
G18000078,EKP,K.pneum.pneumoniae,>=8,Doripenem
G18000078,EKP,K.pneum.pneumoniae,>=8,Ertapenem
G18000078,EKP,K.pneum.pneumoniae,>=64,Cefepime
G18000078,EKP,K.pneum.pneumoniae,>=64,Cefoxitin
G18000078,EKP,K.pneum.pneumoniae,>=16,Gentamicin
G18000078,EKP,K.pneum.pneumoniae,8,Imipenem
G18000078,EKP,K.pneum.pneumoniae,>=16,Meropenem
G18000078,EKP,K.pneum.pneumoniae,>=32,Ampicillin/Sulbactam
G18000078,EKP,K.pneum.pneumoniae,2,Tigecycline
G18000078,EKP,K.pneum.pneumoniae,>=128,Piperacillin/Tazobactam
G18000085,EKP,K.pneum.pneumoniae,>=64,Amikacin
G18000085,EKP,K.pneum.pneumoniae,>=64,Ceftazidime
G18000085,EKP,K.pneum.pneumoniae,>=4,Ciprofloxacin
G18000085,EKP,K.pneum.pneumoniae,>=64,Ceftriaxone
G18000085,EKP,K.pneum.pneumoniae,>=8,Doripenem
G18000085,EKP,K.pneum.pneumoniae,>=8,Ertapenem
G18000085,EKP,K.pneum.pneumoniae,>=64,Cefepime
G18000085,EKP,K.pneum.pneumoniae,>=64,Cefoxitin
G18000085,EKP,K.pneum.pneumoniae,>=16,Gentamicin
G18000085,EKP,K.pneum.pneumoniae,>=16,Imipenem
G18000085,EKP,K.pneum.pneumoniae,>=16,Meropenem
G18000085,EKP,K.pneum.pneumoniae,>=32,Ampicillin/Sulbactam
G18000085,EKP,K.pneum.pneumoniae,2,Tigecycline
G18000085,EKP,K.pneum.pneumoniae,>=128,Piperacillin/Tazobactam
G18000086,EKPN,K.pneumoniae,<=2,Amikacin
G18000086,EKPN,K.pneumoniae,4,Ceftazidime
G18000086,EKPN,K.pneumoniae,<=0.25,Ciprofloxacin
G18000086,EKPN,K.pneumoniae,>=64,Ceftriaxone
G18000086,EKPN,K.pneumoniae,<=0.12,Doripenem
G18000086,EKPN,K.pneumoniae,<=0.5,Ertapenem
G18000086,EKPN,K.pneumoniae,2,Cefepime
G18000086,EKPN,K.pneumoniae,<=4,Cefoxitin
G18000086,EKPN,K.pneumoniae,>=16,Gentamicin
G18000086,EKPN,K.pneumoniae,<=0.25,Imipenem
G18000086,EKPN,K.pneumoniae,<=0.25,Meropenem
G18000086,EKPN,K.pneumoniae,>=32,Ampicillin/Sulbactam
G18000086,EKPN,K.pneumoniae,<=0.5,Tigecycline
G18000086,EKPN,K.pneumoniae,8,Piperacillin/Tazobactam
G18000087,EKP,K.pneum.pneumoniae,>=64,Amikacin
G18000087,EKP,K.pneum.pneumoniae,>=64,Ceftazidime
G18000087,EKP,K.pneum.pneumoniae,>=4,Ciprofloxacin
G18000087,EKP,K.pneum.pneumoniae,>=64,Ceftriaxone
G18000087,EKP,K.pneum.pneumoniae,>=8,Doripenem
G18000087,EKP,K.pneum.pneumoniae,>=8,Ertapenem
G18000087,EKP,K.pneum.pneumoniae,>=64,Cefepime
G18000087,EKP,K.pneum.pneumoniae,>=64,Cefoxitin
G18000087,EKP,K.pneum.pneumoniae,>=16,Gentamicin
G18000087,EKP,K.pneum.pneumoniae,8,Imipenem
G18000087,EKP,K.pneum.pneumoniae,>=16,Meropenem
G18000087,EKP,K.pneum.pneumoniae,>=32,Ampicillin/Sulbactam
G18000087,EKP,K.pneum.pneumoniae,2,Tigecycline
G18000087,EKP,K.pneum.pneumoniae,>=128,Piperacillin/Tazobactam
G18000098,EKPN,K.pneumoniae,>=64,Amikacin
G18000098,EKPN,K.pneumoniae,>=64,Ceftazidime
G18000098,EKPN,K.pneumoniae,>=4,Ciprofloxacin
G18000098,EKPN,K.pneumoniae,>=64,Ceftriaxone
G18000098,EKPN,K.pneumoniae,4,Doripenem
G18000098,EKPN,K.pneumoniae,4,Ertapenem
G18000098,EKPN,K.pneumoniae,2,Cefepime
G18000098,EKPN,K.pneumoniae,>=64,Cefoxitin
G18000098,EKPN,K.pneumoniae,<=1,Gentamicin
G18000098,EKPN,K.pneumoniae,>=16,Imipenem
G18000098,EKPN,K.pneumoniae,>=16,Meropenem
G18000098,EKPN,K.pneumoniae,>=32,Ampicillin/Sulbactam
G18000098,EKPN,K.pneumoniae,2,Tigecycline
G18000098,EKPN,K.pneumoniae,>=128,Piperacillin/Tazobactam
G18000102,EKP,K.pneum.pneumoniae,>=64,Amikacin
G18000102,EKP,K.pneum.pneumoniae,>=64,Ceftazidime
G18000102,EKP,K.pneum.pneumoniae,>=4,Ciprofloxacin
G18000102,EKP,K.pneum.pneumoniae,>=64,Ceftriaxone
G18000102,EKP,K.pneum.pneumoniae,>=8,Doripenem
G18000102,EKP,K.pneum.pneumoniae,>=8,Ertapenem
G18000102,EKP,K.pneum.pneumoniae,>=64,Cefepime
G18000102,EKP,K.pneum.pneumoniae,>=64,Cefoxitin
G18000102,EKP,K.pneum.pneumoniae,>=16,Gentamicin
G18000102,EKP,K.pneum.pneumoniae,>=16,Imipenem
G18000102,EKP,K.pneum.pneumoniae,>=16,Meropenem
G18000102,EKP,K.pneum.pneumoniae,>=32,Ampicillin/Sulbactam
G18000102,EKP,K.pneum.pneumoniae,2,Tigecycline
G18000102,EKP,K.pneum.pneumoniae,>=128,Piperacillin/Tazobactam
G18000120,EKP,K.pneum.pneumoniae,<=2,Amikacin
G18000120,EKP,K.pneum.pneumoniae,4,Ceftazidime
G18000120,EKP,K.pneum.pneumoniae,2,Ciprofloxacin
G18000120,EKP,K.pneum.pneumoniae,>=64,Ceftriaxone
G18000120,EKP,K.pneum.pneumoniae,<=0.12,Doripenem
G18000120,EKP,K.pneum.pneumoniae,<=0.5,Ertapenem
G18000120,EKP,K.pneum.pneumoniae,2,Cefepime
G18000120,EKP,K.pneum.pneumoniae,<=4,Cefoxitin
G18000120,EKP,K.pneum.pneumoniae,>=16,Gentamicin
G18000120,EKP,K.pneum.pneumoniae,<=0.25,Imipenem
G18000120,EKP,K.pneum.pneumoniae,<=0.25,Meropenem
G18000120,EKP,K.pneum.pneumoniae,>=32,Ampicillin/Sulbactam
G18000120,EKP,K.pneum.pneumoniae,1,Tigecycline
G18000120,EKP,K.pneum.pneumoniae,16,Piperacillin/Tazobactam
G18000121,EKP,K.pneum.pneumoniae,>=64,Amikacin
G18000121,EKP,K.pneum.pneumoniae,>=64,Ceftazidime
G18000121,EKP,K.pneum.pneumoniae,>=4,Ciprofloxacin
G18000121,EKP,K.pneum.pneumoniae,>=64,Ceftriaxone
G18000121,EKP,K.pneum.pneumoniae,>=8,Doripenem
G18000121,EKP,K.pneum.pneumoniae,>=8,Ertapenem
G18000121,EKP,K.pneum.pneumoniae,>=64,Cefepime
G18000121,EKP,K.pneum.pneumoniae,>=64,Cefoxitin
G18000121,EKP,K.pneum.pneumoniae,>=16,Gentamicin
G18000121,EKP,K.pneum.pneumoniae,>=16,Imipenem
G18000121,EKP,K.pneum.pneumoniae,>=16,Meropenem
G18000121,EKP,K.pneum.pneumoniae,>=32,Ampicillin/Sulbactam
G18000121,EKP,K.pneum.pneumoniae,2,Tigecycline
G18000121,EKP,K.pneum.pneumoniae,>=128,Piperacillin/Tazobactam
G18000123,EKP,K.pneum.pneumoniae,<=2,Amikacin
G18000123,EKP,K.pneum.pneumoniae,4,Ceftazidime
G18000123,EKP,K.pneum.pneumoniae,<=0.25,Ciprofloxacin
G18000123,EKP,K.pneum.pneumoniae,>=64,Ceftriaxone
G18000123,EKP,K.pneum.pneumoniae,<=0.12,Doripenem
G18000123,EKP,K.pneum.pneumoniae,<=0.5,Ertapenem
G18000123,EKP,K.pneum.pneumoniae,2,Cefepime
G18000123,EKP,K.pneum.pneumoniae,<=4,Cefoxitin
G18000123,EKP,K.pneum.pneumoniae,>=16,Gentamicin
G18000123,EKP,K.pneum.pneumoniae,<=0.25,Imipenem
G18000123,EKP,K.pneum.pneumoniae,<=0.25,Meropenem
G18000123,EKP,K.pneum.pneumoniae,>=32,Ampicillin/Sulbactam
G18000123,EKP,K.pneum.pneumoniae,<=0.5,Tigecycline
G18000123,EKP,K.pneum.pneumoniae,8,Piperacillin/Tazobactam
G18000137,EKPN,K.pneumoniae,32,Amikacin
G18000137,EKPN,K.pneumoniae,>=64,Ceftazidime
G18000137,EKPN,K.pneumoniae,>=4,Ciprofloxacin
G18000137,EKPN,K.pneumoniae,>=64,Ceftriaxone
G18000137,EKPN,K.pneumoniae,>=8,Doripenem
G18000137,EKPN,K.pneumoniae,>=8,Ertapenem
G18000137,EKPN,K.pneumoniae,>=64,Cefepime
G18000137,EKPN,K.pneumoniae,>=64,Cefoxitin
G18000137,EKPN,K.pneumoniae,4,Gentamicin
G18000137,EKPN,K.pneumoniae,>=16,Imipenem
G18000137,EKPN,K.pneumoniae,>=16,Meropenem
G18000137,EKPN,K.pneumoniae,>=32,Ampicillin/Sulbactam
G18000137,EKPN,K.pneumoniae,>=8,Tigecycline
G18000137,EKPN,K.pneumoniae,>=128,Piperacillin/Tazobactam
G18000141,EKPN,K.pneumoniae,16,Amikacin
G18000141,EKPN,K.pneumoniae,>=64,Ceftazidime
G18000141,EKPN,K.pneumoniae,>=4,Ciprofloxacin
G18000141,EKPN,K.pneumoniae,>=64,Ceftriaxone
G18000141,EKPN,K.pneumoniae,4,Doripenem
G18000141,EKPN,K.pneumoniae,>=8,Ertapenem
G18000141,EKPN,K.pneumoniae,>=64,Cefepime
G18000141,EKPN,K.pneumoniae,>=64,Cefoxitin
G18000141,EKPN,K.pneumoniae,>=16,Gentamicin
G18000141,EKPN,K.pneumoniae,1,Imipenem
G18000141,EKPN,K.pneumoniae,4,Meropenem
G18000141,EKPN,K.pneumoniae,>=32,Ampicillin/Sulbactam
G18000141,EKPN,K.pneumoniae,2,Tigecycline
G18000141,EKPN,K.pneumoniae,>=128,Piperacillin/Tazobactam
G18000145,EKPN,K.pneumoniae,<=2,Amikacin
G18000145,EKPN,K.pneumoniae,16,Ceftazidime
G18000145,EKPN,K.pneumoniae,2,Ciprofloxacin
G18000145,EKPN,K.pneumoniae,>=64,Ceftriaxone
G18000145,EKPN,K.pneumoniae,>=8,Doripenem
G18000145,EKPN,K.pneumoniae,4,Ertapenem
G18000145,EKPN,K.pneumoniae,32,Cefepime
G18000145,EKPN,K.pneumoniae,<=4,Cefoxitin
G18000145,EKPN,K.pneumoniae,>=16,Gentamicin
G18000145,EKPN,K.pneumoniae,>=16,Imipenem
G18000145,EKPN,K.pneumoniae,>=16,Meropenem
G18000145,EKPN,K.pneumoniae,>=32,Ampicillin/Sulbactam
G18000145,EKPN,K.pneumoniae,2,Tigecycline
G18000145,EKPN,K.pneumoniae,>=128,Piperacillin/Tazobactam
G18000146,EKPN,K.pneumoniae,>=64,Amikacin
G18000146,EKPN,K.pneumoniae,>=64,Ceftazidime
G18000146,EKPN,K.pneumoniae,>=4,Ciprofloxacin
G18000146,EKPN,K.pneumoniae,32,Ceftriaxone
G18000146,EKPN,K.pneumoniae,>=8,Doripenem
G18000146,EKPN,K.pneumoniae,>=8,Ertapenem
G18000146,EKPN,K.pneumoniae,32,Cefepime
G18000146,EKPN,K.pneumoniae,32,Cefoxitin
G18000146,EKPN,K.pneumoniae,2,Gentamicin
G18000146,EKPN,K.pneumoniae,8,Imipenem
G18000146,EKPN,K.pneumoniae,>=16,Meropenem
G18000146,EKPN,K.pneumoniae,>=32,Ampicillin/Sulbactam
G18000146,EKPN,K.pneumoniae,2,Tigecycline
G18000146,EKPN,K.pneumoniae,>=128,Piperacillin/Tazobactam
G18000158,EKP,K.pneum.pneumoniae,>=64,Amikacin
G18000158,EKP,K.pneum.pneumoniae,32,Ceftazidime
G18000158,EKP,K.pneum.pneumoniae,>=4,Ciprofloxacin
G18000158,EKP,K.pneum.pneumoniae,>=64,Ceftriaxone
G18000158,EKP,K.pneum.pneumoniae,0.5,Doripenem
G18000158,EKP,K.pneum.pneumoniae,<=0.5,Ertapenem
G18000158,EKP,K.pneum.pneumoniae,2,Cefepime
G18000158,EKP,K.pneum.pneumoniae,>=64,Cefoxitin
G18000158,EKP,K.pneum.pneumoniae,>=16,Gentamicin
G18000158,EKP,K.pneum.pneumoniae,>=16,Imipenem
G18000158,EKP,K.pneum.pneumoniae,>=16,Meropenem
G18000158,EKP,K.pneum.pneumoniae,>=32,Ampicillin/Sulbactam
G18000158,EKP,K.pneum.pneumoniae,1,Tigecycline
G18000158,EKP,K.pneum.pneumoniae,>=128,Piperacillin/Tazobactam
G18000159,EKPN,K.pneumoniae,<=2,Amikacin
G18000159,EKPN,K.pneumoniae,8,Ceftazidime
G18000159,EKPN,K.pneumoniae,<=0.25,Ciprofloxacin
G18000159,EKPN,K.pneumoniae,16,Ceftriaxone
G18000159,EKPN,K.pneumoniae,4,Doripenem
G18000159,EKPN,K.pneumoniae,>=8,Ertapenem
G18000159,EKPN,K.pneumoniae,<=1,Cefepime
G18000159,EKPN,K.pneumoniae,8,Cefoxitin
G18000159,EKPN,K.pneumoniae,<=1,Gentamicin
G18000159,EKPN,K.pneumoniae,>=16,Imipenem
G18000159,EKPN,K.pneumoniae,>=16,Meropenem
G18000159,EKPN,K.pneumoniae,>=32,Ampicillin/Sulbactam
G18000159,EKPN,K.pneumoniae,1,Tigecycline
G18000159,EKPN,K.pneumoniae,>=128,Piperacillin/Tazobactam
G18000160,EKPN,K.pneumoniae,8,Amikacin
G18000160,EKPN,K.pneumoniae,4,Ceftazidime
G18000160,EKPN,K.pneumoniae,>=4,Ciprofloxacin
G18000160,EKPN,K.pneumoniae,8,Ceftriaxone
G18000160,EKPN,K.pneumoniae,1,Doripenem
G18000160,EKPN,K.pneumoniae,4,Ertapenem
G18000160,EKPN,K.pneumoniae,<=1,Cefepime
G18000160,EKPN,K.pneumoniae,16,Cefoxitin
G18000160,EKPN,K.pneumoniae,>=16,Gentamicin
G18000160,EKPN,K.pneumoniae,8,Imipenem
G18000160,EKPN,K.pneumoniae,>=16,Meropenem
G18000160,EKPN,K.pneumoniae,>=32,Ampicillin/Sulbactam
G18000160,EKPN,K.pneumoniae,4,Tigecycline
G18000160,EKPN,K.pneumoniae,>=128,Piperacillin/Tazobactam
G18000164,EKPN,K.pneumoniae,>=64,Amikacin
G18000164,EKPN,K.pneumoniae,>=64,Ceftazidime
G18000164,EKPN,K.pneumoniae,>=4,Ciprofloxacin
G18000164,EKPN,K.pneumoniae,>=64,Ceftriaxone
G18000164,EKPN,K.pneumoniae,>=8,Doripenem
G18000164,EKPN,K.pneumoniae,>=8,Ertapenem
G18000164,EKPN,K.pneumoniae,>=64,Cefepime
G18000164,EKPN,K.pneumoniae,>=64,Cefoxitin
G18000164,EKPN,K.pneumoniae,>=16,Gentamicin
G18000164,EKPN,K.pneumoniae,8,Imipenem
G18000164,EKPN,K.pneumoniae,>=16,Meropenem
G18000164,EKPN,K.pneumoniae,>=32,Ampicillin/Sulbactam
G18000164,EKPN,K.pneumoniae,2,Tigecycline
G18000164,EKPN,K.pneumoniae,>=128,Piperacillin/Tazobactam
G18000165,EKPN,K.pneumoniae,<=2,Amikacin
G18000165,EKPN,K.pneumoniae,16,Ceftazidime
G18000165,EKPN,K.pneumoniae,>=4,Ciprofloxacin
G18000165,EKPN,K.pneumoniae,>=64,Ceftriaxone
G18000165,EKPN,K.pneumoniae,4,Doripenem
G18000165,EKPN,K.pneumoniae,4,Ertapenem
G18000165,EKPN,K.pneumoniae,>=64,Cefepime
G18000165,EKPN,K.pneumoniae,<=4,Cefoxitin
G18000165,EKPN,K.pneumoniae,>=16,Gentamicin
G18000165,EKPN,K.pneumoniae,8,Imipenem
G18000165,EKPN,K.pneumoniae,>=16,Meropenem
G18000165,EKPN,K.pneumoniae,>=32,Ampicillin/Sulbactam
G18000165,EKPN,K.pneumoniae,<=0.5,Tigecycline
G18000165,EKPN,K.pneumoniae,>=128,Piperacillin/Tazobactam
G18000167,EKPN,K.pneumoniae,16,Amikacin
G18000167,EKPN,K.pneumoniae,>=64,Ceftazidime
G18000167,EKPN,K.pneumoniae,2,Ciprofloxacin
G18000167,EKPN,K.pneumoniae,>=64,Ceftriaxone
G18000167,EKPN,K.pneumoniae,>=8,Doripenem
G18000167,EKPN,K.pneumoniae,4,Ertapenem
G18000167,EKPN,K.pneumoniae,32,Cefepime
G18000167,EKPN,K.pneumoniae,<=4,Cefoxitin
G18000167,EKPN,K.pneumoniae,>=16,Gentamicin
G18000167,EKPN,K.pneumoniae,>=16,Imipenem
G18000167,EKPN,K.pneumoniae,>=16,Meropenem
G18000167,EKPN,K.pneumoniae,>=32,Ampicillin/Sulbactam
G18000167,EKPN,K.pneumoniae,2,Tigecycline
G18000167,EKPN,K.pneumoniae,>=128,Piperacillin/Tazobactam
G18000169,EKPN,K.pneumoniae,<=2,Amikacin
G18000169,EKPN,K.pneumoniae,4,Ceftazidime
G18000169,EKPN,K.pneumoniae,1,Ciprofloxacin
G18000169,EKPN,K.pneumoniae,8,Ceftriaxone
G18000169,EKPN,K.pneumoniae,>=8,Doripenem
G18000169,EKPN,K.pneumoniae,4,Ertapenem
G18000169,EKPN,K.pneumoniae,<=1,Cefepime
G18000169,EKPN,K.pneumoniae,<=4,Cefoxitin
G18000169,EKPN,K.pneumoniae,<=1,Gentamicin
G18000169,EKPN,K.pneumoniae,8,Imipenem
G18000169,EKPN,K.pneumoniae,>=16,Meropenem
G18000169,EKPN,K.pneumoniae,>=32,Ampicillin/Sulbactam
G18000169,EKPN,K.pneumoniae,1,Tigecycline
G18000169,EKPN,K.pneumoniae,>=128,Piperacillin/Tazobactam
G18000172,EKPN,K.pneumoniae,<=2,Amikacin
G18000172,EKPN,K.pneumoniae,2,Ceftazidime
G18000172,EKPN,K.pneumoniae,<=0.25,Ciprofloxacin
G18000172,EKPN,K.pneumoniae,8,Ceftriaxone
G18000172,EKPN,K.pneumoniae,>=8,Doripenem
G18000172,EKPN,K.pneumoniae,>=8,Ertapenem
G18000172,EKPN,K.pneumoniae,<=1,Cefepime
G18000172,EKPN,K.pneumoniae,<=4,Cefoxitin
G18000172,EKPN,K.pneumoniae,>=16,Gentamicin
G18000172,EKPN,K.pneumoniae,>=16,Imipenem
G18000172,EKPN,K.pneumoniae,>=16,Meropenem
G18000172,EKPN,K.pneumoniae,>=32,Ampicillin/Sulbactam
G18000172,EKPN,K.pneumoniae,<=0.5,Tigecycline
G18000172,EKPN,K.pneumoniae,>=128,Piperacillin/Tazobactam
G18000175,EKPN,K.pneumoniae,<=2,Amikacin
G18000175,EKPN,K.pneumoniae,16,Ceftazidime
G18000175,EKPN,K.pneumoniae,<=0.25,Ciprofloxacin
G18000175,EKPN,K.pneumoniae,>=64,Ceftriaxone
G18000175,EKPN,K.pneumoniae,>=8,Doripenem
G18000175,EKPN,K.pneumoniae,>=8,Ertapenem
G18000175,EKPN,K.pneumoniae,>=64,Cefepime
G18000175,EKPN,K.pneumoniae,16,Cefoxitin
G18000175,EKPN,K.pneumoniae,<=1,Gentamicin
G18000175,EKPN,K.pneumoniae,>=16,Imipenem
G18000175,EKPN,K.pneumoniae,>=16,Meropenem
G18000175,EKPN,K.pneumoniae,>=32,Ampicillin/Sulbactam
G18000175,EKPN,K.pneumoniae,<=0.5,Tigecycline
G18000175,EKPN,K.pneumoniae,>=128,Piperacillin/Tazobactam
G18000177,EKPN,K.pneumoniae,4,Amikacin
G18000177,EKPN,K.pneumoniae,>=64,Ceftazidime
G18000177,EKPN,K.pneumoniae,2,Ciprofloxacin
G18000177,EKPN,K.pneumoniae,>=64,Ceftriaxone
G18000177,EKPN,K.pneumoniae,>=8,Doripenem
G18000177,EKPN,K.pneumoniae,>=8,Ertapenem
G18000177,EKPN,K.pneumoniae,>=64,Cefepime
G18000177,EKPN,K.pneumoniae,32,Cefoxitin
G18000177,EKPN,K.pneumoniae,>=16,Gentamicin
G18000177,EKPN,K.pneumoniae,>=16,Imipenem
G18000177,EKPN,K.pneumoniae,>=16,Meropenem
G18000177,EKPN,K.pneumoniae,>=32,Ampicillin/Sulbactam
G18000177,EKPN,K.pneumoniae,2,Tigecycline
G18000177,EKPN,K.pneumoniae,>=128,Piperacillin/Tazobactam
G18000181,EKPN,K.pneumoniae,<=2,Amikacin
G18000181,EKPN,K.pneumoniae,16,Ceftazidime
G18000181,EKPN,K.pneumoniae,>=4,Ciprofloxacin
G18000181,EKPN,K.pneumoniae,8,Ceftriaxone
G18000181,EKPN,K.pneumoniae,4,Doripenem
G18000181,EKPN,K.pneumoniae,4,Ertapenem
G18000181,EKPN,K.pneumoniae,<=1,Cefepime
G18000181,EKPN,K.pneumoniae,<=4,Cefoxitin
G18000181,EKPN,K.pneumoniae,<=1,Gentamicin
G18000181,EKPN,K.pneumoniae,>=16,Imipenem
G18000181,EKPN,K.pneumoniae,>=16,Meropenem
G18000181,EKPN,K.pneumoniae,>=32,Ampicillin/Sulbactam
G18000181,EKPN,K.pneumoniae,1,Tigecycline
G18000181,EKPN,K.pneumoniae,>=128,Piperacillin/Tazobactam
G18000183,EKPN,K.pneumoniae,16,Amikacin
G18000183,EKPN,K.pneumoniae,>=64,Ceftazidime
G18000183,EKPN,K.pneumoniae,>=4,Ciprofloxacin
G18000183,EKPN,K.pneumoniae,>=64,Ceftriaxone
G18000183,EKPN,K.pneumoniae,4,Doripenem
G18000183,EKPN,K.pneumoniae,>=8,Ertapenem
G18000183,EKPN,K.pneumoniae,>=64,Cefepime
G18000183,EKPN,K.pneumoniae,>=64,Cefoxitin
G18000183,EKPN,K.pneumoniae,8,Gentamicin
G18000183,EKPN,K.pneumoniae,8,Imipenem
G18000183,EKPN,K.pneumoniae,>=16,Meropenem
G18000183,EKPN,K.pneumoniae,>=32,Ampicillin/Sulbactam
G18000183,EKPN,K.pneumoniae,1,Tigecycline
G18000183,EKPN,K.pneumoniae,>=128,Piperacillin/Tazobactam
G18000184,EKPN,K.pneumoniae,<=2,Amikacin
G18000184,EKPN,K.pneumoniae,32,Ceftazidime
G18000184,EKPN,K.pneumoniae,>=4,Ciprofloxacin
G18000184,EKPN,K.pneumoniae,32,Ceftriaxone
G18000184,EKPN,K.pneumoniae,>=8,Doripenem
G18000184,EKPN,K.pneumoniae,>=8,Ertapenem
G18000184,EKPN,K.pneumoniae,2,Cefepime
G18000184,EKPN,K.pneumoniae,8,Cefoxitin
G18000184,EKPN,K.pneumoniae,<=1,Gentamicin
G18000184,EKPN,K.pneumoniae,>=16,Imipenem
G18000184,EKPN,K.pneumoniae,>=16,Meropenem
G18000184,EKPN,K.pneumoniae,>=32,Ampicillin/Sulbactam
G18000184,EKPN,K.pneumoniae,1,Tigecycline
G18000184,EKPN,K.pneumoniae,>=128,Piperacillin/Tazobactam
G18000185,EKPN,K.pneumoniae,16,Amikacin
G18000185,EKPN,K.pneumoniae,>=64,Ceftazidime
G18000185,EKPN,K.pneumoniae,>=4,Ciprofloxacin
G18000185,EKPN,K.pneumoniae,16,Ceftriaxone
G18000185,EKPN,K.pneumoniae,>=8,Doripenem
G18000185,EKPN,K.pneumoniae,>=8,Ertapenem
G18000185,EKPN,K.pneumoniae,>=64,Cefepime
G18000185,EKPN,K.pneumoniae,>=64,Cefoxitin
G18000185,EKPN,K.pneumoniae,>=16,Gentamicin
G18000185,EKPN,K.pneumoniae,4,Imipenem
G18000185,EKPN,K.pneumoniae,8,Meropenem
G18000185,EKPN,K.pneumoniae,>=32,Ampicillin/Sulbactam
G18000185,EKPN,K.pneumoniae,>=8,Tigecycline
G18000185,EKPN,K.pneumoniae,>=128,Piperacillin/Tazobactam
G18000188,EKPN,K.pneumoniae,<=2,Amikacin
G18000188,EKPN,K.pneumoniae,>=64,Ceftazidime
G18000188,EKPN,K.pneumoniae,>=4,Ciprofloxacin
G18000188,EKPN,K.pneumoniae,32,Ceftriaxone
G18000188,EKPN,K.pneumoniae,>=8,Doripenem
G18000188,EKPN,K.pneumoniae,4,Ertapenem
G18000188,EKPN,K.pneumoniae,2,Cefepime
G18000188,EKPN,K.pneumoniae,16,Cefoxitin
G18000188,EKPN,K.pneumoniae,<=1,Gentamicin
G18000188,EKPN,K.pneumoniae,8,Imipenem
G18000188,EKPN,K.pneumoniae,>=16,Meropenem
G18000188,EKPN,K.pneumoniae,>=32,Ampicillin/Sulbactam
G18000188,EKPN,K.pneumoniae,>=8,Tigecycline
G18000188,EKPN,K.pneumoniae,>=128,Piperacillin/Tazobactam
G18000189,EKPN,K.pneumoniae,16,Amikacin
G18000189,EKPN,K.pneumoniae,>=64,Ceftazidime
G18000189,EKPN,K.pneumoniae,>=4,Ciprofloxacin
G18000189,EKPN,K.pneumoniae,>=64,Ceftriaxone
G18000189,EKPN,K.pneumoniae,>=8,Doripenem
G18000189,EKPN,K.pneumoniae,>=8,Ertapenem
G18000189,EKPN,K.pneumoniae,>=64,Cefepime
G18000189,EKPN,K.pneumoniae,>=64,Cefoxitin
G18000189,EKPN,K.pneumoniae,>=16,Gentamicin
G18000189,EKPN,K.pneumoniae,8,Imipenem
G18000189,EKPN,K.pneumoniae,>=16,Meropenem
G18000189,EKPN,K.pneumoniae,>=32,Ampicillin/Sulbactam
G18000189,EKPN,K.pneumoniae,2,Tigecycline
G18000189,EKPN,K.pneumoniae,>=128,Piperacillin/Tazobactam
G18000198,EKPN,K.pneumoniae,<=2,Amikacin
G18000198,EKPN,K.pneumoniae,<=1,Ceftazidime
G18000198,EKPN,K.pneumoniae,<=0.25,Ciprofloxacin
G18000198,EKPN,K.pneumoniae,>=64,Ceftriaxone
G18000198,EKPN,K.pneumoniae,4,Doripenem
G18000198,EKPN,K.pneumoniae,4,Ertapenem
G18000198,EKPN,K.pneumoniae,<=1,Cefepime
G18000198,EKPN,K.pneumoniae,<=4,Cefoxitin
G18000198,EKPN,K.pneumoniae,<=1,Gentamicin
G18000198,EKPN,K.pneumoniae,>=16,Imipenem
G18000198,EKPN,K.pneumoniae,>=16,Meropenem
G18000198,EKPN,K.pneumoniae,>=32,Ampicillin/Sulbactam
G18000198,EKPN,K.pneumoniae,<=0.5,Tigecycline
G18000198,EKPN,K.pneumoniae,>=128,Piperacillin/Tazobactam
G18000199,EKPN,K.pneumoniae,<=2,Amikacin
G18000199,EKPN,K.pneumoniae,16,Ceftazidime
G18000199,EKPN,K.pneumoniae,>=4,Ciprofloxacin
G18000199,EKPN,K.pneumoniae,>=64,Ceftriaxone
G18000199,EKPN,K.pneumoniae,>=8,Doripenem
G18000199,EKPN,K.pneumoniae,>=8,Ertapenem
G18000199,EKPN,K.pneumoniae,32,Cefepime
G18000199,EKPN,K.pneumoniae,>=64,Cefoxitin
G18000199,EKPN,K.pneumoniae,<=1,Gentamicin
G18000199,EKPN,K.pneumoniae,>=16,Imipenem
G18000199,EKPN,K.pneumoniae,>=16,Meropenem
G18000199,EKPN,K.pneumoniae,>=32,Ampicillin/Sulbactam
G18000199,EKPN,K.pneumoniae,<=0.5,Tigecycline
G18000199,EKPN,K.pneumoniae,>=128,Piperacillin/Tazobactam
G18000200,EKPN,K.pneumoniae,<=2,Amikacin
G18000200,EKPN,K.pneumoniae,<=1,Ceftazidime
G18000200,EKPN,K.pneumoniae,>=4,Ciprofloxacin
G18000200,EKPN,K.pneumoniae,<=1,Ceftriaxone
G18000200,EKPN,K.pneumoniae,<=0.12,Doripenem
G18000200,EKPN,K.pneumoniae,<=0.5,Ertapenem
G18000200,EKPN,K.pneumoniae,<=1,Cefepime
G18000200,EKPN,K.pneumoniae,<=4,Cefoxitin
G18000200,EKPN,K.pneumoniae,<=1,Gentamicin
G18000200,EKPN,K.pneumoniae,<=0.25,Imipenem
G18000200,EKPN,K.pneumoniae,<=0.25,Meropenem
G18000200,EKPN,K.pneumoniae,8,Ampicillin/Sulbactam
G18000200,EKPN,K.pneumoniae,4,Tigecycline
G18000200,EKPN,K.pneumoniae,<=4,Piperacillin/Tazobactam
G18000201,EKPN,K.pneumoniae,>=64,Amikacin
G18000201,EKPN,K.pneumoniae,>=64,Ceftazidime
G18000201,EKPN,K.pneumoniae,>=4,Ciprofloxacin
G18000201,EKPN,K.pneumoniae,>=64,Ceftriaxone
G18000201,EKPN,K.pneumoniae,>=8,Doripenem
G18000201,EKPN,K.pneumoniae,>=8,Ertapenem
G18000201,EKPN,K.pneumoniae,>=64,Cefepime
G18000201,EKPN,K.pneumoniae,>=64,Cefoxitin
G18000201,EKPN,K.pneumoniae,4,Gentamicin
G18000201,EKPN,K.pneumoniae,>=16,Imipenem
G18000201,EKPN,K.pneumoniae,>=16,Meropenem
G18000201,EKPN,K.pneumoniae,>=32,Ampicillin/Sulbactam
G18000201,EKPN,K.pneumoniae,2,Tigecycline
G18000201,EKPN,K.pneumoniae,>=128,Piperacillin/Tazobactam
G18000202,EKPN,K.pneumoniae,<=2,Amikacin
G18000202,EKPN,K.pneumoniae,16,Ceftazidime
G18000202,EKPN,K.pneumoniae,>=4,Ciprofloxacin
G18000202,EKPN,K.pneumoniae,>=64,Ceftriaxone
G18000202,EKPN,K.pneumoniae,>=8,Doripenem
G18000202,EKPN,K.pneumoniae,>=8,Ertapenem
G18000202,EKPN,K.pneumoniae,2,Cefepime
G18000202,EKPN,K.pneumoniae,<=4,Cefoxitin
G18000202,EKPN,K.pneumoniae,>=16,Gentamicin
G18000202,EKPN,K.pneumoniae,>=16,Imipenem
G18000202,EKPN,K.pneumoniae,>=16,Meropenem
G18000202,EKPN,K.pneumoniae,>=32,Ampicillin/Sulbactam
G18000202,EKPN,K.pneumoniae,1,Tigecycline
G18000202,EKPN,K.pneumoniae,>=128,Piperacillin/Tazobactam
G18000204,EKPN,K.pneumoniae,<=2,Amikacin
G18000204,EKPN,K.pneumoniae,2,Ceftazidime
G18000204,EKPN,K.pneumoniae,<=0.25,Ciprofloxacin
G18000204,EKPN,K.pneumoniae,8,Ceftriaxone
G18000204,EKPN,K.pneumoniae,>=8,Doripenem
G18000204,EKPN,K.pneumoniae,4,Ertapenem
G18000204,EKPN,K.pneumoniae,<=1,Cefepime
G18000204,EKPN,K.pneumoniae,<=4,Cefoxitin
G18000204,EKPN,K.pneumoniae,<=1,Gentamicin
G18000204,EKPN,K.pneumoniae,>=16,Imipenem
G18000204,EKPN,K.pneumoniae,>=16,Meropenem
G18000204,EKPN,K.pneumoniae,>=32,Ampicillin/Sulbactam
G18000204,EKPN,K.pneumoniae,<=0.5,Tigecycline
G18000204,EKPN,K.pneumoniae,>=128,Piperacillin/Tazobactam
G18000218,EKP,K.pneum.pneumoniae,>=64,Amikacin
G18000218,EKP,K.pneum.pneumoniae,>=64,Ceftazidime
G18000218,EKP,K.pneum.pneumoniae,>=4,Ciprofloxacin
G18000218,EKP,K.pneum.pneumoniae,>=64,Ceftriaxone
G18000218,EKP,K.pneum.pneumoniae,>=8,Doripenem
G18000218,EKP,K.pneum.pneumoniae,>=8,Ertapenem
G18000218,EKP,K.pneum.pneumoniae,>=64,Cefepime
G18000218,EKP,K.pneum.pneumoniae,>=64,Cefoxitin
G18000218,EKP,K.pneum.pneumoniae,>=16,Gentamicin
G18000218,EKP,K.pneum.pneumoniae,8,Imipenem
G18000218,EKP,K.pneum.pneumoniae,8,Meropenem
G18000218,EKP,K.pneum.pneumoniae,>=32,Ampicillin/Sulbactam
G18000218,EKP,K.pneum.pneumoniae,4,Tigecycline
G18000218,EKP,K.pneum.pneumoniae,>=128,Piperacillin/Tazobactam
G18000222,EKPN,K.pneumoniae,<=2,Amikacin
G18000222,EKPN,K.pneumoniae,16,Ceftazidime
G18000222,EKPN,K.pneumoniae,>=4,Ciprofloxacin
G18000222,EKPN,K.pneumoniae,>=64,Ceftriaxone
G18000222,EKPN,K.pneumoniae,0.5,Doripenem
G18000222,EKPN,K.pneumoniae,<=0.5,Ertapenem
G18000222,EKPN,K.pneumoniae,4,Cefepime
G18000222,EKPN,K.pneumoniae,<=4,Cefoxitin
G18000222,EKPN,K.pneumoniae,>=16,Gentamicin
G18000222,EKPN,K.pneumoniae,>=16,Imipenem
G18000222,EKPN,K.pneumoniae,>=16,Meropenem
G18000222,EKPN,K.pneumoniae,>=32,Ampicillin/Sulbactam
G18000222,EKPN,K.pneumoniae,4,Tigecycline
G18000222,EKPN,K.pneumoniae,>=128,Piperacillin/Tazobactam
G18000248,EKPN,K.pneumoniae,16,Amikacin
G18000248,EKPN,K.pneumoniae,>=64,Ceftazidime
G18000248,EKPN,K.pneumoniae,>=4,Ciprofloxacin
G18000248,EKPN,K.pneumoniae,>=64,Ceftriaxone
G18000248,EKPN,K.pneumoniae,>=8,Doripenem
G18000248,EKPN,K.pneumoniae,>=8,Ertapenem
G18000248,EKPN,K.pneumoniae,>=64,Cefepime
G18000248,EKPN,K.pneumoniae,>=64,Cefoxitin
G18000248,EKPN,K.pneumoniae,>=16,Gentamicin
G18000248,EKPN,K.pneumoniae,1,Imipenem
G18000248,EKPN,K.pneumoniae,8,Meropenem
G18000248,EKPN,K.pneumoniae,>=32,Ampicillin/Sulbactam
G18000248,EKPN,K.pneumoniae,4,Tigecycline
G18000248,EKPN,K.pneumoniae,>=128,Piperacillin/Tazobactam
G18000260,EKPN,K.pneumoniae,<=2,Amikacin
G18000260,EKPN,K.pneumoniae,>=64,Ceftazidime
G18000260,EKPN,K.pneumoniae,>=4,Ciprofloxacin
G18000260,EKPN,K.pneumoniae,>=64,Ceftriaxone
G18000260,EKPN,K.pneumoniae,>=8,Doripenem
G18000260,EKPN,K.pneumoniae,>=8,Ertapenem
G18000260,EKPN,K.pneumoniae,8,Cefepime
G18000260,EKPN,K.pneumoniae,16,Cefoxitin
G18000260,EKPN,K.pneumoniae,<=1,Gentamicin
G18000260,EKPN,K.pneumoniae,>=16,Imipenem
G18000260,EKPN,K.pneumoniae,>=16,Meropenem
G18000260,EKPN,K.pneumoniae,>=32,Ampicillin/Sulbactam
G18000260,EKPN,K.pneumoniae,2,Tigecycline
G18000260,EKPN,K.pneumoniae,>=128,Piperacillin/Tazobactam
G18000269,EKPN,K.pneumoniae,>=64,Amikacin
G18000269,EKPN,K.pneumoniae,>=64,Ceftazidime
G18000269,EKPN,K.pneumoniae,>=4,Ciprofloxacin
G18000269,EKPN,K.pneumoniae,>=64,Ceftriaxone
G18000269,EKPN,K.pneumoniae,>=8,Doripenem
G18000269,EKPN,K.pneumoniae,>=8,Ertapenem
G18000269,EKPN,K.pneumoniae,>=64,Cefepime
G18000269,EKPN,K.pneumoniae,>=64,Cefoxitin
G18000269,EKPN,K.pneumoniae,>=16,Gentamicin
G18000269,EKPN,K.pneumoniae,8,Imipenem
G18000269,EKPN,K.pneumoniae,>=16,Meropenem
G18000269,EKPN,K.pneumoniae,>=32,Ampicillin/Sulbactam
G18000269,EKPN,K.pneumoniae,2,Tigecycline
G18000269,EKPN,K.pneumoniae,>=128,Piperacillin/Tazobactam
G18000272,EKPN,K.pneumoniae,<=2,Amikacin
G18000272,EKPN,K.pneumoniae,<=1,Ceftazidime
G18000272,EKPN,K.pneumoniae,>=4,Ciprofloxacin
G18000272,EKPN,K.pneumoniae,<=1,Ceftriaxone
G18000272,EKPN,K.pneumoniae,<=0.12,Doripenem
G18000272,EKPN,K.pneumoniae,<=0.5,Ertapenem
G18000272,EKPN,K.pneumoniae,<=1,Cefepime
G18000272,EKPN,K.pneumoniae,>=64,Cefoxitin
G18000272,EKPN,K.pneumoniae,>=16,Gentamicin
G18000272,EKPN,K.pneumoniae,<=0.25,Imipenem
G18000272,EKPN,K.pneumoniae,<=0.25,Meropenem
G18000272,EKPN,K.pneumoniae,>=32,Ampicillin/Sulbactam
G18000272,EKPN,K.pneumoniae,>=8,Tigecycline
G18000272,EKPN,K.pneumoniae,>=128,Piperacillin/Tazobactam
G18000287,EKPN,K.pneumoniae,16,Amikacin
G18000287,EKPN,K.pneumoniae,>=64,Ceftazidime
G18000287,EKPN,K.pneumoniae,>=4,Ciprofloxacin
G18000287,EKPN,K.pneumoniae,>=64,Ceftriaxone
G18000287,EKPN,K.pneumoniae,>=8,Doripenem
G18000287,EKPN,K.pneumoniae,>=8,Ertapenem
G18000287,EKPN,K.pneumoniae,>=64,Cefepime
G18000287,EKPN,K.pneumoniae,>=64,Cefoxitin
G18000287,EKPN,K.pneumoniae,<=1,Gentamicin
G18000287,EKPN,K.pneumoniae,>=16,Imipenem
G18000287,EKPN,K.pneumoniae,>=16,Meropenem
G18000287,EKPN,K.pneumoniae,>=32,Ampicillin/Sulbactam
G18000287,EKPN,K.pneumoniae,>=8,Tigecycline
G18000287,EKPN,K.pneumoniae,>=128,Piperacillin/Tazobactam
G18000293,EKPN,K.pneumoniae,<=2,Amikacin
G18000293,EKPN,K.pneumoniae,<=1,Ceftazidime
G18000293,EKPN,K.pneumoniae,2,Ciprofloxacin
G18000293,EKPN,K.pneumoniae,<=1,Ceftriaxone
G18000293,EKPN,K.pneumoniae,>=8,Doripenem
G18000293,EKPN,K.pneumoniae,<=0.5,Ertapenem
G18000293,EKPN,K.pneumoniae,<=1,Cefepime
G18000293,EKPN,K.pneumoniae,<=4,Cefoxitin
G18000293,EKPN,K.pneumoniae,<=1,Gentamicin
G18000293,EKPN,K.pneumoniae,8,Imipenem
G18000293,EKPN,K.pneumoniae,>=16,Meropenem
G18000293,EKPN,K.pneumoniae,>=32,Ampicillin/Sulbactam
G18000293,EKPN,K.pneumoniae,<=0.5,Tigecycline
G18000293,EKPN,K.pneumoniae,>=128,Piperacillin/Tazobactam
G18000312,EKPN,K.pneumoniae,<=2,Amikacin
G18000312,EKPN,K.pneumoniae,2,Ceftazidime
G18000312,EKPN,K.pneumoniae,<=0.25,Ciprofloxacin
G18000312,EKPN,K.pneumoniae,16,Ceftriaxone
G18000312,EKPN,K.pneumoniae,>=8,Doripenem
G18000312,EKPN,K.pneumoniae,4,Ertapenem
G18000312,EKPN,K.pneumoniae,2,Cefepime
G18000312,EKPN,K.pneumoniae,<=4,Cefoxitin
G18000312,EKPN,K.pneumoniae,<=1,Gentamicin
G18000312,EKPN,K.pneumoniae,8,Imipenem
G18000312,EKPN,K.pneumoniae,>=16,Meropenem
G18000312,EKPN,K.pneumoniae,>=32,Ampicillin/Sulbactam
G18000312,EKPN,K.pneumoniae,<=0.5,Tigecycline
G18000312,EKPN,K.pneumoniae,>=128,Piperacillin/Tazobactam
G18000322,EKPN,K.pneumoniae,16,Amikacin
G18000322,EKPN,K.pneumoniae,>=64,Ceftazidime
G18000322,EKPN,K.pneumoniae,>=4,Ciprofloxacin
G18000322,EKPN,K.pneumoniae,>=64,Ceftriaxone
G18000322,EKPN,K.pneumoniae,>=8,Doripenem
G18000322,EKPN,K.pneumoniae,>=8,Ertapenem
G18000322,EKPN,K.pneumoniae,>=64,Cefepime
G18000322,EKPN,K.pneumoniae,>=64,Cefoxitin
G18000322,EKPN,K.pneumoniae,>=16,Gentamicin
G18000322,EKPN,K.pneumoniae,>=16,Imipenem
G18000322,EKPN,K.pneumoniae,>=16,Meropenem
G18000322,EKPN,K.pneumoniae,>=32,Ampicillin/Sulbactam
G18000322,EKPN,K.pneumoniae,<=0.5,Tigecycline
G18000322,EKPN,K.pneumoniae,>=128,Piperacillin/Tazobactam
G18000327,EKPN,K.pneumoniae,<=2,Amikacin
G18000327,EKPN,K.pneumoniae,2,Ceftazidime
G18000327,EKPN,K.pneumoniae,<=0.25,Ciprofloxacin
G18000327,EKPN,K.pneumoniae,>=64,Ceftriaxone
G18000327,EKPN,K.pneumoniae,>=8,Doripenem
G18000327,EKPN,K.pneumoniae,<=0.5,Ertapenem
G18000327,EKPN,K.pneumoniae,2,Cefepime
G18000327,EKPN,K.pneumoniae,<=4,Cefoxitin
G18000327,EKPN,K.pneumoniae,<=1,Gentamicin
G18000327,EKPN,K.pneumoniae,8,Imipenem
G18000327,EKPN,K.pneumoniae,>=16,Meropenem
G18000327,EKPN,K.pneumoniae,>=32,Ampicillin/Sulbactam
G18000327,EKPN,K.pneumoniae,<=0.5,Tigecycline
G18000327,EKPN,K.pneumoniae,>=128,Piperacillin/Tazobactam
G18000344,EKPN,K.pneumoniae,4,Amikacin
G18000344,EKPN,K.pneumoniae,4,Ceftazidime
G18000344,EKPN,K.pneumoniae,<=0.25,Ciprofloxacin
G18000344,EKPN,K.pneumoniae,>=64,Ceftriaxone
G18000344,EKPN,K.pneumoniae,<=0.12,Doripenem
G18000344,EKPN,K.pneumoniae,<=0.5,Ertapenem
G18000344,EKPN,K.pneumoniae,2,Cefepime
G18000344,EKPN,K.pneumoniae,<=4,Cefoxitin
G18000344,EKPN,K.pneumoniae,>=16,Gentamicin
G18000344,EKPN,K.pneumoniae,<=0.25,Imipenem
G18000344,EKPN,K.pneumoniae,<=0.25,Meropenem
G18000344,EKPN,K.pneumoniae,>=32,Ampicillin/Sulbactam
G18000344,EKPN,K.pneumoniae,<=0.5,Tigecycline
G18000344,EKPN,K.pneumoniae,<=4,Piperacillin/Tazobactam
G18000350,EKPN,K.pneumoniae,>=64,Amikacin
G18000350,EKPN,K.pneumoniae,>=64,Ceftazidime
G18000350,EKPN,K.pneumoniae,>=4,Ciprofloxacin
G18000350,EKPN,K.pneumoniae,>=64,Ceftriaxone
G18000350,EKPN,K.pneumoniae,>=8,Doripenem
G18000350,EKPN,K.pneumoniae,>=8,Ertapenem
G18000350,EKPN,K.pneumoniae,>=64,Cefepime
G18000350,EKPN,K.pneumoniae,>=64,Cefoxitin
G18000350,EKPN,K.pneumoniae,4,Gentamicin
G18000350,EKPN,K.pneumoniae,>=16,Imipenem
G18000350,EKPN,K.pneumoniae,>=16,Meropenem
G18000350,EKPN,K.pneumoniae,>=32,Ampicillin/Sulbactam
G18000350,EKPN,K.pneumoniae,2,Tigecycline
G18000350,EKPN,K.pneumoniae,>=128,Piperacillin/Tazobactam
G18000351,EKPN,K.pneumoniae,>=64,Amikacin
G18000351,EKPN,K.pneumoniae,>=64,Ceftazidime
G18000351,EKPN,K.pneumoniae,>=4,Ciprofloxacin
G18000351,EKPN,K.pneumoniae,>=64,Ceftriaxone
G18000351,EKPN,K.pneumoniae,>=8,Doripenem
G18000351,EKPN,K.pneumoniae,>=8,Ertapenem
G18000351,EKPN,K.pneumoniae,>=64,Cefepime
G18000351,EKPN,K.pneumoniae,>=64,Cefoxitin
G18000351,EKPN,K.pneumoniae,8,Gentamicin
G18000351,EKPN,K.pneumoniae,>=16,Imipenem
G18000351,EKPN,K.pneumoniae,>=16,Meropenem
G18000351,EKPN,K.pneumoniae,>=32,Ampicillin/Sulbactam
G18000351,EKPN,K.pneumoniae,2,Tigecycline
G18000351,EKPN,K.pneumoniae,>=128,Piperacillin/Tazobactam
G18000369,EKPN,K.pneumoniae,<=2,Amikacin
G18000369,EKPN,K.pneumoniae,<=1,Ceftazidime
G18000369,EKPN,K.pneumoniae,>=4,Ciprofloxacin
G18000369,EKPN,K.pneumoniae,<=1,Ceftriaxone
G18000369,EKPN,K.pneumoniae,<=0.12,Doripenem
G18000369,EKPN,K.pneumoniae,<=0.5,Ertapenem
G18000369,EKPN,K.pneumoniae,<=1,Cefepime
G18000369,EKPN,K.pneumoniae,<=4,Cefoxitin
G18000369,EKPN,K.pneumoniae,>=16,Gentamicin
G18000369,EKPN,K.pneumoniae,<=0.25,Imipenem
G18000369,EKPN,K.pneumoniae,<=0.25,Meropenem
G18000369,EKPN,K.pneumoniae,>=32,Ampicillin/Sulbactam
G18000369,EKPN,K.pneumoniae,<=0.5,Tigecycline
G18000369,EKPN,K.pneumoniae,8,Piperacillin/Tazobactam
G18000379,EKPN,K.pneumoniae,16,Amikacin
G18000379,EKPN,K.pneumoniae,>=64,Ceftazidime
G18000379,EKPN,K.pneumoniae,>=4,Ciprofloxacin
G18000379,EKPN,K.pneumoniae,>=64,Ceftriaxone
G18000379,EKPN,K.pneumoniae,>=8,Doripenem
G18000379,EKPN,K.pneumoniae,>=8,Ertapenem
G18000379,EKPN,K.pneumoniae,>=64,Cefepime
G18000379,EKPN,K.pneumoniae,>=64,Cefoxitin
G18000379,EKPN,K.pneumoniae,>=16,Gentamicin
G18000379,EKPN,K.pneumoniae,8,Imipenem
G18000379,EKPN,K.pneumoniae,>=16,Meropenem
G18000379,EKPN,K.pneumoniae,>=32,Ampicillin/Sulbactam
G18000379,EKPN,K.pneumoniae,1,Tigecycline
G18000379,EKPN,K.pneumoniae,>=128,Piperacillin/Tazobactam
G18000384,EKPN,K.pneumoniae,16,Amikacin
G18000384,EKPN,K.pneumoniae,>=64,Ceftazidime
G18000384,EKPN,K.pneumoniae,>=4,Ciprofloxacin
G18000384,EKPN,K.pneumoniae,>=64,Ceftriaxone
G18000384,EKPN,K.pneumoniae,>=8,Doripenem
G18000384,EKPN,K.pneumoniae,>=8,Ertapenem
G18000384,EKPN,K.pneumoniae,>=64,Cefepime
G18000384,EKPN,K.pneumoniae,>=64,Cefoxitin
G18000384,EKPN,K.pneumoniae,>=16,Gentamicin
G18000384,EKPN,K.pneumoniae,8,Imipenem
G18000384,EKPN,K.pneumoniae,>=16,Meropenem
G18000384,EKPN,K.pneumoniae,>=32,Ampicillin/Sulbactam
G18000384,EKPN,K.pneumoniae,2,Tigecycline
G18000384,EKPN,K.pneumoniae,>=128,Piperacillin/Tazobactam
G18000415,EKPN,K.pneumoniae,>=64,Amikacin
G18000415,EKPN,K.pneumoniae,>=64,Ceftazidime
G18000415,EKPN,K.pneumoniae,<=0.25,Ciprofloxacin
G18000415,EKPN,K.pneumoniae,16,Ceftriaxone
G18000415,EKPN,K.pneumoniae,4,Doripenem
G18000415,EKPN,K.pneumoniae,>=8,Ertapenem
G18000415,EKPN,K.pneumoniae,2,Cefepime
G18000415,EKPN,K.pneumoniae,>=64,Cefoxitin
G18000415,EKPN,K.pneumoniae,4,Gentamicin
G18000415,EKPN,K.pneumoniae,8,Imipenem
G18000415,EKPN,K.pneumoniae,8,Meropenem
G18000415,EKPN,K.pneumoniae,>=32,Ampicillin/Sulbactam
G18000415,EKPN,K.pneumoniae,>=8,Tigecycline
G18000415,EKPN,K.pneumoniae,>=128,Piperacillin/Tazobactam
G18000427,EKPN,K.pneumoniae,8,Amikacin
G18000427,EKPN,K.pneumoniae,>=64,Ceftazidime
G18000427,EKPN,K.pneumoniae,>=4,Ciprofloxacin
G18000427,EKPN,K.pneumoniae,>=64,Ceftriaxone
G18000427,EKPN,K.pneumoniae,>=8,Doripenem
G18000427,EKPN,K.pneumoniae,1,Ertapenem
G18000427,EKPN,K.pneumoniae,2,Cefepime
G18000427,EKPN,K.pneumoniae,16,Cefoxitin
G18000427,EKPN,K.pneumoniae,>=16,Gentamicin
G18000427,EKPN,K.pneumoniae,8,Imipenem
G18000427,EKPN,K.pneumoniae,>=16,Meropenem
G18000427,EKPN,K.pneumoniae,>=32,Ampicillin/Sulbactam
G18000427,EKPN,K.pneumoniae,>=8,Tigecycline
G18000427,EKPN,K.pneumoniae,>=128,Piperacillin/Tazobactam
G18000437,EKPN,K.pneumoniae,<=2,Amikacin
G18000437,EKPN,K.pneumoniae,>=64,Ceftazidime
G18000437,EKPN,K.pneumoniae,>=4,Ciprofloxacin
G18000437,EKPN,K.pneumoniae,>=64,Ceftriaxone
G18000437,EKPN,K.pneumoniae,>=8,Doripenem
G18000437,EKPN,K.pneumoniae,>=8,Ertapenem
G18000437,EKPN,K.pneumoniae,32,Cefepime
G18000437,EKPN,K.pneumoniae,>=64,Cefoxitin
G18000437,EKPN,K.pneumoniae,<=1,Gentamicin
G18000437,EKPN,K.pneumoniae,8,Imipenem
G18000437,EKPN,K.pneumoniae,8,Meropenem
G18000437,EKPN,K.pneumoniae,>=32,Ampicillin/Sulbactam
G18000437,EKPN,K.pneumoniae,<=0.5,Tigecycline
G18000437,EKPN,K.pneumoniae,TRM,Piperacillin/Tazobactam
G18000439,EKPN,K.pneumoniae,16,Amikacin
G18000439,EKPN,K.pneumoniae,>=64,Ceftazidime
G18000439,EKPN,K.pneumoniae,>=4,Ciprofloxacin
G18000439,EKPN,K.pneumoniae,>=64,Ceftriaxone
G18000439,EKPN,K.pneumoniae,>=8,Doripenem
G18000439,EKPN,K.pneumoniae,>=8,Ertapenem
G18000439,EKPN,K.pneumoniae,>=64,Cefepime
G18000439,EKPN,K.pneumoniae,>=64,Cefoxitin
G18000439,EKPN,K.pneumoniae,>=16,Gentamicin
G18000439,EKPN,K.pneumoniae,8,Imipenem
G18000439,EKPN,K.pneumoniae,>=16,Meropenem
G18000439,EKPN,K.pneumoniae,>=32,Ampicillin/Sulbactam
G18000439,EKPN,K.pneumoniae,1,Tigecycline
G18000439,EKPN,K.pneumoniae,>=128,Piperacillin/Tazobactam
G18000448,EKPN,K.pneumoniae,4,Amikacin
G18000448,EKPN,K.pneumoniae,>=64,Ceftazidime
G18000448,EKPN,K.pneumoniae,1,Ciprofloxacin
G18000448,EKPN,K.pneumoniae,>=64,Ceftriaxone
G18000448,EKPN,K.pneumoniae,4,Doripenem
G18000448,EKPN,K.pneumoniae,4,Ertapenem
G18000448,EKPN,K.pneumoniae,4,Cefepime
G18000448,EKPN,K.pneumoniae,>=64,Cefoxitin
G18000448,EKPN,K.pneumoniae,8,Gentamicin
G18000448,EKPN,K.pneumoniae,8,Imipenem
G18000448,EKPN,K.pneumoniae,>=16,Meropenem
G18000448,EKPN,K.pneumoniae,>=32,Ampicillin/Sulbactam
G18000448,EKPN,K.pneumoniae,>=8,Tigecycline
G18000448,EKPN,K.pneumoniae,>=128,Piperacillin/Tazobactam
G18000449,EKPN,K.pneumoniae,4,Amikacin
G18000449,EKPN,K.pneumoniae,>=64,Ceftazidime
G18000449,EKPN,K.pneumoniae,1,Ciprofloxacin
G18000449,EKPN,K.pneumoniae,>=64,Ceftriaxone
G18000449,EKPN,K.pneumoniae,4,Doripenem
G18000449,EKPN,K.pneumoniae,4,Ertapenem
G18000449,EKPN,K.pneumoniae,8,Cefepime
G18000449,EKPN,K.pneumoniae,>=64,Cefoxitin
G18000449,EKPN,K.pneumoniae,8,Gentamicin
G18000449,EKPN,K.pneumoniae,4,Imipenem
G18000449,EKPN,K.pneumoniae,1,Meropenem
G18000449,EKPN,K.pneumoniae,>=32,Ampicillin/Sulbactam
G18000449,EKPN,K.pneumoniae,>=8,Tigecycline
G18000449,EKPN,K.pneumoniae,>=128,Piperacillin/Tazobactam
G18000450,EKPN,K.pneumoniae,<=2,Amikacin
G18000450,EKPN,K.pneumoniae,2,Ceftazidime
G18000450,EKPN,K.pneumoniae,<=0.25,Ciprofloxacin
G18000450,EKPN,K.pneumoniae,8,Ceftriaxone
G18000450,EKPN,K.pneumoniae,1,Doripenem
G18000450,EKPN,K.pneumoniae,4,Ertapenem
G18000450,EKPN,K.pneumoniae,<=1,Cefepime
G18000450,EKPN,K.pneumoniae,<=4,Cefoxitin
G18000450,EKPN,K.pneumoniae,<=1,Gentamicin
G18000450,EKPN,K.pneumoniae,8,Imipenem
G18000450,EKPN,K.pneumoniae,>=16,Meropenem
G18000450,EKPN,K.pneumoniae,>=32,Ampicillin/Sulbactam
G18000450,EKPN,K.pneumoniae,<=0.5,Tigecycline
G18000450,EKPN,K.pneumoniae,>=128,Piperacillin/Tazobactam
G18000484,EKPN,K.pneumoniae,>=64,Amikacin
G18000484,EKPN,K.pneumoniae,>=64,Ceftazidime
G18000484,EKPN,K.pneumoniae,>=4,Ciprofloxacin
G18000484,EKPN,K.pneumoniae,>=64,Ceftriaxone
G18000484,EKPN,K.pneumoniae,>=8,Doripenem
G18000484,EKPN,K.pneumoniae,>=8,Ertapenem
G18000484,EKPN,K.pneumoniae,>=64,Cefepime
G18000484,EKPN,K.pneumoniae,>=64,Cefoxitin
G18000484,EKPN,K.pneumoniae,>=16,Gentamicin
G18000484,EKPN,K.pneumoniae,>=16,Imipenem
G18000484,EKPN,K.pneumoniae,>=16,Meropenem
G18000484,EKPN,K.pneumoniae,>=32,Ampicillin/Sulbactam
G18000484,EKPN,K.pneumoniae,2,Tigecycline
G18000484,EKPN,K.pneumoniae,>=128,Piperacillin/Tazobactam
G18000491,EKPN,K.pneumoniae,<=2,Amikacin
G18000491,EKPN,K.pneumoniae,4,Ceftazidime
G18000491,EKPN,K.pneumoniae,<=0.25,Ciprofloxacin
G18000491,EKPN,K.pneumoniae,>=64,Ceftriaxone
G18000491,EKPN,K.pneumoniae,4,Doripenem
G18000491,EKPN,K.pneumoniae,>=8,Ertapenem
G18000491,EKPN,K.pneumoniae,<=1,Cefepime
G18000491,EKPN,K.pneumoniae,<=4,Cefoxitin
G18000491,EKPN,K.pneumoniae,<=1,Gentamicin
G18000491,EKPN,K.pneumoniae,8,Imipenem
G18000491,EKPN,K.pneumoniae,>=16,Meropenem
G18000491,EKPN,K.pneumoniae,>=32,Ampicillin/Sulbactam
G18000491,EKPN,K.pneumoniae,<=0.5,Tigecycline
G18000491,EKPN,K.pneumoniae,>=128,Piperacillin/Tazobactam
G18000492,EKPN,K.pneumoniae,<=2,Amikacin
G18000492,EKPN,K.pneumoniae,4,Ceftazidime
G18000492,EKPN,K.pneumoniae,<=0.25,Ciprofloxacin
G18000492,EKPN,K.pneumoniae,>=64,Ceftriaxone
G18000492,EKPN,K.pneumoniae,>=8,Doripenem
G18000492,EKPN,K.pneumoniae,>=8,Ertapenem
G18000492,EKPN,K.pneumoniae,<=1,Cefepime
G18000492,EKPN,K.pneumoniae,<=4,Cefoxitin
G18000492,EKPN,K.pneumoniae,<=1,Gentamicin
G18000492,EKPN,K.pneumoniae,>=16,Imipenem
G18000492,EKPN,K.pneumoniae,>=16,Meropenem
G18000492,EKPN,K.pneumoniae,>=32,Ampicillin/Sulbactam
G18000492,EKPN,K.pneumoniae,<=0.5,Tigecycline
G18000492,EKPN,K.pneumoniae,>=128,Piperacillin/Tazobactam
G18000500,EKPN,K.pneumoniae,<=2,Amikacin
G18000500,EKPN,K.pneumoniae,4,Ceftazidime
G18000500,EKPN,K.pneumoniae,0.5,Ciprofloxacin
G18000500,EKPN,K.pneumoniae,8,Ceftriaxone
G18000500,EKPN,K.pneumoniae,>=8,Doripenem
G18000500,EKPN,K.pneumoniae,>=8,Ertapenem
G18000500,EKPN,K.pneumoniae,<=1,Cefepime
G18000500,EKPN,K.pneumoniae,<=4,Cefoxitin
G18000500,EKPN,K.pneumoniae,>=16,Gentamicin
G18000500,EKPN,K.pneumoniae,>=16,Imipenem
G18000500,EKPN,K.pneumoniae,>=16,Meropenem
G18000500,EKPN,K.pneumoniae,>=32,Ampicillin/Sulbactam
G18000500,EKPN,K.pneumoniae,<=0.5,Tigecycline
G18000500,EKPN,K.pneumoniae,>=128,Piperacillin/Tazobactam
G18000521,EKPN,K.pneumoniae,16,Amikacin
G18000521,EKPN,K.pneumoniae,16,Ceftazidime
G18000521,EKPN,K.pneumoniae,<=0.25,Ciprofloxacin
G18000521,EKPN,K.pneumoniae,>=64,Ceftriaxone
G18000521,EKPN,K.pneumoniae,0.25,Doripenem
G18000521,EKPN,K.pneumoniae,<=0.5,Ertapenem
G18000521,EKPN,K.pneumoniae,>=64,Cefepime
G18000521,EKPN,K.pneumoniae,8,Cefoxitin
G18000521,EKPN,K.pneumoniae,8,Gentamicin
G18000521,EKPN,K.pneumoniae,<=0.25,Imipenem
G18000521,EKPN,K.pneumoniae,<=0.25,Meropenem
G18000521,EKPN,K.pneumoniae,>=32,Ampicillin/Sulbactam
G18000521,EKPN,K.pneumoniae,<=0.5,Tigecycline
G18000521,EKPN,K.pneumoniae,>=128,Piperacillin/Tazobactam
G18000626,EKP,K.pneum.pneumoniae,>=64,Amikacin
G18000626,EKP,K.pneum.pneumoniae,>=64,Ceftazidime
G18000626,EKP,K.pneum.pneumoniae,<=0.25,Ciprofloxacin
G18000626,EKP,K.pneum.pneumoniae,32,Ceftriaxone
G18000626,EKP,K.pneum.pneumoniae,4,Doripenem
G18000626,EKP,K.pneum.pneumoniae,4,Ertapenem
G18000626,EKP,K.pneum.pneumoniae,2,Cefepime
G18000626,EKP,K.pneum.pneumoniae,>=64,Cefoxitin
G18000626,EKP,K.pneum.pneumoniae,<=1,Gentamicin
G18000626,EKP,K.pneum.pneumoniae,8,Imipenem
G18000626,EKP,K.pneum.pneumoniae,>=16,Meropenem
G18000626,EKP,K.pneum.pneumoniae,>=32,Ampicillin/Sulbactam
G18000626,EKP,K.pneum.pneumoniae,2,Tigecycline
G18000626,EKP,K.pneum.pneumoniae,64,Piperacillin/Tazobactam
G18000821,EKP,K.pneum.pneumoniae,16,Amikacin
G18000821,EKP,K.pneum.pneumoniae,>=64,Ceftazidime
G18000821,EKP,K.pneum.pneumoniae,>=4,Ciprofloxacin
G18000821,EKP,K.pneum.pneumoniae,>=64,Ceftriaxone
G18000821,EKP,K.pneum.pneumoniae,4,Doripenem
G18000821,EKP,K.pneum.pneumoniae,4,Ertapenem
G18000821,EKP,K.pneum.pneumoniae,8,Cefepime
G18000821,EKP,K.pneum.pneumoniae,>=64,Cefoxitin
G18000821,EKP,K.pneum.pneumoniae,8,Gentamicin
G18000821,EKP,K.pneum.pneumoniae,>=16,Imipenem
G18000821,EKP,K.pneum.pneumoniae,>=16,Meropenem
G18000821,EKP,K.pneum.pneumoniae,>=32,Ampicillin/Sulbactam
G18000821,EKP,K.pneum.pneumoniae,2,Tigecycline
G18000821,EKP,K.pneum.pneumoniae,>=128,Piperacillin/Tazobactam
G18000822,EKP,K.pneum.pneumoniae,16,Amikacin
G18000822,EKP,K.pneum.pneumoniae,>=64,Ceftazidime
G18000822,EKP,K.pneum.pneumoniae,>=4,Ciprofloxacin
G18000822,EKP,K.pneum.pneumoniae,>=64,Ceftriaxone
G18000822,EKP,K.pneum.pneumoniae,>=8,Doripenem
G18000822,EKP,K.pneum.pneumoniae,>=8,Ertapenem
G18000822,EKP,K.pneum.pneumoniae,>=64,Cefepime
G18000822,EKP,K.pneum.pneumoniae,>=64,Cefoxitin
G18000822,EKP,K.pneum.pneumoniae,>=16,Gentamicin
G18000822,EKP,K.pneum.pneumoniae,8,Imipenem
G18000822,EKP,K.pneum.pneumoniae,>=16,Meropenem
G18000822,EKP,K.pneum.pneumoniae,>=32,Ampicillin/Sulbactam
G18000822,EKP,K.pneum.pneumoniae,2,Tigecycline
G18000822,EKP,K.pneum.pneumoniae,>=128,Piperacillin/Tazobactam
G18000823,EKP,K.pneum.pneumoniae,16,Amikacin
G18000823,EKP,K.pneum.pneumoniae,>=64,Ceftazidime
G18000823,EKP,K.pneum.pneumoniae,>=4,Ciprofloxacin
G18000823,EKP,K.pneum.pneumoniae,>=64,Ceftriaxone
G18000823,EKP,K.pneum.pneumoniae,>=8,Doripenem
G18000823,EKP,K.pneum.pneumoniae,>=8,Ertapenem
G18000823,EKP,K.pneum.pneumoniae,>=64,Cefepime
G18000823,EKP,K.pneum.pneumoniae,>=64,Cefoxitin
G18000823,EKP,K.pneum.pneumoniae,>=16,Gentamicin
G18000823,EKP,K.pneum.pneumoniae,8,Imipenem
G18000823,EKP,K.pneum.pneumoniae,>=16,Meropenem
G18000823,EKP,K.pneum.pneumoniae,>=32,Ampicillin/Sulbactam
G18000823,EKP,K.pneum.pneumoniae,2,Tigecycline
G18000823,EKP,K.pneum.pneumoniae,>=128,Piperacillin/Tazobactam
G18000828,EKP,K.pneum.pneumoniae,32,Amikacin
G18000828,EKP,K.pneum.pneumoniae,>=64,Ceftazidime
G18000828,EKP,K.pneum.pneumoniae,>=4,Ciprofloxacin
G18000828,EKP,K.pneum.pneumoniae,>=64,Ceftriaxone
G18000828,EKP,K.pneum.pneumoniae,0.25,Doripenem
G18000828,EKP,K.pneum.pneumoniae,4,Ertapenem
G18000828,EKP,K.pneum.pneumoniae,>=64,Cefepime
G18000828,EKP,K.pneum.pneumoniae,16,Cefoxitin
G18000828,EKP,K.pneum.pneumoniae,>=16,Gentamicin
G18000828,EKP,K.pneum.pneumoniae,<=0.25,Imipenem
G18000828,EKP,K.pneum.pneumoniae,0.5,Meropenem
G18000828,EKP,K.pneum.pneumoniae,>=32,Ampicillin/Sulbactam
G18000828,EKP,K.pneum.pneumoniae,1,Tigecycline
G18000828,EKP,K.pneum.pneumoniae,>=128,Piperacillin/Tazobactam
G18000831,EKP,K.pneum.pneumoniae,<=2,Amikacin
G18000831,EKP,K.pneum.pneumoniae,>=64,Ceftazidime
G18000831,EKP,K.pneum.pneumoniae,>=4,Ciprofloxacin
G18000831,EKP,K.pneum.pneumoniae,>=64,Ceftriaxone
G18000831,EKP,K.pneum.pneumoniae,>=8,Doripenem
G18000831,EKP,K.pneum.pneumoniae,<=0.5,Ertapenem
G18000831,EKP,K.pneum.pneumoniae,>=64,Cefepime
G18000831,EKP,K.pneum.pneumoniae,16,Cefoxitin
G18000831,EKP,K.pneum.pneumoniae,8,Gentamicin
G18000831,EKP,K.pneum.pneumoniae,>=16,Imipenem
G18000831,EKP,K.pneum.pneumoniae,>=16,Meropenem
G18000831,EKP,K.pneum.pneumoniae,>=32,Ampicillin/Sulbactam
G18000831,EKP,K.pneum.pneumoniae,1,Tigecycline
G18000831,EKP,K.pneum.pneumoniae,>=128,Piperacillin/Tazobactam
G18000837,EKPN,K.pneumoniae,<=2,Amikacin
G18000837,EKPN,K.pneumoniae,>=64,Ceftazidime
G18000837,EKPN,K.pneumoniae,<=0.25,Ciprofloxacin
G18000837,EKPN,K.pneumoniae,>=64,Ceftriaxone
G18000837,EKPN,K.pneumoniae,2,Doripenem
G18000837,EKPN,K.pneumoniae,>=8,Ertapenem
G18000837,EKPN,K.pneumoniae,>=64,Cefepime
G18000837,EKPN,K.pneumoniae,32,Cefoxitin
G18000837,EKPN,K.pneumoniae,<=1,Gentamicin
G18000837,EKPN,K.pneumoniae,>=16,Imipenem
G18000837,EKPN,K.pneumoniae,>=16,Meropenem
G18000837,EKPN,K.pneumoniae,>=32,Ampicillin/Sulbactam
G18000837,EKPN,K.pneumoniae,>=8,Tigecycline
G18000837,EKPN,K.pneumoniae,>=128,Piperacillin/Tazobactam
G18000847,EKPN,K.pneumoniae,<=2,Amikacin
G18000847,EKPN,K.pneumoniae,4,Ceftazidime
G18000847,EKPN,K.pneumoniae,2,Ciprofloxacin
G18000847,EKPN,K.pneumoniae,16,Ceftriaxone
G18000847,EKPN,K.pneumoniae,4,Doripenem
G18000847,EKPN,K.pneumoniae,>=8,Ertapenem
G18000847,EKPN,K.pneumoniae,<=1,Cefepime
G18000847,EKPN,K.pneumoniae,<=4,Cefoxitin
G18000847,EKPN,K.pneumoniae,<=1,Gentamicin
G18000847,EKPN,K.pneumoniae,8,Imipenem
G18000847,EKPN,K.pneumoniae,>=16,Meropenem
G18000847,EKPN,K.pneumoniae,>=32,Ampicillin/Sulbactam
G18000847,EKPN,K.pneumoniae,1,Tigecycline
G18000847,EKPN,K.pneumoniae,>=128,Piperacillin/Tazobactam
G18000881,EKPN,K.pneumoniae,>=64,Amikacin
G18000881,EKPN,K.pneumoniae,>=64,Ceftazidime
G18000881,EKPN,K.pneumoniae,>=4,Ciprofloxacin
G18000881,EKPN,K.pneumoniae,16,Ceftriaxone
G18000881,EKPN,K.pneumoniae,>=8,Doripenem
G18000881,EKPN,K.pneumoniae,4,Ertapenem
G18000881,EKPN,K.pneumoniae,<=1,Cefepime
G18000881,EKPN,K.pneumoniae,>=64,Cefoxitin
G18000881,EKPN,K.pneumoniae,<=1,Gentamicin
G18000881,EKPN,K.pneumoniae,8,Imipenem
G18000881,EKPN,K.pneumoniae,>=16,Meropenem
G18000881,EKPN,K.pneumoniae,>=32,Ampicillin/Sulbactam
G18000881,EKPN,K.pneumoniae,<=0.5,Tigecycline
G18000881,EKPN,K.pneumoniae,>=128,Piperacillin/Tazobactam
G180001112,EKP,K.pneum.pneumoniae,<=2,Amikacin
G180001112,EKP,K.pneum.pneumoniae,<=1,Ceftazidime
G180001112,EKP,K.pneum.pneumoniae,2,Ciprofloxacin
G180001112,EKP,K.pneum.pneumoniae,>=64,Ceftriaxone
G180001112,EKP,K.pneum.pneumoniae,2,Doripenem
G180001112,EKP,K.pneum.pneumoniae,<=0.5,Ertapenem
G180001112,EKP,K.pneum.pneumoniae,<=1,Cefepime
G180001112,EKP,K.pneum.pneumoniae,<=4,Cefoxitin
G180001112,EKP,K.pneum.pneumoniae,<=1,Gentamicin
G180001112,EKP,K.pneum.pneumoniae,0.5,Imipenem
G180001112,EKP,K.pneum.pneumoniae,>=16,Meropenem
G180001112,EKP,K.pneum.pneumoniae,>=32,Ampicillin/Sulbactam
G180001112,EKP,K.pneum.pneumoniae,1,Tigecycline
G180001112,EKP,K.pneum.pneumoniae,>=128,Piperacillin/Tazobactam
G180001134,EKP,K.pneum.pneumoniae,16,Amikacin
G180001134,EKP,K.pneum.pneumoniae,>=64,Ceftazidime
G180001134,EKP,K.pneum.pneumoniae,>=4,Ciprofloxacin
G180001134,EKP,K.pneum.pneumoniae,>=64,Ceftriaxone
G180001134,EKP,K.pneum.pneumoniae,>=8,Doripenem
G180001134,EKP,K.pneum.pneumoniae,>=8,Ertapenem
G180001134,EKP,K.pneum.pneumoniae,>=64,Cefepime
G180001134,EKP,K.pneum.pneumoniae,>=64,Cefoxitin
G180001134,EKP,K.pneum.pneumoniae,>=16,Gentamicin
G180001134,EKP,K.pneum.pneumoniae,8,Imipenem
G180001134,EKP,K.pneum.pneumoniae,>=16,Meropenem
G180001134,EKP,K.pneum.pneumoniae,>=32,Ampicillin/Sulbactam
G180001134,EKP,K.pneum.pneumoniae,2,Tigecycline
G180001134,EKP,K.pneum.pneumoniae,>=128,Piperacillin/Tazobactam
G180001137,EKP,K.pneum.pneumoniae,<=2,Amikacin
G180001137,EKP,K.pneum.pneumoniae,>=64,Ceftazidime
G180001137,EKP,K.pneum.pneumoniae,2,Ciprofloxacin
G180001137,EKP,K.pneum.pneumoniae,>=64,Ceftriaxone
G180001137,EKP,K.pneum.pneumoniae,4,Doripenem
G180001137,EKP,K.pneum.pneumoniae,4,Ertapenem
G180001137,EKP,K.pneum.pneumoniae,2,Cefepime
G180001137,EKP,K.pneum.pneumoniae,>=64,Cefoxitin
G180001137,EKP,K.pneum.pneumoniae,>=16,Gentamicin
G180001137,EKP,K.pneum.pneumoniae,>=16,Imipenem
G180001137,EKP,K.pneum.pneumoniae,>=16,Meropenem
G180001137,EKP,K.pneum.pneumoniae,>=32,Ampicillin/Sulbactam
G180001137,EKP,K.pneum.pneumoniae,2,Tigecycline
G180001137,EKP,K.pneum.pneumoniae,>=128,Piperacillin/Tazobactam
G180001145,EKP,K.pneum.pneumoniae,16,Amikacin
G180001145,EKP,K.pneum.pneumoniae,>=64,Ceftazidime
G180001145,EKP,K.pneum.pneumoniae,>=4,Ciprofloxacin
G180001145,EKP,K.pneum.pneumoniae,>=64,Ceftriaxone
G180001145,EKP,K.pneum.pneumoniae,>=8,Doripenem
G180001145,EKP,K.pneum.pneumoniae,>=8,Ertapenem
G180001145,EKP,K.pneum.pneumoniae,>=64,Cefepime
G180001145,EKP,K.pneum.pneumoniae,>=64,Cefoxitin
G180001145,EKP,K.pneum.pneumoniae,>=16,Gentamicin
G180001145,EKP,K.pneum.pneumoniae,8,Imipenem
G180001145,EKP,K.pneum.pneumoniae,>=16,Meropenem
G180001145,EKP,K.pneum.pneumoniae,>=32,Ampicillin/Sulbactam
G180001145,EKP,K.pneum.pneumoniae,1,Tigecycline
G180001145,EKP,K.pneum.pneumoniae,>=128,Piperacillin/Tazobactam
G180001153,EKP,K.pneum.pneumoniae,>=64,Amikacin
G180001153,EKP,K.pneum.pneumoniae,>=64,Ceftazidime
G180001153,EKP,K.pneum.pneumoniae,>=4,Ciprofloxacin
G180001153,EKP,K.pneum.pneumoniae,>=64,Ceftriaxone
G180001153,EKP,K.pneum.pneumoniae,>=8,Doripenem
G180001153,EKP,K.pneum.pneumoniae,>=8,Ertapenem
G180001153,EKP,K.pneum.pneumoniae,>=64,Cefepime
G180001153,EKP,K.pneum.pneumoniae,>=64,Cefoxitin
G180001153,EKP,K.pneum.pneumoniae,>=16,Gentamicin
G180001153,EKP,K.pneum.pneumoniae,>=16,Imipenem
G180001153,EKP,K.pneum.pneumoniae,>=16,Meropenem
G180001153,EKP,K.pneum.pneumoniae,>=32,Ampicillin/Sulbactam
G180001153,EKP,K.pneum.pneumoniae,>=8,Tigecycline
G180001153,EKP,K.pneum.pneumoniae,>=128,Piperacillin/Tazobactam
G180001156,EKP,K.pneum.pneumoniae,16,Amikacin
G180001156,EKP,K.pneum.pneumoniae,>=64,Ceftazidime
G180001156,EKP,K.pneum.pneumoniae,1,Ciprofloxacin
G180001156,EKP,K.pneum.pneumoniae,>=64,Ceftriaxone
G180001156,EKP,K.pneum.pneumoniae,>=8,Doripenem
G180001156,EKP,K.pneum.pneumoniae,>=8,Ertapenem
G180001156,EKP,K.pneum.pneumoniae,>=64,Cefepime
G180001156,EKP,K.pneum.pneumoniae,>=64,Cefoxitin
G180001156,EKP,K.pneum.pneumoniae,>=16,Gentamicin
G180001156,EKP,K.pneum.pneumoniae,8,Imipenem
G180001156,EKP,K.pneum.pneumoniae,>=16,Meropenem
G180001156,EKP,K.pneum.pneumoniae,>=32,Ampicillin/Sulbactam
G180001156,EKP,K.pneum.pneumoniae,<=0.5,Tigecycline
G180001156,EKP,K.pneum.pneumoniae,>=128,Piperacillin/Tazobactam
G180001157,EKP,K.pneum.pneumoniae,>=64,Amikacin
G180001157,EKP,K.pneum.pneumoniae,>=64,Ceftazidime
G180001157,EKP,K.pneum.pneumoniae,>=4,Ciprofloxacin
G180001157,EKP,K.pneum.pneumoniae,>=64,Ceftriaxone
G180001157,EKP,K.pneum.pneumoniae,>=8,Doripenem
G180001157,EKP,K.pneum.pneumoniae,>=8,Ertapenem
G180001157,EKP,K.pneum.pneumoniae,>=64,Cefepime
G180001157,EKP,K.pneum.pneumoniae,>=64,Cefoxitin
G180001157,EKP,K.pneum.pneumoniae,4,Gentamicin
G180001157,EKP,K.pneum.pneumoniae,8,Imipenem
G180001157,EKP,K.pneum.pneumoniae,>=16,Meropenem
G180001157,EKP,K.pneum.pneumoniae,>=32,Ampicillin/Sulbactam
G180001157,EKP,K.pneum.pneumoniae,<=0.5,Tigecycline
G180001157,EKP,K.pneum.pneumoniae,>=128,Piperacillin/Tazobactam
G180001158,EKP,K.pneum.pneumoniae,<=2,Amikacin
G180001158,EKP,K.pneum.pneumoniae,>=64,Ceftazidime
G180001158,EKP,K.pneum.pneumoniae,<=0.25,Ciprofloxacin
G180001158,EKP,K.pneum.pneumoniae,>=64,Ceftriaxone
G180001158,EKP,K.pneum.pneumoniae,>=8,Doripenem
G180001158,EKP,K.pneum.pneumoniae,>=8,Ertapenem
G180001158,EKP,K.pneum.pneumoniae,>=64,Cefepime
G180001158,EKP,K.pneum.pneumoniae,8,Cefoxitin
G180001158,EKP,K.pneum.pneumoniae,>=16,Gentamicin
G180001158,EKP,K.pneum.pneumoniae,>=16,Imipenem
G180001158,EKP,K.pneum.pneumoniae,>=16,Meropenem
G180001158,EKP,K.pneum.pneumoniae,>=32,Ampicillin/Sulbactam
G180001158,EKP,K.pneum.pneumoniae,<=0.5,Tigecycline
G180001158,EKP,K.pneum.pneumoniae,>=128,Piperacillin/Tazobactam
G180001161,EKP,K.pneum.pneumoniae,>=64,Amikacin
G180001161,EKP,K.pneum.pneumoniae,>=64,Ceftazidime
G180001161,EKP,K.pneum.pneumoniae,>=4,Ciprofloxacin
G180001161,EKP,K.pneum.pneumoniae,>=64,Ceftriaxone
G180001161,EKP,K.pneum.pneumoniae,>=8,Doripenem
G180001161,EKP,K.pneum.pneumoniae,>=8,Ertapenem
G180001161,EKP,K.pneum.pneumoniae,>=64,Cefepime
G180001161,EKP,K.pneum.pneumoniae,>=64,Cefoxitin
G180001161,EKP,K.pneum.pneumoniae,>=16,Gentamicin
G180001161,EKP,K.pneum.pneumoniae,8,Imipenem
G180001161,EKP,K.pneum.pneumoniae,>=16,Meropenem
G180001161,EKP,K.pneum.pneumoniae,>=32,Ampicillin/Sulbactam
G180001161,EKP,K.pneum.pneumoniae,<=0.5,Tigecycline
G180001161,EKP,K.pneum.pneumoniae,>=128,Piperacillin/Tazobactam
G180001162,EKP,K.pneum.pneumoniae,>=64,Amikacin
G180001162,EKP,K.pneum.pneumoniae,>=64,Ceftazidime
G180001162,EKP,K.pneum.pneumoniae,>=4,Ciprofloxacin
G180001162,EKP,K.pneum.pneumoniae,>=64,Ceftriaxone
G180001162,EKP,K.pneum.pneumoniae,>=8,Doripenem
G180001162,EKP,K.pneum.pneumoniae,>=8,Ertapenem
G180001162,EKP,K.pneum.pneumoniae,16,Cefepime
G180001162,EKP,K.pneum.pneumoniae,>=64,Cefoxitin
G180001162,EKP,K.pneum.pneumoniae,>=16,Gentamicin
G180001162,EKP,K.pneum.pneumoniae,8,Imipenem
G180001162,EKP,K.pneum.pneumoniae,>=16,Meropenem
G180001162,EKP,K.pneum.pneumoniae,>=32,Ampicillin/Sulbactam
G180001162,EKP,K.pneum.pneumoniae,<=0.5,Tigecycline
G180001162,EKP,K.pneum.pneumoniae,>=128,Piperacillin/Tazobactam
G180001166,EKP,K.pneum.pneumoniae,<=2,Amikacin
G180001166,EKP,K.pneum.pneumoniae,>=64,Ceftazidime
G180001166,EKP,K.pneum.pneumoniae,>=4,Ciprofloxacin
G180001166,EKP,K.pneum.pneumoniae,>=64,Ceftriaxone
G180001166,EKP,K.pneum.pneumoniae,>=8,Doripenem
G180001166,EKP,K.pneum.pneumoniae,>=8,Ertapenem
G180001166,EKP,K.pneum.pneumoniae,>=64,Cefepime
G180001166,EKP,K.pneum.pneumoniae,>=64,Cefoxitin
G180001166,EKP,K.pneum.pneumoniae,>=16,Gentamicin
G180001166,EKP,K.pneum.pneumoniae,>=16,Imipenem
G180001166,EKP,K.pneum.pneumoniae,>=16,Meropenem
G180001166,EKP,K.pneum.pneumoniae,>=32,Ampicillin/Sulbactam
G180001166,EKP,K.pneum.pneumoniae,2,Tigecycline
G180001166,EKP,K.pneum.pneumoniae,>=128,Piperacillin/Tazobactam
G180001167,EKP,K.pneum.pneumoniae,>=64,Amikacin
G180001167,EKP,K.pneum.pneumoniae,>=64,Ceftazidime
G180001167,EKP,K.pneum.pneumoniae,>=4,Ciprofloxacin
G180001167,EKP,K.pneum.pneumoniae,>=64,Ceftriaxone
G180001167,EKP,K.pneum.pneumoniae,>=8,Doripenem
G180001167,EKP,K.pneum.pneumoniae,>=8,Ertapenem
G180001167,EKP,K.pneum.pneumoniae,>=64,Cefepime
G180001167,EKP,K.pneum.pneumoniae,>=64,Cefoxitin
G180001167,EKP,K.pneum.pneumoniae,<=1,Gentamicin
G180001167,EKP,K.pneum.pneumoniae,>=16,Imipenem
G180001167,EKP,K.pneum.pneumoniae,>=16,Meropenem
G180001167,EKP,K.pneum.pneumoniae,>=32,Ampicillin/Sulbactam
G180001167,EKP,K.pneum.pneumoniae,<=0.5,Tigecycline
G180001167,EKP,K.pneum.pneumoniae,>=128,Piperacillin/Tazobactam
G18004500,MAU,Staph.aureus,<=0.5,Ciprofloxacin
G18004500,MAU,Staph.aureus,>=8,Clindamycin
G18004500,MAU,Staph.aureus,>=8,Erythromycin
G18004500,MAU,Staph.aureus,32,Nitrofurantoin
G18004500,MAU,Staph.aureus,<=0.5,Gentamicin
G18004500,MAU,Staph.aureus,0.25,Levofloxacin
G18004500,MAU,Staph.aureus,2,Linezolid
G18004500,MAU,Staph.aureus,<=0.5,Minocycline
G18004500,MAU,Staph.aureus,<=0.25,Moxifloxacin
G18004500,MAU,Staph.aureus,>=4,Oxacillin
G18004500,MAU,Staph.aureus,0.5,Quinupristin/Dalfopristin
G18004500,MAU,Staph.aureus,1,Rifampicin
G18004500,MAU,Staph.aureus,<=10,Trimethoprim/Sulfamethoxazole
G18004500,MAU,Staph.aureus,<=1,Tetracycline
G18004500,MAU,Staph.aureus,<=0.5,Teicoplanin
G18004500,MAU,Staph.aureus,>=32,Vancomycin
G18004501,MAU,Staph.aureus,<=0.5,Ciprofloxacin
G18004501,MAU,Staph.aureus,2,Clindamycin
G18004501,MAU,Staph.aureus,<=0.25,Erythromycin
G18004501,MAU,Staph.aureus,<=16,Nitrofurantoin
G18004501,MAU,Staph.aureus,<=0.5,Gentamicin
G18004501,MAU,Staph.aureus,<=0.12,Levofloxacin
G18004501,MAU,Staph.aureus,2,Linezolid
G18004501,MAU,Staph.aureus,1,Minocycline
G18004501,MAU,Staph.aureus,<=0.25,Moxifloxacin
G18004501,MAU,Staph.aureus,>=4,Oxacillin
G18004501,MAU,Staph.aureus,<=0.25,Quinupristin/Dalfopristin
G18004501,MAU,Staph.aureus,1,Rifampicin
G18004501,MAU,Staph.aureus,<=10,Trimethoprim/Sulfamethoxazole
G18004501,MAU,Staph.aureus,<=1,Tetracycline
G18004501,MAU,Staph.aureus,<=0.5,Teicoplanin
G18004501,MAU,Staph.aureus,>=32,Vancomycin
G18004504,MAU,Staph.aureus,<=0.5,Ciprofloxacin
G18004504,MAU,Staph.aureus,4,Clindamycin
G18004504,MAU,Staph.aureus,<=0.25,Erythromycin
G18004504,MAU,Staph.aureus,<=16,Nitrofurantoin
G18004504,MAU,Staph.aureus,<=0.5,Gentamicin
G18004504,MAU,Staph.aureus,<=0.12,Levofloxacin
G18004504,MAU,Staph.aureus,1,Linezolid
G18004504,MAU,Staph.aureus,1,Minocycline
G18004504,MAU,Staph.aureus,<=0.25,Moxifloxacin
G18004504,MAU,Staph.aureus,>=4,Oxacillin
G18004504,MAU,Staph.aureus,<=0.25,Quinupristin/Dalfopristin
G18004504,MAU,Staph.aureus,1,Rifampicin
G18004504,MAU,Staph.aureus,<=10,Trimethoprim/Sulfamethoxazole
G18004504,MAU,Staph.aureus,<=1,Tetracycline
G18004504,MAU,Staph.aureus,<=0.5,Teicoplanin
G18004504,MAU,Staph.aureus,>=32,Vancomycin
G18004506,MAU,Staph.aureus,<=0.5,Ciprofloxacin
G18004506,MAU,Staph.aureus,2,Clindamycin
G18004506,MAU,Staph.aureus,<=0.25,Erythromycin
G18004506,MAU,Staph.aureus,32,Nitrofurantoin
G18004506,MAU,Staph.aureus,<=0.5,Gentamicin
G18004506,MAU,Staph.aureus,<=0.12,Levofloxacin
G18004506,MAU,Staph.aureus,2,Linezolid
G18004506,MAU,Staph.aureus,<=0.5,Minocycline
G18004506,MAU,Staph.aureus,<=0.25,Moxifloxacin
G18004506,MAU,Staph.aureus,>=4,Oxacillin
G18004506,MAU,Staph.aureus,<=0.25,Quinupristin/Dalfopristin
G18004506,MAU,Staph.aureus,>=32,Rifampicin
G18004506,MAU,Staph.aureus,<=10,Trimethoprim/Sulfamethoxazole
G18004506,MAU,Staph.aureus,<=1,Tetracycline
G18004506,MAU,Staph.aureus,<=0.5,Teicoplanin
G18004506,MAU,Staph.aureus,>=32,Vancomycin
G18004507,MAU,Staph.aureus,>=8,Ciprofloxacin
G18004507,MAU,Staph.aureus,>=8,Clindamycin
G18004507,MAU,Staph.aureus,>=8,Erythromycin
G18004507,MAU,Staph.aureus,<=16,Nitrofurantoin
G18004507,MAU,Staph.aureus,<=0.5,Gentamicin
G18004507,MAU,Staph.aureus,>=8,Levofloxacin
G18004507,MAU,Staph.aureus,>=8,Linezolid
G18004507,MAU,Staph.aureus,1,Minocycline
G18004507,MAU,Staph.aureus,4,Moxifloxacin
G18004507,MAU,Staph.aureus,>=4,Oxacillin
G18004507,MAU,Staph.aureus,0.5,Quinupristin/Dalfopristin
G18004507,MAU,Staph.aureus,1,Rifampicin
G18004507,MAU,Staph.aureus,<=10,Trimethoprim/Sulfamethoxazole
G18004507,MAU,Staph.aureus,<=1,Tetracycline
G18004507,MAU,Staph.aureus,<=0.5,Teicoplanin
G18004507,MAU,Staph.aureus,>=32,Vancomycin
G18004509,MAU,Staph.aureus,<=0.5,Ciprofloxacin
G18004509,MAU,Staph.aureus,<=0.25,Clindamycin
G18004509,MAU,Staph.aureus,1,Erythromycin
G18004509,MAU,Staph.aureus,<=16,Nitrofurantoin
G18004509,MAU,Staph.aureus,<=0.5,Gentamicin
G18004509,MAU,Staph.aureus,<=0.12,Levofloxacin
G18004509,MAU,Staph.aureus,2,Linezolid
G18004509,MAU,Staph.aureus,<=0.5,Minocycline
G18004509,MAU,Staph.aureus,<=0.25,Moxifloxacin
G18004509,MAU,Staph.aureus,>=4,Oxacillin
G18004509,MAU,Staph.aureus,<=0.25,Quinupristin/Dalfopristin
G18004509,MAU,Staph.aureus,<=0.5,Rifampicin
G18004509,MAU,Staph.aureus,<=10,Trimethoprim/Sulfamethoxazole
G18004509,MAU,Staph.aureus,>=16,Tetracycline
G18004509,MAU,Staph.aureus,<=0.5,Teicoplanin
G18004509,MAU,Staph.aureus,>=32,Vancomycin
G18004512,MAU,Staph.aureus,<=0.5,Ciprofloxacin
G18004512,MAU,Staph.aureus,<=0.25,Clindamycin
G18004512,MAU,Staph.aureus,>=8,Erythromycin
G18004512,MAU,Staph.aureus,32,Nitrofurantoin
G18004512,MAU,Staph.aureus,<=0.5,Gentamicin
G18004512,MAU,Staph.aureus,0.25,Levofloxacin
G18004512,MAU,Staph.aureus,2,Linezolid
G18004512,MAU,Staph.aureus,<=0.5,Minocycline
G18004512,MAU,Staph.aureus,<=0.25,Moxifloxacin
G18004512,MAU,Staph.aureus,>=4,Oxacillin
G18004512,MAU,Staph.aureus,<=0.25,Quinupristin/Dalfopristin
G18004512,MAU,Staph.aureus,<=0.5,Rifampicin
G18004512,MAU,Staph.aureus,<=10,Trimethoprim/Sulfamethoxazole
G18004512,MAU,Staph.aureus,>=16,Tetracycline
G18004512,MAU,Staph.aureus,<=0.5,Teicoplanin
G18004512,MAU,Staph.aureus,1,Vancomycin
G18004515,MAU,Staph.aureus,<=0.5,Ciprofloxacin
G18004515,MAU,Staph.aureus,<=0.25,Clindamycin
G18004515,MAU,Staph.aureus,<=0.25,Erythromycin
G18004515,MAU,Staph.aureus,<=16,Nitrofurantoin
G18004515,MAU,Staph.aureus,<=0.5,Gentamicin
G18004515,MAU,Staph.aureus,<=0.12,Levofloxacin
G18004515,MAU,Staph.aureus,2,Linezolid
G18004515,MAU,Staph.aureus,<=0.5,Minocycline
G18004515,MAU,Staph.aureus,<=0.25,Moxifloxacin
G18004515,MAU,Staph.aureus,>=4,Oxacillin
G18004515,MAU,Staph.aureus,<=0.25,Quinupristin/Dalfopristin
G18004515,MAU,Staph.aureus,<=0.5,Rifampicin
G18004515,MAU,Staph.aureus,<=10,Trimethoprim/Sulfamethoxazole
G18004515,MAU,Staph.aureus,<=1,Tetracycline
G18004515,MAU,Staph.aureus,<=0.5,Teicoplanin
G18004515,MAU,Staph.aureus,>=32,Vancomycin
G18004518,MAU,Staph.aureus,<=0.5,Ciprofloxacin
G18004518,MAU,Staph.aureus,<=0.25,Clindamycin
G18004518,MAU,Staph.aureus,<=0.25,Erythromycin
G18004518,MAU,Staph.aureus,<=16,Nitrofurantoin
G18004518,MAU,Staph.aureus,<=0.5,Gentamicin
G18004518,MAU,Staph.aureus,<=0.12,Levofloxacin
G18004518,MAU,Staph.aureus,1,Linezolid
G18004518,MAU,Staph.aureus,<=0.5,Minocycline
G18004518,MAU,Staph.aureus,<=0.25,Moxifloxacin
G18004518,MAU,Staph.aureus,>=4,Oxacillin
G18004518,MAU,Staph.aureus,<=0.25,Quinupristin/Dalfopristin
G18004518,MAU,Staph.aureus,<=0.5,Rifampicin
G18004518,MAU,Staph.aureus,<=10,Trimethoprim/Sulfamethoxazole
G18004518,MAU,Staph.aureus,<=1,Tetracycline
G18004518,MAU,Staph.aureus,<=0.5,Teicoplanin
G18004518,MAU,Staph.aureus,>=32,Vancomycin
G18004519,MAU,Staph.aureus,>=8,Ciprofloxacin
G18004519,MAU,Staph.aureus,>=8,Clindamycin
G18004519,MAU,Staph.aureus,>=8,Erythromycin
G18004519,MAU,Staph.aureus,<=16,Nitrofurantoin
G18004519,MAU,Staph.aureus,<=0.5,Gentamicin
G18004519,MAU,Staph.aureus,4,Levofloxacin
G18004519,MAU,Staph.aureus,>=8,Linezolid
G18004519,MAU,Staph.aureus,4,Minocycline
G18004519,MAU,Staph.aureus,2,Moxifloxacin
G18004519,MAU,Staph.aureus,>=4,Oxacillin
G18004519,MAU,Staph.aureus,8,Quinupristin/Dalfopristin
G18004519,MAU,Staph.aureus,>=32,Rifampicin
G18004519,MAU,Staph.aureus,<=10,Trimethoprim/Sulfamethoxazole
G18004519,MAU,Staph.aureus,<=1,Tetracycline
G18004519,MAU,Staph.aureus,>=32,Teicoplanin
G18004519,MAU,Staph.aureus,>=32,Vancomycin
G18004525,MAU,Staph.aureus,<=0.5,Ciprofloxacin
G18004525,MAU,Staph.aureus,2,Clindamycin
G18004525,MAU,Staph.aureus,<=0.25,Erythromycin
G18004525,MAU,Staph.aureus,<=16,Nitrofurantoin
G18004525,MAU,Staph.aureus,<=0.5,Gentamicin
G18004525,MAU,Staph.aureus,<=0.12,Levofloxacin
G18004525,MAU,Staph.aureus,2,Linezolid
G18004525,MAU,Staph.aureus,<=0.5,Minocycline
G18004525,MAU,Staph.aureus,<=0.25,Moxifloxacin
G18004525,MAU,Staph.aureus,>=4,Oxacillin
G18004525,MAU,Staph.aureus,<=0.25,Quinupristin/Dalfopristin
G18004525,MAU,Staph.aureus,1,Rifampicin
G18004525,MAU,Staph.aureus,<=10,Trimethoprim/Sulfamethoxazole
G18004525,MAU,Staph.aureus,>=16,Tetracycline
G18004525,MAU,Staph.aureus,<=0.5,Teicoplanin
G18004525,MAU,Staph.aureus,>=32,Vancomycin
G18004528,MAU,Staph.aureus,<=0.5,Ciprofloxacin
G18004528,MAU,Staph.aureus,2,Clindamycin
G18004528,MAU,Staph.aureus,>=8,Erythromycin
G18004528,MAU,Staph.aureus,<=16,Nitrofurantoin
G18004528,MAU,Staph.aureus,<=0.5,Gentamicin
G18004528,MAU,Staph.aureus,<=0.12,Levofloxacin
G18004528,MAU,Staph.aureus,2,Linezolid
G18004528,MAU,Staph.aureus,<=0.5,Minocycline
G18004528,MAU,Staph.aureus,<=0.25,Moxifloxacin
G18004528,MAU,Staph.aureus,>=4,Oxacillin
G18004528,MAU,Staph.aureus,<=0.25,Quinupristin/Dalfopristin
G18004528,MAU,Staph.aureus,1,Rifampicin
G18004528,MAU,Staph.aureus,>=320,Trimethoprim/Sulfamethoxazole
G18004528,MAU,Staph.aureus,<=1,Tetracycline
G18004528,MAU,Staph.aureus,<=0.5,Teicoplanin
G18004528,MAU,Staph.aureus,>=32,Vancomycin
G18004533,MAU,Staph.aureus,<=0.5,Ciprofloxacin
G18004533,MAU,Staph.aureus,2,Clindamycin
G18004533,MAU,Staph.aureus,<=0.25,Erythromycin
G18004533,MAU,Staph.aureus,<=16,Nitrofurantoin
G18004533,MAU,Staph.aureus,<=0.5,Gentamicin
G18004533,MAU,Staph.aureus,<=0.12,Levofloxacin
G18004533,MAU,Staph.aureus,2,Linezolid
G18004533,MAU,Staph.aureus,<=0.5,Minocycline
G18004533,MAU,Staph.aureus,<=0.25,Moxifloxacin
G18004533,MAU,Staph.aureus,>=4,Oxacillin
G18004533,MAU,Staph.aureus,<=0.25,Quinupristin/Dalfopristin
G18004533,MAU,Staph.aureus,1,Rifampicin
G18004533,MAU,Staph.aureus,<=10,Trimethoprim/Sulfamethoxazole
G18004533,MAU,Staph.aureus,<=1,Tetracycline
G18004533,MAU,Staph.aureus,<=0.5,Teicoplanin
G18004533,MAU,Staph.aureus,>=32,Vancomycin
G18004537,MAU,Staph.aureus,<=0.5,Ciprofloxacin
G18004537,MAU,Staph.aureus,2,Clindamycin
G18004537,MAU,Staph.aureus,<=0.25,Erythromycin
G18004537,MAU,Staph.aureus,<=16,Nitrofurantoin
G18004537,MAU,Staph.aureus,<=0.5,Gentamicin
G18004537,MAU,Staph.aureus,<=0.12,Levofloxacin
G18004537,MAU,Staph.aureus,2,Linezolid
G18004537,MAU,Staph.aureus,<=0.5,Minocycline
G18004537,MAU,Staph.aureus,<=0.25,Moxifloxacin
G18004537,MAU,Staph.aureus,>=4,Oxacillin
G18004537,MAU,Staph.aureus,<=0.25,Quinupristin/Dalfopristin
G18004537,MAU,Staph.aureus,1,Rifampicin
G18004537,MAU,Staph.aureus,<=10,Trimethoprim/Sulfamethoxazole
G18004537,MAU,Staph.aureus,<=1,Tetracycline
G18004537,MAU,Staph.aureus,<=0.5,Teicoplanin
G18004537,MAU,Staph.aureus,>=32,Vancomycin
G18004617,MAU,Staph.aureus,<=0.5,Ciprofloxacin
G18004617,MAU,Staph.aureus,<=0.25,Clindamycin
G18004617,MAU,Staph.aureus,<=0.25,Erythromycin
G18004617,MAU,Staph.aureus,<=16,Nitrofurantoin
G18004617,MAU,Staph.aureus,<=0.5,Gentamicin
G18004617,MAU,Staph.aureus,<=0.12,Levofloxacin
G18004617,MAU,Staph.aureus,2,Linezolid
G18004617,MAU,Staph.aureus,<=0.5,Minocycline
G18004617,MAU,Staph.aureus,<=0.25,Moxifloxacin
G18004617,MAU,Staph.aureus,>=4,Oxacillin
G18004617,MAU,Staph.aureus,0.5,Quinupristin/Dalfopristin
G18004617,MAU,Staph.aureus,1,Rifampicin
G18004617,MAU,Staph.aureus,<=10,Trimethoprim/Sulfamethoxazole
G18004617,MAU,Staph.aureus,>=16,Tetracycline
G18004617,MAU,Staph.aureus,<=0.5,Teicoplanin
G18004617,MAU,Staph.aureus,>=32,Vancomycin
G18004620,MAU,Staph.aureus,<=0.5,Ciprofloxacin
G18004620,MAU,Staph.aureus,<=0.25,Clindamycin
G18004620,MAU,Staph.aureus,<=0.25,Erythromycin
G18004620,MAU,Staph.aureus,<=16,Nitrofurantoin
G18004620,MAU,Staph.aureus,<=0.5,Gentamicin
G18004620,MAU,Staph.aureus,<=0.12,Levofloxacin
G18004620,MAU,Staph.aureus,2,Linezolid
G18004620,MAU,Staph.aureus,<=0.5,Minocycline
G18004620,MAU,Staph.aureus,<=0.25,Moxifloxacin
G18004620,MAU,Staph.aureus,>=4,Oxacillin
G18004620,MAU,Staph.aureus,<=0.25,Quinupristin/Dalfopristin
G18004620,MAU,Staph.aureus,<=0.5,Rifampicin
G18004620,MAU,Staph.aureus,<=10,Trimethoprim/Sulfamethoxazole
G18004620,MAU,Staph.aureus,<=1,Tetracycline
G18004620,MAU,Staph.aureus,<=0.5,Teicoplanin
G18004620,MAU,Staph.aureus,>=32,Vancomycin