"ID","Organism.Code","Organism.Name","Amikacin","Ceftazidime","Ciprofloxacin","Ceftriaxone","Doripenem","Ertapenem","Cefepime","Cefoxitin","Gentamicin","Imipenem","Meropenem","Ampicillin/Sulbactam","Tigecycline","Piperacillin/Tazobactam"
"G18000015","EKPN","K.pneumoniae",NA,NA,NA,NA,NA,NA,NA,NA,"S",NA,NA,NA,NA,NA
"G18000020","EKPN","K.pneumoniae",NA,NA,NA,NA,NA,NA,NA,NA,"R",NA,NA,NA,NA,NA
"G18000021","EKPN","K.pneumoniae",NA,NA,NA,NA,NA,NA,NA,NA,"R",NA,NA,NA,NA,NA
"G18000023","EKPN","K.pneumoniae",NA,NA,NA,NA,NA,NA,NA,NA,"R",NA,NA,NA,NA,NA
"G18000024","EKPN","K.pneumoniae",NA,NA,NA,NA,NA,NA,NA,NA,"R",NA,NA,NA,NA,NA
"G18000027","EKPN","K.pneumoniae",NA,NA,NA,NA,NA,NA,NA,NA,"R",NA,NA,NA,NA,NA
"G18000031","EKPN","K.pneumoniae",NA,NA,NA,NA,NA,NA,NA,NA,"S",NA,NA,NA,NA,NA
"G18000049","EKPN","K.pneumoniae",NA,NA,NA,NA,NA,NA,NA,NA,"S",NA,NA,NA,NA,NA
"G18000059","EKPN","K.pneumoniae",NA,NA,NA,NA,NA,NA,NA,NA,"R",NA,NA,NA,NA,NA
"G18000063","EKPN","K.pneumoniae",NA,NA,NA,NA,NA,NA,NA,NA,"R",NA,NA,NA,NA,NA
"G18000065","EKPN","K.pneumoniae",NA,NA,NA,NA,NA,NA,NA,NA,"S",NA,NA,NA,NA,NA
"G18000086","EKPN","K.pneumoniae",NA,NA,NA,NA,NA,NA,NA,NA,"R",NA,NA,NA,NA,NA
"G18000098","EKPN","K.pneumoniae",NA,NA,NA,NA,NA,NA,NA,NA,"S",NA,NA,NA,NA,NA
"G18000137","EKPN","K.pneumoniae",NA,NA,NA,NA,NA,NA,NA,NA,"I",NA,NA,NA,NA,NA
"G18000141","EKPN","K.pneumoniae",NA,NA,NA,NA,NA,NA,NA,NA,"R",NA,NA,NA,NA,NA
"G18000145","EKPN","K.pneumoniae",NA,NA,NA,NA,NA,NA,NA,NA,"R",NA,NA,NA,NA,NA
"G18000146","EKPN","K.pneumoniae",NA,NA,NA,NA,NA,NA,NA,NA,"S",NA,NA,NA,NA,NA
"G18000159","EKPN","K.pneumoniae",NA,NA,NA,NA,NA,NA,NA,NA,"S",NA,NA,NA,NA,NA
"G18000160","EKPN","K.pneumoniae",NA,NA,NA,NA,NA,NA,NA,NA,"R",NA,NA,NA,NA,NA
"G18000164","EKPN","K.pneumoniae",NA,NA,NA,NA,NA,NA,NA,NA,"R",NA,NA,NA,NA,NA
"G18000165","EKPN","K.pneumoniae",NA,NA,NA,NA,NA,NA,NA,NA,"R",NA,NA,NA,NA,NA
"G18000167","EKPN","K.pneumoniae",NA,NA,NA,NA,NA,NA,NA,NA,"R",NA,NA,NA,NA,NA
"G18000169","EKPN","K.pneumoniae",NA,NA,NA,NA,NA,NA,NA,NA,"S",NA,NA,NA,NA,NA
"G18000172","EKPN","K.pneumoniae",NA,NA,NA,NA,NA,NA,NA,NA,"R",NA,NA,NA,NA,NA
"G18000175","EKPN","K.pneumoniae",NA,NA,NA,NA,NA,NA,NA,NA,"S",NA,NA,NA,NA,NA
"G18000177","EKPN","K.pneumoniae",NA,NA,NA,NA,NA,NA,NA,NA,"R",NA,NA,NA,NA,NA
"G18000181","EKPN","K.pneumoniae",NA,NA,NA,NA,NA,NA,NA,NA,"S",NA,NA,NA,NA,NA
"G18000183","EKPN","K.pneumoniae",NA,NA,NA,NA,NA,NA,NA,NA,"R",NA,NA,NA,NA,NA
"G18000184","EKPN","K.pneumoniae",NA,NA,NA,NA,NA,NA,NA,NA,"S",NA,NA,NA,NA,NA
"G18000185","EKPN","K.pneumoniae",NA,NA,NA,NA,NA,NA,NA,NA,"R",NA,NA,NA,NA,NA
"G18000188","EKPN","K.pneumoniae",NA,NA,NA,NA,NA,NA,NA,NA,"S",NA,NA,NA,NA,NA
"G18000189","EKPN","K.pneumoniae",NA,NA,NA,NA,NA,NA,NA,NA,"R",NA,NA,NA,NA,NA
"G18000198","EKPN","K.pneumoniae",NA,NA,NA,NA,NA,NA,NA,NA,"S",NA,NA,NA,NA,NA
"G18000199","EKPN","K.pneumoniae",NA,NA,NA,NA,NA,NA,NA,NA,"S",NA,NA,NA,NA,NA
"G18000200","EKPN","K.pneumoniae",NA,NA,NA,NA,NA,NA,NA,NA,"S",NA,NA,NA,NA,NA
"G18000201","EKPN","K.pneumoniae",NA,NA,NA,NA,NA,NA,NA,NA,"I",NA,NA,NA,NA,NA
"G18000202","EKPN","K.pneumoniae",NA,NA,NA,NA,NA,NA,NA,NA,"R",NA,NA,NA,NA,NA
"G18000204","EKPN","K.pneumoniae",NA,NA,NA,NA,NA,NA,NA,NA,"S",NA,NA,NA,NA,NA
"G18000222","EKPN","K.pneumoniae",NA,NA,NA,NA,NA,NA,NA,NA,"R",NA,NA,NA,NA,NA
"G18000248","EKPN","K.pneumoniae",NA,NA,NA,NA,NA,NA,NA,NA,"R",NA,NA,NA,NA,NA
"G18000260","EKPN","K.pneumoniae",NA,NA,NA,NA,NA,NA,NA,NA,"S",NA,NA,NA,NA,NA
"G18000269","EKPN","K.pneumoniae",NA,NA,NA,NA,NA,NA,NA,NA,"R",NA,NA,NA,NA,NA
"G18000272","EKPN","K.pneumoniae",NA,NA,NA,NA,NA,NA,NA,NA,"R",NA,NA,NA,NA,NA
"G18000287","EKPN","K.pneumoniae",NA,NA,NA,NA,NA,NA,NA,NA,"S",NA,NA,NA,NA,NA
"G18000293","EKPN","K.pneumoniae",NA,NA,NA,NA,NA,NA,NA,NA,"S",NA,NA,NA,NA,NA
"G18000312","EKPN","K.pneumoniae",NA,NA,NA,NA,NA,NA,NA,NA,"S",NA,NA,NA,NA,NA
"G18000322","EKPN","K.pneumoniae",NA,NA,NA,NA,NA,NA,NA,NA,"R",NA,NA,NA,NA,NA
"G18000327","EKPN","K.pneumoniae",NA,NA,NA,NA,NA,NA,NA,NA,"S",NA,NA,NA,NA,NA
"G18000344","EKPN","K.pneumoniae",NA,NA,NA,NA,NA,NA,NA,NA,"R",NA,NA,NA,NA,NA
"G18000350","EKPN","K.pneumoniae",NA,NA,NA,NA,NA,NA,NA,NA,"I",NA,NA,NA,NA,NA
"G18000351","EKPN","K.pneumoniae",NA,NA,NA,NA,NA,NA,NA,NA,"R",NA,NA,NA,NA,NA
"G18000369","EKPN","K.pneumoniae",NA,NA,NA,NA,NA,NA,NA,NA,"R",NA,NA,NA,NA,NA
"G18000379","EKPN","K.pneumoniae",NA,NA,NA,NA,NA,NA,NA,NA,"R",NA,NA,NA,NA,NA
"G18000384","EKPN","K.pneumoniae",NA,NA,NA,NA,NA,NA,NA,NA,"R",NA,NA,NA,NA,NA
"G18000415","EKPN","K.pneumoniae",NA,NA,NA,NA,NA,NA,NA,NA,"I",NA,NA,NA,NA,NA
"G18000427","EKPN","K.pneumoniae",NA,NA,NA,NA,NA,NA,NA,NA,"R",NA,NA,NA,NA,NA
"G18000437","EKPN","K.pneumoniae",NA,NA,NA,NA,NA,NA,NA,NA,"S",NA,NA,NA,NA,NA
"G18000439","EKPN","K.pneumoniae",NA,NA,NA,NA,NA,NA,NA,NA,"R",NA,NA,NA,NA,NA
"G18000448","EKPN","K.pneumoniae",NA,NA,NA,NA,NA,NA,NA,NA,"R",NA,NA,NA,NA,NA
"G18000449","EKPN","K.pneumoniae",NA,NA,NA,NA,NA,NA,NA,NA,"R",NA,NA,NA,NA,NA
"G18000450","EKPN","K.pneumoniae",NA,NA,NA,NA,NA,NA,NA,NA,"S",NA,NA,NA,NA,NA
"G18000484","EKPN","K.pneumoniae",NA,NA,NA,NA,NA,NA,NA,NA,"R",NA,NA,NA,NA,NA
"G18000491","EKPN","K.pneumoniae",NA,NA,NA,NA,NA,NA,NA,NA,"S",NA,NA,NA,NA,NA
"G18000492","EKPN","K.pneumoniae",NA,NA,NA,NA,NA,NA,NA,NA,"S",NA,NA,NA,NA,NA
"G18000500","EKPN","K.pneumoniae",NA,NA,NA,NA,NA,NA,NA,NA,"R",NA,NA,NA,NA,NA
"G18000521","EKPN","K.pneumoniae",NA,NA,NA,NA,NA,NA,NA,NA,"R",NA,NA,NA,NA,NA
"G18000837","EKPN","K.pneumoniae",NA,NA,NA,NA,NA,NA,NA,NA,"S",NA,NA,NA,NA,NA
"G18000847","EKPN","K.pneumoniae",NA,NA,NA,NA,NA,NA,NA,NA,"S",NA,NA,NA,NA,NA
"G18000881","EKPN","K.pneumoniae",NA,NA,NA,NA,NA,NA,NA,NA,"S",NA,NA,NA,NA,NA
