NAME,AMI,GEN,TOB,KAN,MET,PEN,VAN,TEC,CLI,ERY,MUP,LNZ,TCY,TMP,DAP,RIF,CIP,MFX
G18004501,0,0,0,0,1,1,0,0,0,0,0,0,0,0,0,0,0,0
G18255692,1,0,1,1,0,1,0,0,0,0,0,0,1,1,0,0,1,0
G18252280,0,1,1,1,1,1,0,0,1,1,0,0,0,0,0,0,1,0
G18255068,1,1,1,1,1,1,0,0,0,1,0,0,1,1,0,1,1,0
G18585076,0,0,0,0,1,1,0,0,0,0,0,0,1,1,0,0,0,0
G18004515,0,0,0,0,1,1,0,0,0,0,0,0,0,0,0,0,0,0
G18754699,0,0,0,0,1,1,0,0,0,0,0,0,0,0,0,0,0,0
G18255711,1,0,1,1,0,1,0,0,1,1,0,0,1,1,0,0,1,0
G18255816,1,1,1,1,1,1,0,0,0,1,0,0,0,1,0,0,1,0
G18004575,0,0,0,0,1,1,0,0,0,1,0,0,0,0,0,0,1,0
G18255050,1,1,1,1,1,1,0,0,0,1,0,0,1,1,0,0,1,0
G18762288,0,0,0,0,1,1,0,0,0,0,0,0,0,0,0,0,0,0
G18761510,0,0,0,0,1,1,0,0,0,0,0,0,0,0,0,0,0,0
G18754544,1,0,1,1,1,1,0,0,0,1,0,0,0,0,0,0,1,0
G18754487,0,0,0,0,1,1,0,0,0,0,0,0,0,0,0,0,0,0
G18255849,1,1,1,1,1,1,0,0,0,1,0,0,0,1,0,0,1,0
G18255070,1,1,1,1,1,1,0,0,0,0,0,0,0,1,0,0,1,0
G18255861,0,1,1,1,1,1,0,0,1,1,0,0,1,1,0,0,1,0
G18252284,0,1,1,1,1,1,0,0,1,1,0,0,0,1,0,0,1,0
G18255819,1,1,1,1,1,1,0,0,0,0,0,0,0,1,0,0,1,0
G18584082,0,0,0,0,0,1,0,0,0,0,0,0,1,1,0,0,0,0
G18760203,0,0,0,0,1,1,0,0,0,0,0,0,0,0,0,0,0,0
G18255077,1,1,1,1,1,1,0,0,0,0,1,0,0,1,0,0,1,0
G18761461,0,0,0,0,1,1,0,0,0,0,0,0,0,1,0,0,0,0
G18004506,0,0,0,0,1,1,0,0,0,0,0,0,0,0,0,1,0,0
G18255851,1,1,1,1,1,1,0,0,0,1,0,0,0,1,0,0,1,0
G18255858,1,1,1,1,1,1,0,0,0,1,0,0,0,1,0,0,1,0
G18252299,1,1,1,1,1,1,0,0,1,1,0,0,0,1,0,0,1,0
G18760649,0,0,0,0,1,1,0,0,0,0,0,0,0,1,0,0,0,0
G18255994,0,0,0,0,1,1,0,0,0,0,0,0,0,1,0,0,1,0
G18255679,0,1,1,1,1,1,0,0,0,0,0,0,0,1,0,0,1,0
G18255041,1,1,1,1,1,1,0,0,0,1,0,0,1,1,0,0,1,0
G18585073,1,1,1,1,1,1,0,0,1,1,0,0,0,1,0,0,1,0
G18255066,0,1,1,1,1,1,0,0,1,1,0,0,1,0,0,1,1,0
G18762459,0,0,0,0,1,1,0,0,0,0,0,0,0,0,0,0,0,0
G18763813,0,0,0,0,1,1,0,0,0,0,0,0,0,0,0,0,0,0
G18004597,0,0,0,0,1,1,0,0,0,0,0,0,0,0,0,0,0,0
G18764106,0,0,0,0,1,1,0,0,0,0,0,0,0,0,0,0,0,0
G18584063,0,0,0,0,0,1,0,0,0,0,0,0,0,1,0,0,0,0
G18754752,0,0,0,0,1,1,0,0,0,0,0,0,0,0,0,0,0,0
G18760782,0,0,0,0,1,1,0,0,0,0,0,0,0,0,0,0,0,0
G18255708,1,1,1,1,1,1,0,0,1,1,0,0,0,0,0,0,1,0
G18754753,0,0,0,0,1,1,0,0,0,0,0,0,0,0,0,0,0,0
G18256020,1,1,1,1,1,1,0,0,0,0,0,0,0,1,0,0,1,0
G18255848,1,0,1,1,1,1,0,0,0,1,0,0,1,1,0,0,0,0
G18255033,0,1,1,1,1,1,0,0,1,1,0,0,1,0,0,1,1,0
G18255785,1,1,1,1,1,1,0,0,0,1,0,0,0,1,0,0,1,0
G18255028,0,1,1,1,1,1,0,0,0,0,0,0,0,1,0,0,1,0
G18754450,0,0,0,0,1,1,0,0,0,0,0,0,0,0,0,0,0,0
G18255788,1,0,1,1,1,1,0,0,0,1,0,0,1,1,0,0,1,0
G18255675,1,1,1,1,1,1,0,0,1,1,0,0,0,1,0,0,1,0
G18761020,0,0,0,0,1,1,0,0,0,0,0,0,0,0,0,0,0,0
G18255997,0,1,1,1,1,1,0,0,1,1,0,0,1,0,0,1,1,0
G18255867,0,0,0,0,0,0,0,0,0,0,0,0,0,0,0,0,0,0
G18761528,0,0,0,0,1,1,0,0,0,0,0,0,0,1,0,0,0,0
G18754594,1,1,1,1,1,1,0,0,1,1,0,0,1,1,0,0,1,0
G18762619,0,0,0,0,1,1,0,0,0,0,0,0,0,1,0,0,0,0
G18754674,0,0,0,0,1,1,0,0,0,0,0,0,0,1,0,0,0,0
G18754572,0,0,0,0,1,1,0,0,0,0,0,0,0,0,0,0,0,0
G18754650,0,0,0,0,1,1,0,0,0,0,0,0,0,0,0,0,0,0
G18761508,0,0,0,0,1,1,0,0,0,0,0,0,0,0,0,0,0,0
G18004507,0,0,0,0,1,1,0,0,0,1,0,0,0,0,0,0,1,0
G18255833,1,1,1,1,1,1,0,0,0,1,0,0,0,1,0,0,1,0
G18255790,0,0,0,0,1,1,0,0,0,0,0,0,1,0,0,0,1,0
G18255702,0,0,0,0,0,1,0,0,0,0,0,0,0,1,0,0,1,0
G18256233,1,1,1,1,1,1,0,0,0,1,0,0,1,1,0,1,1,0
G18762333,0,0,0,0,1,1,0,0,0,0,0,0,0,0,0,0,0,0
G18762318,0,1,1,1,1,1,0,0,0,1,1,0,1,0,0,1,1,0
G18004594,1,0,1,1,1,1,0,0,0,0,0,0,0,0,0,0,0,0
G18252304,1,1,1,1,1,1,0,0,0,0,0,0,0,1,0,0,1,0
G18256011,0,1,1,1,1,1,0,0,0,1,0,0,1,0,0,1,1,0
G18760098,0,0,0,0,1,1,0,0,0,1,0,0,0,0,0,0,0,0
G18256013,0,1,1,1,1,1,0,0,0,1,0,0,1,0,0,1,1,0
G18255059,1,1,1,1,1,1,0,0,1,1,0,0,0,1,0,0,1,0
G18255838,0,0,0,0,0,0,0,0,0,0,0,0,0,1,0,0,0,0
G18256012,0,1,1,1,1,1,0,0,0,1,0,0,1,0,0,1,1,0
G18255803,1,1,1,1,1,1,0,0,0,0,0,0,0,1,0,0,1,0
G18255983,1,1,1,1,1,1,0,0,0,0,0,0,0,1,0,0,1,0
G18761527,0,0,0,0,1,1,0,0,0,0,0,0,0,1,0,0,0,0
G18255993,1,1,1,1,1,1,0,0,1,1,0,0,0,1,0,0,1,0
G18760335,0,0,0,0,1,1,0,0,0,0,0,0,0,0,0,0,0,0
G18255042,1,1,1,1,1,1,0,0,0,0,0,0,0,1,0,0,1,0
G18585043,0,0,0,0,1,1,0,0,0,0,0,0,1,1,0,0,0,0
G18004560,0,0,0,0,1,1,0,0,0,0,0,0,0,0,0,0,0,0
G18763606,0,0,0,0,1,1,0,0,0,0,0,0,0,0,0,0,0,0
G18762292,0,0,0,0,1,1,0,0,0,0,0,0,0,1,0,0,0,0
G18252289,0,1,1,1,1,1,0,0,0,1,0,0,1,0,0,1,1,0
G18255045,1,1,1,1,1,1,0,0,1,1,0,0,0,0,0,0,1,0
G18255780,1,0,1,1,1,1,0,0,0,1,0,0,0,1,0,0,1,0
G18255781,1,1,1,1,1,1,0,0,0,0,0,0,0,1,0,0,1,0
G18255806,1,1,1,1,1,1,0,0,0,1,0,0,0,1,0,0,1,0
G18256023,0,1,1,1,1,1,0,0,0,1,0,0,1,0,0,1,1,0
G18252309,0,1,1,1,1,1,0,0,1,1,0,0,0,1,0,0,1,0
G18255706,1,0,1,1,0,1,0,0,0,0,0,0,0,0,0,0,1,0
G18762289,0,0,0,0,1,1,0,0,0,0,0,0,0,0,0,0,0,0
G18255805,1,1,1,1,1,1,0,0,0,1,0,0,0,1,0,0,1,0
G18754467,0,0,0,0,1,1,0,0,1,1,0,0,0,0,0,0,0,0
G18761570,0,0,0,0,1,1,0,0,0,0,1,0,0,1,0,0,0,0
G18763476,0,0,0,0,1,1,0,0,0,0,0,0,0,0,0,0,0,0
G18255671,1,1,1,1,1,1,0,0,1,1,0,0,0,1,0,0,1,0
G18256035,0,0,0,0,0,0,0,0,0,0,0,0,0,1,0,0,1,0
G18763422,0,0,0,0,1,1,0,0,0,0,0,0,0,0,0,0,0,0
G18754365,0,0,0,0,1,1,0,0,0,0,0,0,0,0,0,0,0,0
G18584058,0,0,0,0,0,1,0,0,0,0,0,0,0,1,0,1,0,0
G18004601,0,0,0,0,1,1,0,0,1,1,0,0,1,1,0,0,0,0
G18754786,0,0,0,0,1,1,0,0,0,0,0,0,0,1,0,0,0,0
G18255987,0,1,1,1,1,1,0,0,0,1,0,0,1,0,0,1,1,0
G18255791,1,1,1,1,1,1,0,0,0,0,0,0,0,0,0,0,1,0
G18252286,1,1,1,1,1,1,0,0,0,1,0,0,0,0,0,0,1,0
G18004549,0,0,0,0,1,1,0,0,0,0,0,0,0,0,0,0,0,0
G18762543,0,0,0,0,1,1,0,0,0,0,0,0,0,0,0,0,0,0
G18760027,0,0,0,0,1,1,0,0,0,0,0,0,0,0,0,0,0,0
G18255783,1,1,1,1,1,1,0,0,0,1,0,0,0,0,0,0,1,0
G18764055,0,0,0,0,1,1,0,0,0,0,0,0,0,0,0,0,0,0
G18762910,0,0,0,0,1,1,0,0,0,0,0,0,0,0,0,0,0,0
G18255069,0,1,1,1,1,1,0,0,1,1,0,0,1,0,0,1,1,0
G18763715,0,0,0,0,1,1,0,0,0,0,0,0,0,1,0,0,0,0
G18585165,0,1,1,1,1,1,0,0,0,0,0,0,1,1,0,0,1,0
G18585024,0,0,0,0,1,1,0,0,0,0,0,0,1,1,0,0,0,0
G18585181,0,0,0,0,0,1,0,0,0,0,0,0,1,1,0,0,0,0
G18256022,0,1,1,1,1,1,0,0,0,0,0,0,0,1,0,0,1,0
G18004555,0,0,0,0,1,1,0,0,0,0,0,0,0,0,0,0,0,0
G18754472,0,0,0,0,1,1,0,0,0,0,0,0,0,0,0,0,0,0
G18255690,0,0,0,0,0,1,0,0,0,0,0,0,0,1,0,0,1,0
G18754628,0,0,0,0,1,1,0,0,0,0,0,0,0,0,0,0,0,0
G18255830,1,1,1,1,1,1,0,0,0,0,0,0,0,1,0,0,1,0
G18763443,0,0,0,0,1,1,0,0,0,0,0,0,0,1,0,0,0,0
G18255043,1,1,1,1,1,1,0,0,0,1,0,0,0,1,0,0,1,0
G18754357,0,0,0,0,1,1,0,0,0,0,0,0,0,0,0,0,0,0
G18754356,0,0,0,0,1,1,0,0,0,0,0,0,0,0,0,0,0,0
G18252294,1,1,1,1,1,1,0,0,1,1,0,0,0,0,0,0,1,0
G18255998,1,1,1,1,1,1,0,0,0,1,0,0,1,1,0,1,1,0
G18256000,1,1,1,1,1,1,0,0,0,1,0,0,0,0,0,0,1,0
G18255868,1,0,1,1,1,1,0,0,0,1,0,0,1,1,0,0,0,0
G18255063,1,1,1,1,1,1,0,0,1,1,0,0,0,1,0,0,1,0
G18754726,0,0,0,0,1,1,0,0,0,0,0,0,0,1,0,0,0,0
G18255027,1,1,1,1,1,1,0,0,0,1,0,0,1,1,0,1,1,0
G18256016,1,1,1,1,1,1,0,0,1,1,0,0,0,1,0,0,1,0
G18255786,1,0,1,1,1,1,0,0,0,1,0,0,1,1,0,0,0,0
G18256222,1,1,1,1,1,1,0,0,0,1,0,0,1,0,0,0,1,0
G18255804,1,1,1,1,1,1,0,0,0,1,0,0,0,1,0,0,1,0
G18256005,1,1,1,1,1,1,0,0,1,1,0,0,0,1,0,0,1,0
G18762272,0,0,0,0,1,1,0,0,0,0,0,0,0,0,0,0,0,0
G18763719,0,0,0,0,1,1,0,0,0,0,0,0,0,1,0,0,0,0
G18760640,0,0,0,0,1,1,0,0,0,0,0,0,0,0,0,0,0,0
G18255065,1,1,1,1,1,1,0,0,0,0,0,0,0,1,0,0,1,0
G18004620,0,0,0,0,1,1,0,0,0,0,0,0,0,0,0,0,0,0
G18255665,0,1,1,1,1,1,0,0,1,1,0,0,0,1,0,0,1,0
G18762344,0,0,0,0,1,1,0,0,0,0,0,0,0,0,0,0,0,0
G18252269,1,1,1,1,1,1,0,0,0,1,0,0,1,1,0,0,1,0
G18255036,1,0,1,1,1,1,0,0,0,1,0,0,0,1,0,0,1,0
G18256224,0,0,0,0,1,1,0,0,1,1,0,0,0,0,0,0,1,0
G18255055,1,1,1,1,1,1,0,0,1,1,0,0,1,1,0,0,1,0
G18252267,1,1,1,1,1,1,0,0,1,1,0,0,0,1,0,0,1,0
G18255865,1,0,1,1,1,1,0,0,0,1,0,0,0,1,0,0,1,0
G18754688,0,0,0,0,1,1,0,0,0,0,0,0,0,0,0,0,0,0
G18762633,0,0,0,0,1,1,0,0,1,1,0,0,0,0,0,0,0,0
G18761988,0,0,0,0,1,1,0,0,0,0,0,0,0,0,0,0,0,0
G18585037,0,0,0,0,1,1,0,0,0,0,0,0,1,1,0,0,0,0
G18256015,0,1,1,1,1,1,0,0,0,1,0,0,1,0,0,1,1,0
G18004552,0,0,0,0,1,1,0,0,0,0,0,0,0,0,0,0,0,0
G18004608,1,0,1,1,1,1,0,0,0,1,0,0,0,0,0,0,1,0
G18252285,1,1,1,1,1,1,0,0,1,1,0,0,0,1,0,0,1,0
G18255808,1,1,1,1,1,1,0,0,0,1,0,0,0,1,0,0,1,0
G18760402,0,0,0,0,1,1,0,0,0,0,0,0,0,0,0,0,0,0
G18760658,0,0,0,0,1,1,0,0,0,0,0,0,0,0,0,0,0,0
G18255076,1,1,1,1,1,1,0,0,0,0,1,0,0,1,0,0,1,0
G18256221,1,0,1,1,1,1,0,0,0,1,0,0,0,1,0,0,1,0
G18584084,0,0,0,0,0,1,0,0,0,0,0,0,0,1,0,0,0,0
G18255814,0,1,1,1,1,1,0,0,1,1,0,0,0,1,0,0,1,0
G18256027,1,1,1,1,1,1,0,0,1,1,0,0,0,0,0,0,1,0
G18004528,0,0,0,0,1,1,0,0,1,1,0,0,0,1,0,0,0,0
G18763718,0,0,0,0,1,1,0,0,1,1,0,0,0,0,0,0,0,0
G18760783,0,0,0,0,1,1,0,0,0,0,0,0,0,0,0,0,0,0
G18255026,1,1,1,1,1,1,0,0,0,0,0,0,0,1,0,0,1,0
G18255046,1,1,1,1,1,1,0,0,1,1,0,0,0,0,0,0,1,0
G18252292,0,1,1,1,1,1,0,0,1,1,0,0,1,0,0,1,1,0
G18761665,0,0,0,0,1,1,0,0,0,1,0,0,0,0,0,0,0,0
G18255996,1,1,1,1,1,1,0,0,0,0,0,0,0,1,0,0,1,0
G18004540,0,0,0,0,1,1,0,0,0,0,0,0,0,0,0,0,0,0
G18255677,1,0,1,1,0,1,0,0,0,0,0,0,0,0,0,0,1,0
G18255051,0,1,1,1,1,1,0,0,1,1,0,0,1,0,0,1,1,0
G18255058,1,1,1,1,1,1,0,0,0,0,0,0,0,1,0,0,1,0
G18762956,0,0,0,0,1,1,0,0,0,0,0,0,0,0,0,0,0,0
G18256003,1,1,1,1,1,1,0,0,1,1,0,0,0,1,0,0,1,0
G18256037,1,1,1,1,1,1,0,0,1,1,0,0,0,1,0,0,1,0
G18252279,1,1,1,1,1,1,0,0,0,1,0,0,0,1,0,0,1,0
G18004571,0,0,0,0,1,1,0,0,0,0,0,0,0,0,0,0,0,0
G18252308,1,1,1,1,1,1,0,0,0,1,0,0,1,1,0,1,1,0
G18252302,0,1,1,1,1,1,0,0,1,1,0,0,1,0,0,1,1,0
G18763485,0,0,0,0,1,1,0,0,1,1,0,0,0,0,0,0,0,0
G18763003,0,0,0,0,1,1,0,0,0,0,0,0,0,0,0,0,0,0
G18754642,0,1,1,1,1,1,0,0,1,1,1,0,1,0,0,1,1,0
G18252283,1,1,1,1,1,1,0,0,1,1,0,0,0,1,0,0,1,0
G18763475,0,0,0,0,1,1,0,0,0,0,0,0,0,0,0,0,0,0
G18255793,1,1,1,1,1,1,0,0,0,1,0,0,0,1,0,0,1,0
G18585184,0,0,0,0,0,1,0,0,0,0,0,0,0,0,0,0,0,0
G18754672,0,0,0,0,1,1,0,0,0,0,0,0,0,1,0,0,0,0
G18584072,1,1,1,1,1,1,0,0,0,0,0,0,1,1,0,0,1,0
G18252288,1,1,1,1,1,1,0,0,0,0,0,0,0,1,0,0,1,0
G18762913,0,0,0,0,1,1,0,0,0,0,0,0,0,0,0,0,0,0
G18762429,0,0,0,0,1,1,0,0,0,0,0,0,0,0,0,0,0,0
G18763023,0,0,0,0,1,1,0,0,0,0,0,0,0,0,0,0,0,0
G18754774,0,0,0,0,1,1,0,0,0,0,0,0,0,1,0,0,0,0
G18256009,0,1,1,1,1,1,0,0,0,1,0,0,1,0,0,1,1,0
G18255794,1,1,1,1,1,1,0,0,0,1,0,0,0,1,0,0,1,0
G18585027,1,1,1,1,1,1,0,0,0,1,0,0,0,1,0,0,1,0
G18255850,1,1,1,1,1,1,0,0,0,1,0,0,1,1,0,0,1,0
G18252300,0,1,1,1,1,1,0,0,0,0,0,0,0,1,0,0,1,0
G18252297,1,1,1,1,1,1,0,0,0,0,0,0,0,1,0,0,1,0
G18760681,0,0,0,0,1,1,0,0,0,0,0,0,0,0,0,0,0,0
G18255992,0,0,0,0,1,1,0,0,0,0,0,0,0,1,0,0,1,0
G18754538,0,0,0,0,1,1,0,0,0,0,0,0,0,1,0,1,0,0
G18754795,0,0,0,0,1,1,0,0,1,1,0,0,0,1,0,0,0,0
G18584070,1,1,1,1,1,1,0,0,0,1,0,0,0,1,0,0,1,0
G18255700,1,0,1,1,0,1,0,0,0,0,0,0,0,0,0,0,1,0
G18761526,0,0,0,0,1,1,0,0,0,0,0,0,0,0,0,0,0,0
G18762727,0,0,0,0,1,1,0,0,0,0,0,0,0,0,0,0,0,0
G18256025,1,1,1,1,1,1,0,0,0,1,0,0,0,1,0,0,1,0
G18256232,1,1,1,1,1,1,0,0,1,1,0,0,0,0,0,0,1,0
G18585019,0,1,1,1,1,1,0,0,0,0,0,0,1,1,0,0,1,0
G18754700,0,0,0,0,1,1,0,0,1,1,1,0,0,0,0,0,0,0
G18255049,1,0,1,1,0,1,0,0,0,0,0,0,0,0,0,0,1,0
G18252298,1,1,1,1,1,1,0,0,0,0,0,0,0,1,0,0,1,0
G18761889,0,0,0,0,1,1,0,0,0,0,0,0,0,0,0,0,0,0
G18255820,0,0,0,0,0,1,0,0,0,0,0,0,0,0,0,0,1,0
G18585039,0,0,0,0,0,1,0,0,0,0,0,0,0,1,0,0,0,0
G18256030,0,1,1,1,1,1,0,0,0,1,0,0,1,0,0,1,1,0
G18585002,1,0,1,1,0,1,0,0,0,0,0,0,1,1,0,0,1,0
G18255699,0,1,1,1,1,1,0,0,0,0,0,0,0,1,0,0,1,0
G18754395,0,1,1,1,1,1,0,0,1,1,0,0,1,0,0,1,1,0
G18256220,1,0,1,1,1,1,0,0,0,1,0,0,0,0,0,0,1,0
G18763307,0,0,0,0,1,1,0,0,0,0,0,0,0,1,0,0,0,0
G18754701,0,0,0,0,1,1,0,0,1,1,0,0,0,0,0,0,0,0
G18762909,0,0,0,0,1,1,0,0,0,0,0,0,0,0,0,0,0,0
G18255835,1,1,1,1,1,1,0,0,1,1,0,0,1,0,0,0,1,0
G18761521,0,0,0,0,1,1,0,0,0,0,0,0,0,1,0,0,0,0
G18762818,0,0,0,0,1,1,0,0,0,0,0,0,0,0,0,0,0,0
G18754671,0,0,0,0,1,1,0,0,0,0,0,0,0,1,0,0,0,0
G18255789,1,0,1,1,1,1,0,0,0,1,0,0,0,1,0,0,1,0
G18762692,0,0,0,0,1,1,0,0,0,0,0,0,0,0,0,0,0,0
G18255074,0,1,1,1,1,1,0,0,0,1,0,0,1,0,0,1,1,0
G18754682,0,0,0,0,1,1,0,0,0,0,0,0,0,1,0,0,0,0
G18585162,0,0,0,0,0,1,0,0,0,0,0,0,1,1,0,0,0,0
G18004617,0,0,0,0,1,1,0,0,0,0,0,0,0,0,0,0,0,0
G18255672,1,1,1,1,1,1,0,0,0,0,0,0,0,1,0,0,1,0
G18760556,0,0,0,0,1,1,0,0,0,0,0,0,0,1,0,0,0,0
G18255710,1,0,1,1,0,1,0,0,0,1,0,0,0,0,0,0,1,0
G18754581,0,1,1,1,1,1,0,0,1,1,0,0,1,0,0,1,1,0
G18763700,0,0,0,0,1,1,0,0,0,0,0,0,0,0,0,0,0,0
G18255701,1,0,1,1,0,1,0,0,0,0,0,0,0,0,0,0,1,0
G18256227,1,1,1,1,1,1,0,0,0,1,0,0,1,1,0,1,1,0
G18255676,0,1,1,1,0,1,0,0,1,1,0,0,0,1,0,0,1,0
G18255683,1,0,1,1,0,1,0,0,0,0,0,0,1,1,0,0,1,0
G18255863,0,0,0,0,0,1,0,0,0,0,0,0,0,0,0,0,0,0
G18762375,0,0,0,0,1,1,0,0,0,0,0,0,0,1,0,0,0,0
G18754532,0,0,0,0,1,1,0,0,0,0,0,0,0,0,0,0,0,0
G18762338,0,0,0,0,1,1,0,0,0,0,0,0,0,0,0,0,0,0
G18255048,1,1,1,1,1,1,0,0,1,1,0,0,0,1,0,0,1,0
G18585182,0,0,0,0,0,1,0,0,0,0,0,0,1,1,0,0,0,0
G18763859,0,0,0,0,1,1,0,0,0,0,0,0,0,1,0,0,0,0
G18584061,0,0,0,0,1,1,0,0,0,0,0,0,1,1,0,0,0,0
G18762887,0,0,0,0,1,1,0,0,0,0,0,0,0,0,0,0,0,0
G18255986,0,1,1,1,1,1,0,0,0,1,0,0,1,0,0,1,1,0
G18760511,0,0,0,0,1,1,0,0,0,0,0,0,0,1,0,0,0,0
G18764056,0,0,0,0,1,1,0,0,0,0,0,0,0,0,0,0,0,0
G18004614,1,0,1,1,1,1,0,0,0,0,0,0,1,0,0,0,0,0
G18754776,0,0,0,0,1,1,0,0,0,0,0,0,0,1,0,0,0,0
G18255696,0,0,0,0,0,1,0,0,1,1,0,0,0,1,0,0,1,0
G18252311,0,0,0,0,1,1,0,0,0,1,0,0,1,0,0,1,1,0
G18255669,0,1,1,1,1,1,0,0,1,1,0,0,0,1,0,0,1,0
G18255802,1,1,1,1,1,1,0,0,0,1,0,0,1,1,0,0,1,0
G18255668,1,1,1,1,1,1,0,0,0,1,0,0,0,1,0,0,1,0
G18256230,1,1,1,1,1,1,0,0,0,0,0,0,0,1,0,0,1,0
G18584068,1,1,1,1,1,1,0,0,0,0,0,0,1,1,0,0,1,0
G18585163,0,0,0,0,0,1,0,0,0,0,0,0,1,1,0,0,0,0
G18762124,0,0,0,0,1,1,0,0,0,0,0,0,0,0,0,0,0,0
G18255834,0,1,1,1,1,1,0,0,1,1,0,0,0,1,0,0,1,0
G18255837,1,0,1,1,0,1,0,0,0,1,0,0,0,0,0,0,1,0
G18764139,0,0,0,0,1,1,0,0,0,0,0,0,0,0,0,0,0,0
G18256039,0,1,1,1,1,1,0,0,1,1,0,0,0,1,0,0,1,0
G18252260,1,1,1,1,1,1,0,0,0,1,0,0,0,1,0,0,1,0
G18585075,0,0,0,0,1,1,0,0,0,0,0,0,1,1,0,0,0,0
G18585178,0,0,0,0,0,1,0,0,0,0,0,0,0,1,0,0,0,0
G18762145,0,0,0,0,1,1,0,0,0,0,0,0,0,0,0,0,0,0
G18255831,1,0,1,1,1,1,0,0,0,1,0,0,1,1,0,0,0,0
G18255825,1,1,1,1,1,1,0,0,0,1,1,0,0,1,0,0,1,0
G18255813,1,1,1,1,1,1,0,0,0,1,0,0,0,1,0,0,1,0
G18754690,0,0,0,0,1,1,0,0,0,0,0,0,0,0,0,0,0,0
G18004558,0,0,0,0,1,1,0,0,0,1,0,0,1,0,0,0,0,0
G18754583,0,0,0,0,1,1,0,0,0,0,0,0,0,0,0,0,0,0
G18754490,0,0,0,0,1,1,0,0,0,0,0,0,0,1,0,0,0,0
G18256231,0,1,1,1,1,1,0,0,0,1,0,0,1,0,0,1,1,0
G18761920,0,0,0,0,1,1,0,0,0,0,0,0,0,0,0,0,0,0
G18754736,0,0,0,0,1,1,0,0,0,0,0,0,0,0,0,0,0,0
G18763053,0,0,0,0,1,1,0,0,0,0,0,0,0,0,0,0,0,0
G18252296,1,1,1,1,1,1,0,0,1,1,0,0,0,1,0,0,1,0
G18763041,0,1,1,1,1,1,0,0,1,1,0,0,1,0,0,1,1,0
G18760674,0,0,0,0,1,1,0,0,1,1,0,0,0,0,0,0,0,0
G18255688,1,0,1,1,0,1,0,0,0,0,1,1,0,1,0,0,1,0
G18764095,0,0,0,0,1,1,0,0,0,0,0,0,0,0,0,0,0,0
G18761050,0,0,0,0,1,1,0,0,0,0,0,0,0,0,0,0,0,0
G18584065,1,0,1,1,0,1,0,0,1,0,0,0,1,1,0,0,0,0
G18585166,0,0,0,0,0,1,0,0,0,0,0,0,0,0,0,0,0,0
G18255052,0,1,1,1,1,1,0,0,1,1,0,0,0,1,0,1,1,0
G18754550,0,0,0,0,1,1,0,0,0,1,0,0,0,0,0,0,0,0
G18256041,0,1,1,1,1,1,0,0,1,1,0,0,1,0,0,1,1,0
G18256228,1,1,1,1,1,1,0,0,1,1,0,0,0,1,0,0,1,0
G18256018,1,0,1,1,1,1,0,0,0,1,0,0,0,1,0,0,1,0
G18762817,0,0,0,0,1,1,0,0,0,0,0,0,0,0,0,0,0,0
G18252306,1,1,1,1,1,1,0,0,0,1,0,0,0,1,0,0,1,0
G18252307,0,1,1,1,1,1,0,0,1,1,0,0,1,0,0,1,1,0
G18762689,0,0,0,0,1,1,0,0,0,0,0,0,0,0,0,0,0,0
G18255709,0,0,0,0,0,1,0,0,1,1,0,0,0,1,0,0,1,0
G18763484,0,0,0,0,1,1,0,0,0,0,0,0,0,0,0,0,0,0
G18255044,0,1,1,1,1,1,0,0,0,0,0,0,0,1,0,0,1,0
G18255689,0,1,1,1,0,1,0,0,0,0,0,0,0,1,0,0,1,0
G18255989,1,1,1,1,1,1,0,0,0,0,0,0,0,1,0,0,1,0
G18252262,1,1,1,1,1,1,0,0,0,0,0,0,0,1,0,0,1,0
G18255860,0,1,1,1,1,1,0,0,1,1,0,0,1,1,0,0,1,0
G18004518,0,0,0,0,1,1,0,0,0,0,0,0,0,0,0,0,0,0
G18004579,0,0,0,0,1,1,0,0,0,0,0,0,0,0,0,0,0,0
G18256225,0,0,0,0,1,1,0,0,0,1,0,0,1,0,0,1,1,0
G18255799,1,1,1,1,1,1,0,0,0,1,0,0,0,0,0,0,1,0
G18256017,0,1,1,1,1,1,0,0,0,1,0,0,1,0,0,1,1,0
G18760599,0,0,0,0,1,1,0,0,0,0,0,0,0,0,0,0,0,0
G18255811,1,1,1,1,1,1,0,0,0,0,0,0,0,1,0,0,1,0
G18754662,0,0,0,0,1,1,0,0,0,0,0,0,1,1,0,0,0,0
G18760333,0,0,0,0,1,1,0,0,0,0,0,0,0,0,0,0,0,0
G18754673,0,0,0,0,1,1,0,0,0,0,0,0,0,1,0,0,0,0
G18754478,0,0,0,0,1,1,0,0,0,0,0,0,0,0,0,0,0,0
G18584059,0,0,0,0,0,0,0,0,0,0,0,0,0,1,0,0,0,0
G18256014,0,1,1,1,1,1,0,0,1,1,0,0,1,0,0,1,1,0
G18256008,0,1,1,1,1,1,0,0,1,1,0,0,1,0,0,1,1,0
G18754727,0,0,0,0,1,1,0,0,0,0,0,0,1,1,0,0,0,0
G18255078,1,0,1,1,1,1,0,0,0,1,0,0,0,1,0,0,1,0
G18754763,0,0,0,0,1,1,0,0,0,0,0,0,0,1,0,0,0,0
G18754685,0,0,0,0,1,1,0,0,0,0,0,0,0,1,0,0,0,0
G18004568,0,0,0,0,1,1,0,0,0,0,0,0,0,0,0,0,0,0
G18255667,0,1,1,1,1,1,0,0,1,1,0,0,0,1,0,0,1,0
G18004504,0,0,0,0,1,1,0,0,0,0,0,0,0,0,0,0,0,0
G18255060,1,1,1,1,1,1,0,0,1,1,0,0,0,1,0,0,1,0
G18754788,0,0,0,0,1,1,0,0,0,0,0,0,0,1,0,0,0,0
G18754512,0,0,0,0,1,1,0,0,0,0,0,0,0,1,0,0,0,0
G18754506,0,0,0,0,0,1,0,0,0,0,0,0,0,1,0,0,0,0
G18252293,0,1,1,1,1,1,0,0,1,1,0,0,1,0,0,1,1,0
G18754681,0,0,0,0,1,1,0,0,0,0,0,0,0,0,0,0,0,0
G18252312,1,1,1,1,1,1,0,0,0,1,0,0,1,1,0,0,1,0
G18252276,1,1,1,1,1,1,0,0,0,1,0,0,0,1,0,0,1,0
G18255857,1,1,1,1,1,1,0,0,1,1,0,0,0,1,0,0,1,0
G18255812,0,0,0,0,0,1,0,0,0,0,0,0,0,0,0,0,1,0
G18762862,0,0,0,0,1,1,0,0,1,1,0,0,0,0,0,0,0,0
G18004519,1,0,1,1,1,1,0,0,1,1,0,0,0,0,0,0,1,0
G18255985,1,1,1,1,1,1,0,0,1,1,0,0,0,1,0,0,1,0
G18255047,0,1,1,1,1,1,0,0,1,1,0,0,0,1,0,0,1,0
G18255991,1,1,1,1,1,1,0,0,0,1,0,0,1,0,0,0,1,0
G18256007,1,1,1,1,1,1,0,0,1,1,0,0,0,1,0,0,1,0
G18256223,0,0,0,0,1,1,0,0,1,1,0,0,0,0,0,0,1,0
G18255673,1,1,1,1,1,1,0,0,0,1,0,0,0,1,0,0,1,0
G18004603,0,0,0,0,1,1,0,0,0,0,0,0,1,0,0,0,0,0
G18252264,1,1,1,1,1,1,0,0,0,1,0,0,1,1,0,1,1,0
G18255053,1,1,1,1,1,1,0,0,1,1,0,0,0,1,0,0,1,0
G18761448,0,0,0,0,1,1,0,0,0,0,0,0,0,1,0,0,0,0
G18004533,0,0,0,0,1,1,0,0,0,0,0,0,0,0,0,0,0,0
G18255818,0,0,0,0,0,1,0,0,1,1,0,0,0,1,0,0,1,0
G18252303,1,1,1,1,1,1,0,0,1,1,0,0,0,1,0,0,1,0
G18252266,1,1,1,1,1,1,0,0,0,1,0,0,1,1,0,0,1,0
G18763348,0,0,0,0,1,1,0,0,0,0,0,0,0,1,0,0,0,0
G18761990,0,0,0,0,1,1,0,0,0,0,0,0,0,1,0,0,0,0
G18762939,0,0,0,0,1,1,0,0,0,0,0,0,0,0,0,0,0,0
G18754457,0,0,0,0,1,1,0,0,0,0,0,0,0,0,0,0,0,0
G18252310,0,1,1,1,1,1,0,0,1,1,0,0,1,0,0,1,1,0
G18255061,1,1,1,1,1,1,0,0,1,1,0,0,0,1,0,0,1,0
G18762396,0,0,0,0,1,1,0,0,0,0,0,0,0,0,0,0,0,0
G18255829,1,1,1,1,1,1,0,0,0,1,0,0,1,1,0,0,1,0
G18255075,1,1,1,1,1,1,0,0,1,1,0,0,0,1,0,0,1,0
G18255054,0,1,1,1,1,1,0,0,1,1,0,0,1,0,0,1,1,0
G18584077,1,1,1,1,1,1,0,0,0,0,0,0,1,1,0,0,1,0
G18255839,0,0,0,0,0,1,0,0,0,0,0,0,0,0,0,0,0,0
G18584071,1,1,1,1,1,1,0,0,0,1,0,0,1,1,0,0,1,0
G18763820,0,0,0,0,1,1,0,0,0,0,0,0,0,1,0,0,0,0
G18761748,0,0,0,0,1,1,0,0,0,0,0,0,0,1,0,0,0,0
G18004588,0,0,0,0,1,1,0,0,1,1,0,0,1,1,0,0,0,0
G18763406,0,0,0,0,1,1,0,0,0,0,0,0,0,0,0,0,0,0
G18760675,0,0,0,0,1,1,0,0,0,1,0,0,0,0,0,0,0,0
G18252290,0,1,1,1,1,1,0,0,0,1,0,0,1,0,0,1,1,0
G18763844,0,0,0,0,1,1,0,0,0,0,0,0,0,0,0,0,0,0
G18255687,0,0,0,0,0,1,0,0,0,0,0,0,0,0,0,0,1,0
G18256219,1,1,1,1,1,1,0,0,1,1,0,0,0,1,0,0,1,0
G18256229,1,1,1,1,1,1,0,0,0,1,0,0,1,1,0,0,1,0
G18255827,1,0,1,1,1,1,0,0,0,1,0,0,0,1,0,0,1,0
G18255670,0,1,1,1,1,1,0,0,0,0,0,0,0,0,0,0,1,0
G18762863,0,0,0,0,1,1,0,0,1,1,0,0,0,1,0,0,0,0
G18763048,0,0,0,0,1,1,0,0,0,0,0,0,0,0,0,0,0,0
G18256166,1,1,1,1,1,1,0,0,0,0,0,0,0,1,0,0,1,0
G18256019,1,1,1,1,1,1,0,0,0,0,0,0,0,1,0,0,1,0
G18256024,0,1,1,1,1,1,0,0,0,1,0,0,1,0,0,1,1,0
G18754573,0,0,0,0,1,1,0,0,0,0,0,0,0,0,0,0,0,0
G18255698,1,0,1,1,0,1,0,0,0,0,0,0,0,0,0,0,1,0
G18584062,0,0,0,0,1,1,0,0,0,0,0,0,1,1,0,0,1,0
G18754600,0,0,0,0,1,1,0,0,0,0,0,0,0,0,0,0,0,0
G18760810,0,0,0,0,1,1,0,0,0,0,0,0,0,0,0,0,0,0
G18252295,0,1,1,1,1,1,0,0,1,1,0,0,1,0,0,1,1,0
G18004509,0,0,0,0,1,1,0,0,1,1,0,0,1,1,0,0,0,0
G18004604,0,0,0,0,1,1,0,0,0,1,0,0,0,0,0,1,1,0
G18252281,0,1,1,1,1,1,0,0,1,1,0,0,0,1,0,0,1,0
G18255707,1,0,1,1,0,1,0,0,0,0,0,0,0,0,0,0,1,0
G18252282,1,1,1,1,1,1,0,0,0,0,0,0,0,1,0,0,1,0
G18585179,0,0,0,0,1,1,0,0,0,0,0,0,1,1,0,0,0,0
G18754533,0,0,0,0,1,1,0,0,0,0,0,0,0,0,0,0,0,0
G18252301,0,1,1,1,1,1,0,0,1,1,0,0,1,0,0,1,1,0
G18255686,0,0,0,0,0,1,0,0,0,0,0,0,0,1,0,0,1,0
G18763389,0,0,0,0,1,1,0,0,0,0,0,0,0,1,0,0,0,0
G18255853,0,1,1,1,1,1,0,0,0,0,0,0,0,1,0,0,1,0
G18760728,0,0,0,0,1,1,0,0,0,0,0,0,0,0,0,0,0,0
G18764054,0,0,0,0,1,1,0,0,0,0,0,0,0,1,0,0,0,0
G18754455,0,0,0,0,1,1,0,0,0,0,0,0,0,0,0,0,0,0
G18255828,1,0,1,1,1,1,0,0,0,1,0,0,1,1,0,0,1,0
G18763349,0,0,0,0,1,1,0,0,0,0,0,0,0,0,0,0,0,0
G18255704,1,0,1,1,0,1,0,0,0,0,0,0,0,0,0,0,1,0
G18754416,0,0,0,0,1,1,0,0,0,0,0,0,0,0,0,0,0,0
G18255071,1,1,1,1,1,1,0,0,1,1,0,0,1,0,0,0,1,0
G18763195,0,0,0,0,1,1,0,0,0,0,0,0,0,0,0,0,0,0
G18255691,0,1,1,1,0,1,0,0,0,0,0,0,0,1,0,0,1,0
G18761919,0,0,0,0,1,1,0,0,0,0,0,0,0,0,0,0,0,0
G18763717,0,0,0,0,1,1,0,0,1,1,0,0,0,0,0,0,0,0
G18754613,0,0,0,0,1,1,0,0,0,0,0,0,0,1,0,0,0,0
G18255826,1,1,1,1,1,1,0,0,0,0,0,0,0,1,0,0,1,0
G18760057,0,0,0,0,1,1,0,0,0,0,0,0,0,0,0,0,0,0
G18255810,0,0,0,0,0,1,0,0,0,0,0,0,0,0,0,0,1,0
G18255034,1,1,1,1,1,1,0,0,1,1,0,0,0,1,0,0,1,0
G18255035,1,1,1,1,1,1,0,0,0,0,0,0,0,1,0,0,1,0
G18762491,0,0,0,0,1,1,0,0,0,0,0,0,0,0,0,0,0,0
G18255836,0,1,1,1,1,1,0,0,1,1,0,0,1,0,0,1,1,0
G18256038,1,1,1,1,1,1,0,0,1,1,0,0,0,1,0,0,1,0
G18255029,1,1,1,1,1,1,0,0,0,1,1,0,1,1,0,1,1,0
G18585045,0,0,0,0,1,1,0,0,0,0,0,0,1,1,0,0,0,0
G18255674,0,1,1,1,1,1,0,0,1,1,0,0,0,1,0,0,1,0
G18255703,1,0,1,1,0,1,0,0,0,0,0,0,0,0,0,0,1,0
G18255784,1,0,1,1,1,1,0,0,0,1,0,0,1,1,0,0,0,0
G18004547,0,0,0,0,1,1,0,0,0,0,0,0,0,0,0,0,0,0
G18761532,0,0,0,0,1,1,0,0,0,0,0,0,0,0,0,0,0,0
G18255864,0,1,1,1,1,1,0,0,1,1,0,0,0,1,0,0,1,0
G18255666,0,1,1,1,1,1,0,0,1,1,0,0,0,1,0,0,1,0
G18255064,1,1,1,1,1,1,0,0,0,1,0,0,1,1,0,1,1,0
G18255705,0,1,1,1,1,1,0,0,1,1,0,0,0,1,0,0,1,0
G18255801,1,1,1,1,1,1,0,0,0,1,0,0,0,1,0,0,1,0
G18255854,0,1,1,1,1,1,0,0,1,1,0,0,0,1,0,0,1,0
G18255807,1,1,1,1,1,1,0,0,0,1,0,0,0,1,0,0,1,0
G18763012,1,1,1,1,0,1,0,0,1,1,0,0,1,1,0,0,1,0
G18763068,0,0,0,0,1,1,0,0,0,0,0,0,0,0,0,0,0,0
G18754448,0,1,1,1,1,1,0,0,1,1,0,0,1,0,0,1,1,0
G18763841,0,0,0,0,1,1,0,0,0,0,0,0,0,0,0,0,0,0
G18255795,1,1,1,1,1,1,0,0,0,1,0,0,0,1,0,0,1,0
G18584066,1,0,1,1,0,1,0,0,0,0,0,0,0,1,0,0,1,0
G18763380,0,0,0,0,1,1,0,0,0,0,0,0,0,1,0,0,0,0
G18256001,1,1,1,1,1,1,0,0,0,0,0,0,0,0,0,0,1,0
G18584083,0,0,0,0,0,1,0,0,0,0,0,0,0,0,0,0,0,0
G18256031,0,1,1,1,1,1,0,0,0,1,0,0,1,0,0,1,1,0
G18760690,0,0,0,0,1,1,0,0,0,0,0,0,0,0,0,0,0,0
G18255798,1,1,1,1,1,1,0,0,0,1,0,0,0,1,0,0,1,0
G18761041,0,0,0,0,1,1,0,0,0,0,0,0,0,0,0,0,0,0
G18754402,1,1,1,1,1,1,0,0,0,1,0,0,1,1,0,0,1,0
G18762268,0,0,0,0,1,1,0,0,0,0,0,0,0,0,0,0,0,0
G18255822,0,1,1,1,1,1,0,0,0,0,0,0,0,1,0,0,1,0
G18256002,0,1,1,1,1,1,0,0,1,1,0,0,1,0,0,1,1,0
G18255062,0,1,1,1,1,1,0,0,0,1,0,0,1,0,0,1,1,0
G18763063,0,1,1,1,0,1,0,0,1,1,0,0,1,0,0,1,1,0
G18255031,0,1,1,1,1,1,0,0,1,1,0,0,1,0,0,1,1,0
G18004611,0,0,0,0,1,1,0,0,0,0,0,0,1,0,0,0,0,0
G18760679,0,0,0,0,1,1,0,0,0,0,0,0,0,0,0,0,1,0
G18763440,0,0,0,0,1,1,0,0,0,0,0,0,0,0,0,0,0,0
G18754617,0,0,0,0,1,1,0,0,0,0,0,0,0,0,0,0,0,0
G18754735,0,0,0,0,1,1,0,0,0,0,0,0,0,1,0,0,0,0
G18754755,0,0,0,0,1,1,0,0,0,0,0,0,0,1,0,0,0,0
G18255995,0,0,0,0,1,1,0,0,0,0,0,0,0,1,0,0,1,0
G18252313,1,1,1,1,1,1,0,0,0,1,0,0,1,1,0,1,1,0
G18004621,0,0,0,0,1,1,0,0,0,0,0,0,0,0,0,0,0,0
G18754751,0,0,0,0,1,1,0,0,0,0,0,0,0,1,0,0,0,0
G18004537,0,0,0,0,1,1,0,0,0,0,0,0,0,0,0,0,0,0
G18760634,0,0,0,0,1,1,0,0,0,0,0,0,0,1,0,0,0,0
G18760834,0,0,0,0,1,1,0,0,0,0,0,0,0,0,0,0,0,0
G18004512,0,0,0,0,1,1,0,0,1,1,0,0,1,0,0,0,0,0
G18762957,0,0,0,0,1,1,0,0,0,0,0,0,0,0,0,0,0,0
G18256217,1,0,1,1,0,1,0,0,0,1,0,0,0,0,0,0,1,0
G18760641,0,0,0,0,1,1,0,0,0,0,0,0,0,0,0,0,0,0
G18255073,1,1,1,1,1,1,0,0,1,1,0,0,0,1,0,0,1,0
G18762466,0,0,0,0,1,1,0,0,0,1,0,0,0,0,0,0,0,0
G18256234,0,1,1,1,1,1,0,0,0,1,0,0,1,0,0,1,1,0
G18255779,1,1,1,1,1,1,0,0,0,1,0,0,0,0,0,0,1,0
G18761021,0,0,0,0,1,1,0,0,0,0,0,0,0,0,0,0,0,0
G18255821,1,1,1,1,1,1,0,0,0,1,0,0,0,1,0,0,1,0
G18004583,0,0,0,0,1,1,0,0,0,0,0,0,0,0,0,0,0,0
G18763435,0,0,0,0,1,1,0,0,0,0,0,0,0,0,0,0,0,0
G18763752,0,0,0,0,1,1,0,0,0,0,0,0,0,1,0,0,0,0
G18256040,0,1,1,1,1,1,0,0,1,1,0,0,0,1,0,0,1,0
G18761851,0,0,0,0,1,1,0,0,0,0,0,0,0,1,0,0,0,0
G18255787,1,1,1,1,1,1,0,0,0,1,0,0,0,1,0,0,1,0
G18255817,0,1,1,1,1,1,0,0,1,1,1,0,0,1,0,0,1,0
G18255695,1,0,1,1,0,1,0,0,0,0,0,0,1,1,0,0,1,0
G18256004,1,1,1,1,1,1,0,0,0,0,0,0,0,1,0,0,1,0
G18585072,1,1,1,1,1,1,0,0,1,1,0,0,0,1,0,0,1,0
G18754554,0,0,0,0,1,1,0,0,0,0,0,0,0,0,0,0,0,0
G18760278,0,0,0,0,1,1,0,0,0,0,0,0,0,1,0,0,0,0
G18004542,0,0,0,0,1,1,0,0,0,0,0,0,1,0,0,0,0,0
G18754599,0,0,0,0,1,1,0,0,0,0,0,0,0,0,0,0,0,0
G18252272,1,1,1,1,1,1,0,0,0,0,0,0,0,1,0,0,1,0
G18256028,1,1,1,1,1,1,0,0,1,1,1,0,1,1,0,0,1,0
G18004562,0,0,0,0,1,1,0,0,0,0,0,0,0,0,0,0,0,0
G18004576,0,0,0,0,1,1,0,0,0,0,0,0,0,0,0,0,0,0
G18763054,0,0,0,0,1,1,0,0,0,0,0,0,0,0,0,0,0,0
G18004581,0,0,0,0,1,1,0,0,0,1,0,0,1,0,0,0,0,0
G18761613,0,0,0,0,1,1,0,0,0,0,0,0,0,0,0,0,0,0
G18255869,0,1,1,1,1,1,0,0,1,1,0,0,1,1,0,0,1,0
G18252277,0,1,1,1,1,1,0,0,0,0,0,0,0,1,0,0,1,0
G18256218,1,1,1,1,1,1,0,0,0,1,0,0,0,0,0,0,1,0
G18255782,1,0,1,1,1,1,0,0,0,1,0,0,1,1,0,0,1,0
G18255800,1,1,1,1,1,1,0,0,0,0,0,0,0,1,0,0,1,0
G18255797,1,1,1,1,1,1,0,0,0,1,0,0,0,1,0,0,1,0
G18585180,1,1,1,1,1,1,0,0,1,1,0,0,0,1,0,0,1,0
G18255792,1,1,1,1,1,1,0,0,0,0,0,0,0,1,0,0,1,0
G18255681,1,0,1,1,0,1,0,0,0,0,0,0,1,1,0,0,1,0
G18252261,1,1,1,1,1,1,0,0,1,1,0,0,0,1,0,0,1,0
G18761442,0,0,0,0,1,1,0,0,0,0,0,0,0,1,0,0,0,0
G18754666,0,0,0,0,1,1,0,0,0,1,0,0,0,0,0,0,0,0
G18255855,0,0,0,0,0,1,0,0,0,0,0,0,0,0,0,0,0,0
G18255832,1,1,1,1,1,1,0,0,0,0,0,0,0,1,0,0,1,0
G18256216,1,1,1,1,1,1,0,0,0,0,0,0,0,0,0,0,1,0
G18255032,0,1,1,1,1,1,0,0,1,1,0,0,1,0,0,1,1,0
G18256010,0,1,1,1,1,1,0,0,1,1,0,0,1,0,0,1,1,0
G18255056,0,1,1,1,1,1,0,0,1,1,0,0,1,0,0,1,1,0
G18004574,1,1,1,1,1,1,0,0,0,1,0,0,0,0,0,0,1,0
G18004610,0,0,0,0,1,1,0,0,0,0,0,0,0,0,0,0,0,0
G18004602,0,0,0,0,1,1,0,0,0,1,0,0,0,0,0,0,1,0
G18754665,0,0,0,0,1,1,0,0,0,0,0,0,0,1,0,0,0,0
G18255999,0,1,1,1,1,1,0,0,1,1,0,0,0,1,0,0,1,0
G18754370,0,0,0,0,1,1,0,0,0,0,0,0,0,0,0,0,0,0
G18754547,0,0,0,0,1,1,0,0,0,0,0,0,0,0,0,0,0,0
G18584067,1,1,1,1,1,1,0,0,0,0,0,0,1,1,0,0,1,0
G18255694,1,0,1,1,0,1,0,0,0,1,0,0,0,1,0,0,1,0
G18754787,0,0,0,0,1,1,0,0,0,0,0,0,0,0,0,0,0,0
G18004500,0,0,0,0,1,1,0,0,1,1,0,0,0,0,0,0,0,0
G18252263,1,1,1,1,1,1,0,0,0,0,0,0,0,1,0,0,1,0
G18252265,1,1,1,1,1,1,0,0,1,1,0,0,0,1,0,0,1,0
G18584080,1,1,1,1,1,1,0,0,0,1,0,0,0,1,0,0,1,0
G18256006,1,1,1,1,1,1,0,0,0,1,0,0,0,1,0,0,1,0
G18762332,0,0,0,0,1,1,0,0,0,0,0,0,0,0,0,0,1,0
G18255038,0,1,1,1,1,1,0,0,1,1,0,0,1,0,0,1,1,0
G18252287,0,1,1,1,1,1,0,0,1,1,0,0,0,1,0,0,1,0
G18762374,1,1,1,1,1,1,0,0,0,1,0,0,1,1,0,0,1,0
G18255809,1,1,1,1,1,1,0,0,0,1,1,0,0,1,0,0,1,0
G18754440,0,0,0,0,1,1,0,0,0,0,0,0,0,0,0,0,0,0
G18252273,1,1,1,1,1,1,0,0,0,1,0,0,1,1,0,0,1,0
G18585025,0,0,0,0,0,1,0,0,0,0,0,0,0,1,0,0,0,0
G18762320,0,0,0,0,1,1,0,0,0,0,0,0,0,0,0,0,0,0
G18004525,0,0,0,0,1,1,0,0,0,0,0,0,1,0,0,0,0,0
G18762691,0,0,0,0,1,1,0,0,0,0,0,0,0,0,0,0,0,0
G18255072,0,1,1,1,1,1,0,0,0,1,0,0,1,0,0,1,1,0
G18252278,1,1,1,1,1,1,0,0,0,0,0,0,0,1,0,0,1,0
G18255037,1,1,1,1,1,1,0,0,1,1,0,0,0,1,0,0,1,0
G18763474,0,0,0,0,1,1,0,0,0,0,0,0,0,0,0,0,0,0
G18585177,0,0,0,0,1,1,0,0,0,0,0,0,1,1,0,0,0,0
G18255039,1,1,1,1,1,1,0,0,0,1,0,0,0,1,0,0,1,0
G18255057,1,1,1,1,1,1,0,0,1,1,0,0,0,1,0,0,1,0
G18763529,0,0,0,0,1,1,0,0,0,0,0,0,0,0,0,0,0,0
G18754684,0,0,0,0,1,1,0,0,0,0,0,0,0,1,0,0,0,0
G18255866,1,1,1,1,1,1,0,0,1,1,0,0,0,1,0,0,1,0
G18255815,1,1,1,1,1,1,0,0,0,1,0,0,0,1,0,0,1,0
G18761571,0,0,0,0,1,1,0,0,0,0,0,0,0,0,0,0,0,0
G18761987,0,0,0,0,1,1,0,0,0,0,0,0,0,0,0,0,0,0
G18255796,1,1,1,1,1,1,0,0,0,0,0,0,0,1,0,0,1,0
G18763818,0,0,0,0,1,1,0,0,0,0,0,0,0,1,0,0,0,0
G18762511,0,0,0,0,1,1,0,0,0,0,0,0,0,0,0,0,0,0
G18754637,0,0,0,0,1,1,0,0,0,0,0,0,0,0,0,0,0,0
G18760461,0,0,0,0,1,1,0,0,0,0,0,0,0,0,0,0,0,0
G18255984,1,1,1,1,1,1,0,0,0,1,0,0,1,1,0,0,1,0
G18256026,0,1,1,1,1,1,0,0,1,1,0,0,0,1,0,0,1,0
G18004607,0,0,0,0,1,1,0,0,0,0,0,0,0,0,0,0,0,0
G18754644,0,0,0,0,1,1,0,0,0,0,0,0,0,0,0,0,0,0
G18761875,0,0,0,0,1,1,0,0,0,0,0,0,0,1,0,0,0,0
G18255040,1,1,1,1,1,1,0,0,0,0,0,0,0,1,0,0,1,0
G18761533,0,0,0,0,1,1,0,0,0,0,0,0,0,0,0,0,0,0
G18255030,1,1,1,1,1,1,0,0,0,1,0,0,0,1,0,0,1,0
G18255680,1,0,1,1,0,1,0,0,0,0,0,0,1,1,0,0,1,0
G18754791,0,0,0,0,1,1,0,0,0,0,0,0,0,1,0,0,0,0
G18252268,1,1,1,1,1,1,0,0,0,0,0,0,0,1,0,0,1,0
G18252305,1,1,1,1,1,1,0,0,1,1,1,0,1,0,0,0,1,0
G18255988,1,1,1,1,1,1,0,0,0,0,0,0,0,0,0,0,1,0
G18255823,1,1,1,1,1,1,0,0,0,1,0,0,0,1,0,0,1,0
G18584079,1,1,1,1,1,1,0,0,0,1,0,0,0,1,0,0,1,0
G18585183,0,1,1,1,1,1,0,0,0,0,0,0,1,1,0,0,1,0
G18762397,0,0,0,0,1,1,0,0,0,0,0,0,0,0,0,0,0,0
G18584075,1,1,1,1,1,1,0,0,0,0,0,0,1,1,0,0,1,0
G18763625,0,0,0,0,1,1,0,0,0,0,0,0,0,0,0,0,0,0
G18256036,1,0,1,1,1,1,0,0,0,1,0,0,0,0,0,0,1,0
G18004592,0,0,0,0,1,1,0,0,0,0,0,0,1,0,0,0,0,0
G18762977,1,0,1,1,1,1,0,0,1,1,0,0,1,1,0,0,1,0
G18763819,0,0,0,0,1,1,0,0,0,0,0,0,0,0,0,0,0,0