NAME,MEM,CRO,CAZ,FEP,CST
G18763376,0,1,1,1,0
G18255255,1,1,1,1,0
G18000382,1,1,1,1,0
G18503411,1,1,1,1,0
G18000749,0,1,1,1,0
G18253179,1,1,1,1,0
G18755603,0,1,1,1,0
G18762148,0,1,1,1,0
G18760221,1,1,1,1,0
G18000253,0,1,1,1,0
G18255576,1,1,1,1,0
G18600040,0,1,1,1,0
G18000074,1,1,1,1,0
G18255533,0,1,1,1,0
G18584136,0,1,1,1,0
G18503173,0,1,1,1,0
G18755347,0,1,1,1,0
G18760738,0,1,1,1,0
G18001131,1,1,1,1,0
G18000419,1,1,1,1,0
G18000927,1,1,1,1,0
G18761084,1,1,1,1,0
G18000895,0,1,1,1,0
G18000989,1,1,1,1,0
G18755343,1,1,1,1,0
G18755342,0,1,1,1,0
G18001138,1,0,0,0,0
G18755819,1,1,1,1,0
G18000297,0,0,0,0,0
G18001166,1,1,1,1,0
G18255233,0,1,1,1,0
G18255584,0,1,1,1,0
G18000599,0,1,1,1,0
G18000529,1,1,1,1,0
G18503177,0,1,1,1,0
G18755579,0,1,1,1,0
G18000291,0,1,1,1,0
G18763987,0,1,1,1,0
G18001025,1,1,1,1,0
G18000991,1,1,1,1,0
G18755340,0,1,1,1,0
G18000418,0,1,1,1,0
G18255522,1,1,1,1,0
G18255170,1,1,1,1,0
G18255126,1,1,1,1,0
G18000800,1,1,1,1,0
G18000771,1,1,1,1,0
G18001033,1,1,1,1,0
G18000600,1,1,1,1,0
G18600049,0,1,1,1,0
G18000595,1,1,1,1,0
G18755854,1,1,1,1,0
G18763357,0,1,1,1,0
G18000379,1,1,1,1,0
G18584141,0,1,1,1,0
G18255208,1,1,1,1,0
G18255243,0,1,1,1,0
G18000399,1,1,1,1,0
G18653026,0,1,1,1,0
G18584037,0,1,1,1,0
G18000622,1,1,1,1,0
G18255143,1,1,1,1,0
G18000398,1,0,0,0,0
G18584168,0,1,1,1,0
G18000963,1,1,1,1,0
G18755313,1,1,1,1,0
G18000233,1,1,1,1,0
G18255559,1,1,1,1,0
G18583071,0,1,1,1,0
G18584201,0,1,1,1,0
G18255589,1,1,1,1,0
G18255169,1,1,1,1,0
G18255118,1,1,1,1,0
G18000023,1,1,1,1,0
G18255272,1,1,1,1,0
G18000293,1,1,1,1,0
G18255579,1,1,1,1,0
G18001040,1,0,0,0,0
G18000243,1,1,1,1,0
G18001072,1,1,1,1,0
G18000185,1,1,1,1,0
G18255581,1,1,1,1,0
G18000700,1,1,1,1,0
G18000809,1,1,1,1,0
G18000468,1,1,1,1,0
G18000799,0,1,1,1,0
G18001035,1,1,1,1,0
G18001136,1,1,1,1,0
G18255285,1,1,1,1,0
G18763920,1,1,1,1,0
G18584205,0,1,1,1,0
G18255134,1,1,1,1,0
G18584203,0,1,1,1,0
G18255276,0,1,1,1,0
G18584177,0,1,1,1,0
G18000988,1,1,1,1,0
G18000164,1,1,1,1,0
G18255982,0,1,1,1,0
G18255613,1,1,1,1,0
G18761171,0,1,1,1,0
G18000087,1,1,1,1,0
G18584022,0,1,1,1,0
G18255200,1,1,1,1,0
G18000492,1,1,1,1,0
G18255514,1,1,1,1,0
G18251889,1,1,1,1,0
G18000939,1,1,1,1,0
G18255600,1,1,1,1,0
G18584199,0,1,1,1,0
G18255125,1,1,1,1,0
G18000451,1,1,1,1,0
G18255158,0,1,1,1,0
G18000576,1,1,1,1,0
G18000345,1,1,1,1,0
G18503162,1,1,1,1,0
G18755884,0,1,1,1,0
G18755716,1,1,1,1,0
G18001026,0,1,1,1,0
G18001059,1,1,1,1,0
G18255598,1,1,1,1,0
G18255204,1,1,1,1,0
G18755303,1,1,1,1,0
G18255140,1,1,1,1,0
G18755300,1,1,1,1,0
G18503402,1,1,1,1,0
G18000479,0,1,1,1,0
G18000340,1,1,1,1,0
G18256173,0,1,1,1,0
G18000009,1,1,1,1,0
G18255713,0,1,1,1,0
G18755736,1,1,1,1,0
G18255585,1,1,1,1,0
G18252053,1,1,1,1,0
G18761551,1,1,1,1,0
G18000981,1,1,1,1,0
G18000630,1,1,1,1,0
G18000104,1,1,1,1,0
G18001068,1,1,1,1,0
G18584194,0,1,1,1,0
G18252054,1,1,1,1,0
G18000741,1,1,1,1,0
G18000181,1,1,1,1,0
G18000950,1,1,1,1,0
G18503425,0,1,1,1,0
G18761316,1,1,1,1,0
G18256172,1,1,1,1,0
G18255872,1,1,1,1,0
G18255587,0,1,1,1,0
G18000423,1,1,1,1,0
G18000949,1,1,1,1,0
G18255281,1,1,1,1,0
G18001104,1,1,1,1,0
G18503417,0,1,1,1,0
G18255566,1,1,1,1,0
G18255138,1,1,1,1,0
G18001129,1,0,0,0,0
G18001114,0,1,1,1,0
G18000958,1,1,1,1,0
G18000756,1,1,1,1,0
G18504103,0,1,1,1,0
G18584142,0,1,1,1,0
G18764113,1,1,1,1,0
G18000375,1,1,1,1,0
G18755669,0,1,1,1,0
G18000748,0,1,1,1,0
G18000172,1,1,1,1,0
G18584209,0,1,1,1,0
G18762536,1,1,1,1,0
G18001017,1,1,1,1,0
G18000816,1,1,1,1,0
G18000374,1,1,1,1,0
G18000694,1,1,1,1,0
G18000260,1,1,1,1,0
G18762616,0,1,1,1,0
G18761085,1,1,1,1,0
G18000437,1,0,0,0,0
G18000585,1,1,1,1,0
G18000899,1,1,1,1,0
G18000077,1,1,1,1,0
G18255282,1,1,1,1,0
G18000200,0,1,1,1,0
G18001145,1,1,1,1,0
G18001113,1,1,1,1,0
G18000301,1,1,1,1,0
G18503195,0,1,1,1,0
G18000350,1,1,1,1,0
G18503426,0,1,1,1,0
G18255133,1,1,1,1,0
G18255105,0,1,1,1,0
G18000811,1,1,1,1,0
G18763686,0,1,1,1,0
G18583076,0,1,1,1,0
G18000199,1,1,1,1,0
G18000795,0,1,1,1,0
G18001100,1,0,0,0,0
G18000868,0,1,1,1,0
G18253166,1,1,1,1,0
G18255161,0,1,1,1,0
G18762832,1,1,1,1,0
G18255166,1,1,1,1,0
G18001157,1,1,1,1,0
G18000712,0,1,1,1,0
G18755587,1,1,1,1,0
G18255156,1,1,1,1,0
G18255593,1,1,1,1,0
G18255288,1,1,1,1,0
G18764037,1,1,1,1,0
G18000394,0,1,1,1,0
G18000244,1,0,0,0,0
G18255120,0,1,1,1,0
G18001151,1,1,1,1,0
G18000015,1,1,1,1,0
G18001154,1,1,1,1,0
G18504102,0,1,1,1,0
G18001117,1,1,1,1,0
G18000384,1,1,1,1,0
G18255772,1,1,1,1,0
G18255942,0,1,1,1,0
G18255557,1,1,1,1,0
G18000885,0,1,1,1,0
G18583065,0,1,1,1,0
G18000494,1,1,1,1,0
G18755304,1,1,1,1,0
G18762683,0,1,1,1,0
G18000587,1,1,1,1,0
G18255573,1,1,1,1,0
G18255177,0,1,1,1,0
G18255179,1,1,1,1,0
G18001099,1,1,1,1,0
G18762567,0,1,1,1,0
G18000308,1,1,1,1,0
G18000985,1,1,1,1,0
G18000914,1,1,1,1,0
G18255153,1,1,1,1,0
G18000793,0,1,1,1,0
G18503421,0,1,1,1,0
G18755345,1,1,1,1,0
G18000735,0,1,1,1,0
G18250122,1,1,1,1,0
G18001098,1,1,1,1,0
G18250048,1,1,1,1,0
G18584211,0,1,1,1,0
G18755388,0,1,1,1,0
G18000160,1,1,1,1,0
G18255128,1,1,1,1,0
G18755444,0,1,1,1,0
G18600056,0,1,1,1,0
G18000469,1,0,0,0,0
G18755681,0,1,1,1,0
G18255104,1,1,1,1,0
G18760542,0,1,1,1,0
G18000664,1,1,1,1,0
G18755661,1,1,1,1,0
G18000857,1,1,1,1,0
G18762507,0,1,1,1,0
G18255574,1,1,1,1,0
G18000389,1,1,1,1,0
G18760225,0,1,1,1,0
G18255569,1,1,1,1,0
G18755818,0,1,1,1,0
G18000858,1,1,1,1,0
G18000995,1,1,1,1,0
G18000983,1,1,1,1,0
G18762611,1,1,1,1,0
G18000796,1,0,0,0,0
G18000624,1,1,1,1,0
G18755741,0,1,1,1,0
G18255160,0,1,1,1,0
G18584181,0,1,1,1,0
G18000287,1,1,1,1,0
G18755596,0,1,1,1,0
G18000675,1,1,1,1,0
G18000837,1,1,1,1,0
G18256235,1,1,1,1,0
G18755302,1,1,1,1,0
G18255537,1,1,1,1,0
G18001038,1,1,1,1,0
G18255580,1,1,1,1,0
G18255578,1,1,1,1,0
G18000177,1,1,1,1,0
G18760512,0,1,1,1,0
G18255588,0,1,1,1,0
G18255516,1,1,1,1,0
G18584148,0,1,1,1,0
G18255614,1,1,1,1,0
G18255277,0,1,1,1,0
G18000397,1,1,1,1,0
G18001112,1,1,1,1,0
G18000993,1,1,1,1,0
G18755310,1,1,1,1,0
G18255513,1,1,1,1,0
G18255536,1,1,1,1,0
G18000973,1,1,1,1,0
G18755797,1,1,1,1,0
G18755359,0,1,1,1,0
G18001009,1,1,1,1,0
G18000922,1,1,1,1,0
G18000463,1,1,1,1,0
G18000513,0,1,1,1,0
G18255146,1,1,1,1,0
G18583089,0,1,1,1,0
G18255116,1,1,1,1,0
G18255535,0,1,1,1,0
G18755804,0,1,1,1,0
G18000167,1,1,1,1,0
G18000218,1,1,1,1,0
G18584200,0,1,1,1,0
G18755292,1,1,1,1,0
G18000633,1,1,1,1,0
G18255142,1,1,1,1,0
G18503430,0,1,1,1,0
G18000878,1,1,1,1,0
G18000935,0,1,1,1,0
G18255132,1,1,1,1,0
G18584146,0,1,1,1,0
G18000184,1,1,1,1,0
G18255586,0,1,1,1,0
G18000369,1,1,1,1,0
G18764153,0,1,1,1,0
G18000289,1,1,1,1,0
G18584003,0,1,1,1,0
G18255205,1,1,1,1,0
G18255602,1,1,1,1,0
G18000539,1,1,1,1,0
G18584173,0,1,1,1,0
G18255511,1,1,1,1,0
G18000831,1,1,1,1,0
G18755305,1,1,1,1,0
G18584014,0,1,1,1,0
G18755443,0,1,1,1,0
G18761009,0,1,1,1,0
G18755316,1,1,1,1,0
G18255234,1,1,1,1,0
G18001000,0,1,1,1,0
G18001079,0,1,1,1,0
G18000553,1,1,1,1,0
G18584041,0,1,1,1,0
G18000482,1,1,1,1,0
G18001121,1,1,1,1,0
G18503166,1,1,1,1,0
G18763921,0,1,1,1,0
G18000123,0,1,1,1,0
G18250103,1,1,1,1,0
G18584051,0,1,1,1,0
G18255212,1,1,1,1,0
G18584006,0,1,1,1,0
G18000511,1,1,1,1,0
G18000376,0,1,1,1,0
G18001140,1,1,1,1,0
G18762287,0,1,1,1,0
G18255113,1,1,1,1,0
G18255521,1,1,1,1,0
G18000225,1,1,1,1,0
G18583038,0,1,1,1,0
G18000640,0,1,1,1,0
G18255189,1,1,1,1,0
G18755837,0,1,1,1,0
G18255284,1,1,1,1,0
G18253171,1,1,1,1,0
G18251890,1,1,1,1,0
G18001095,1,1,1,1,0
G18255206,1,1,1,1,0
G18000913,1,1,1,1,0
G18000158,1,1,1,1,0
G18255141,1,1,1,1,0
G18255137,1,1,1,1,0
G18584204,0,1,1,1,0
G18000847,1,1,1,1,0
G18000575,0,1,1,1,0
G18000347,1,1,1,1,0
G18001048,1,1,1,1,0
G18255500,1,1,1,1,0
G18255554,1,1,1,1,0
G18584133,0,1,1,1,0
G18253168,1,1,1,1,0
G18503170,1,1,1,1,0
G18503424,1,1,1,1,0
G18001037,1,1,1,1,0
G18000806,1,1,1,1,0
G18255215,1,1,1,1,0
G18255549,1,1,1,1,0
G18255548,1,1,1,1,0
G18755220,0,1,1,1,0
G18255119,1,1,1,1,0
G18000781,1,1,1,1,0
G18000432,1,1,1,1,0
G18000026,1,1,1,1,0
G18000733,0,1,1,1,0
G18255712,1,1,1,1,0
G18000105,1,1,1,1,0
G18000264,1,1,1,1,0
G18762453,0,1,1,1,0
G18584186,0,1,1,1,0
G18755327,1,1,1,1,0
G18000098,1,1,1,1,0
G18755700,0,1,1,1,0
G18000825,1,1,1,1,0
G18763541,1,1,1,1,0
G18255114,0,1,1,1,0
G18255244,0,1,1,1,0
G18000271,1,0,0,0,0
G18001011,1,1,1,1,0
G18584187,0,1,1,1,0
G18763581,0,1,1,1,0
G18000174,1,1,1,1,0
G18000718,1,1,1,1,0
G18762513,1,1,1,1,0
G18503171,0,1,1,1,0
G18000306,1,1,1,1,0
G18763177,1,1,1,1,0
G18001102,1,1,1,1,0
G18000861,1,1,1,1,0
G18000874,1,1,1,1,0
G18000593,1,1,1,1,0
G18255611,1,1,1,1,0
G18255131,1,1,1,1,0
G18256175,1,1,1,1,0
G18000747,1,1,1,1,0
G18584170,0,1,1,1,0
G18000085,1,0,0,0,0
G18000763,1,1,1,1,0
G18000137,1,1,1,1,0
G18584169,0,1,1,1,0
G18000507,1,1,1,1,0
G18000146,0,1,1,1,0
G18255553,1,1,1,1,0
G18256214,1,1,1,1,0
G18001045,1,1,1,1,0
G18255539,1,1,1,1,0
G18763988,0,1,1,1,0
G18000953,0,1,1,1,0
G18000832,1,1,1,1,0
G18001094,1,1,1,1,0
G18001031,1,0,0,0,0
G18503427,1,1,1,1,0
G18763685,0,1,1,1,0
G18255163,1,1,1,1,0
G18000609,1,1,1,1,0
G18255164,1,1,1,1,0
G18755709,0,1,1,1,0
G18583075,0,1,1,1,0
G18000326,1,1,1,1,0
G18255582,1,1,1,1,0
G18764118,1,1,1,1,0
G18000213,1,1,1,1,0
G18000707,1,1,1,1,0
G18000881,1,1,1,1,0
G18763447,0,1,1,1,0
G18000365,0,1,1,1,0
G18000188,1,1,1,1,0
G18255180,1,1,1,1,0
G18255976,0,1,1,1,0
G18761768,1,1,1,1,0
G18760374,1,1,1,1,0
G18000596,1,1,1,1,0
G18255599,1,1,1,1,0
G18255555,1,1,1,1,0
G18763279,0,1,1,1,0
G18255572,1,1,1,1,0
G18255202,1,1,1,1,0
G18764132,0,1,1,1,0
G18255190,1,1,1,1,0
G18760818,1,1,1,1,0
G18255540,1,1,1,1,0
G18255605,1,1,1,1,0
G18584218,0,1,1,1,0
G18255610,1,1,1,1,0
G18584184,0,1,1,1,0
G18255139,1,1,1,1,0
G18255252,1,1,1,1,0
G18761337,0,1,1,1,0
G18755245,0,1,1,1,0
G18001065,0,1,1,1,0
G18761371,0,1,1,1,0
G18600039,0,1,1,1,0
G18255238,1,1,1,1,0
G18256171,1,1,1,1,0
G18000425,0,1,1,1,0
G18255182,0,1,1,1,0
G18000602,1,1,1,1,0
G18600042,0,1,1,1,0
G18255558,1,1,1,1,0
G18255172,1,1,1,1,0
G18000255,1,1,1,1,0
G18000944,0,1,1,1,0
G18763986,1,1,1,1,0
G18001036,1,1,1,1,0
G18000607,1,1,1,1,0
G18584174,0,1,1,1,0
G18000078,1,1,1,1,0
G18255608,1,1,1,1,0
G18761206,0,1,1,1,0
G18252055,1,1,1,1,0
G18761769,1,1,1,1,0
G18000412,0,1,1,1,0
G18000312,1,1,1,1,0
G18600045,0,1,1,1,0
G18000314,1,1,1,1,0
G18255227,0,1,1,1,0
G18255520,1,1,1,1,0
G18255597,1,1,1,1,0
G18255257,0,1,1,1,0
G18762564,0,1,1,1,0
G18000880,1,1,1,1,0
G18255601,1,1,1,1,0
G18000274,1,0,0,0,0
G18255567,1,1,1,1,0
G18761011,0,1,1,1,0
G18001081,1,1,1,1,0
G18001156,1,1,1,1,0
G18255181,1,1,1,1,0
G18255079,1,1,1,1,0
G18000654,1,1,1,1,0
G18761428,0,1,1,1,0
G18584172,0,1,1,1,0
G18000728,1,1,1,1,0
G18000344,0,1,1,1,0
G18584040,0,1,1,1,0
G18255543,1,1,1,1,0
G18000267,1,1,1,1,0
G18255136,1,1,1,1,0
G18760100,1,1,1,1,0
G18001144,1,1,1,1,0
G18000091,1,0,0,0,0
G18255223,0,1,1,1,0
G18584214,0,1,1,1,0
G18762423,1,1,1,1,0
G18600046,0,1,1,1,0
G18255110,1,1,1,1,0
G18001010,1,1,1,1,0
G18001096,1,1,1,1,0
G18000784,1,1,1,1,0
G18763390,0,1,1,1,0
G18255165,1,1,1,1,0
G18000209,1,1,1,1,0
G18255162,1,1,1,1,0
G18755583,0,1,1,1,0
G18255612,1,1,1,1,0
G18584192,0,1,1,1,0
G18000945,1,1,1,1,0
G18653027,0,1,1,1,0
G18000960,1,1,1,1,0
G18000971,1,1,1,1,0
G18000792,1,1,1,1,0
G18255775,1,1,1,1,0
G18000480,1,1,1,1,0
G18584207,0,1,1,1,0
G18000884,1,1,1,1,0
G18503165,0,1,1,1,0
G18581020,0,1,1,1,0
G18255201,1,1,1,1,0
G18584016,0,1,1,1,0
G18763425,0,1,1,1,0
G18763444,1,1,1,1,0
G18255512,1,1,1,1,0
G18000021,1,1,1,1,0
G18255552,1,1,1,1,0
G18001152,0,1,1,1,0
G18000876,1,1,1,1,0
G18000725,1,1,1,1,0
G18255209,1,1,1,1,0
G18760776,1,1,1,1,0
G18000673,1,1,1,1,0
G18000921,1,1,1,1,0
G18000240,1,1,1,1,0
G18255524,1,1,1,1,0
G18000879,1,1,1,1,0
G18653119,0,1,1,1,0
G18755226,0,1,1,1,0
G18000650,1,1,1,1,0
G18584030,0,1,1,1,0
G18000794,1,1,1,1,0
G18001147,1,1,1,1,0
G18255527,0,1,1,1,0
G18000802,1,1,1,1,0
G18001012,1,1,1,1,0
G18755314,0,1,1,1,0
G18000083,1,1,1,1,0
G18255534,0,1,1,1,0
G18001108,1,1,1,1,0
G18255240,1,1,1,1,0
G18583057,0,1,1,1,0
G18762676,0,1,1,1,0
G18755244,0,1,1,1,0
G18755734,0,1,1,1,0
G18000789,1,1,1,1,0
G18255583,1,1,1,1,0
G18255246,0,1,1,1,0
G18001004,1,1,1,1,0
G18000509,1,0,0,0,0
G18584178,0,1,1,1,0
G18256174,1,1,1,1,0
G18255239,1,1,1,1,0
G18000368,0,1,1,1,0
G18000277,1,1,1,1,0
G18001124,1,1,1,1,0
G18255127,0,1,1,1,0
G18000987,1,1,1,1,0
G18001019,1,1,1,1,0
G18000279,1,1,1,1,0
G18255173,1,1,1,1,0
G18763313,0,1,1,1,0
G18760338,0,1,1,1,0
G18255286,1,1,1,1,0
G18255273,0,1,1,1,0
G18000257,1,1,1,1,0
G18755321,1,1,1,1,0
G18653012,1,1,1,1,0
G18755363,0,1,1,1,0
G18755699,0,1,1,1,0
G18763989,0,1,1,1,0
G18255115,1,1,1,1,0
G18255159,1,1,1,1,0
G18000897,1,1,1,1,0
G18755602,0,1,1,1,0
G18001018,1,1,1,1,0
G18762701,0,1,1,1,0
G18584056,0,1,1,1,0
G18755325,1,1,1,1,0
G18755742,0,1,1,1,0
G18755406,1,1,1,1,0
G18001043,1,1,1,1,0
G18000863,1,1,1,1,0
G18755608,0,1,1,1,0
G18000882,1,1,1,1,0
G18255884,1,1,1,1,0
G18255167,0,1,1,1,0
G18584189,0,1,1,1,0
G18253170,1,1,1,1,0
G18001061,1,1,1,1,0
G18000980,1,0,0,0,0
G18000978,1,1,1,1,0
G18253177,1,1,1,1,0
G18584093,1,1,1,1,0
G18001127,1,1,1,1,0
G18000535,1,1,1,1,0
G18255228,0,1,1,1,0
G18763992,0,1,1,1,0
G18000613,1,1,1,1,0
G18763735,1,1,1,1,0
G18255147,1,1,1,1,0
G18503164,0,1,1,1,0
G18255607,1,1,1,1,0
G18001039,1,1,1,1,0
G18000395,1,1,1,1,0
G18000113,1,1,1,1,0
G18000723,1,1,1,1,0
G18762514,1,1,1,1,0
G18000693,1,1,1,1,0
G18000361,1,1,1,1,0
G18255515,1,1,1,1,0
G18583064,0,1,1,1,0
G18584143,0,1,1,1,0
G18000690,1,1,1,1,0
G18255592,1,1,1,1,0
G18000481,1,1,1,1,0
G18764123,1,1,1,1,0
G18255509,1,1,1,1,0
G18000909,0,1,1,1,0
G18001077,1,1,1,1,0
G18000597,1,0,0,0,0
G18255109,1,1,1,1,0
G18584191,0,1,1,1,0
G18000054,1,1,1,1,0
G18000765,1,1,1,1,0
G18255510,1,1,1,1,0
G18001029,0,1,1,1,0
G18000364,1,1,1,1,0
G18000410,1,1,1,1,0
G18255150,1,1,1,1,0
G18584179,0,1,1,1,0
G18763727,1,1,1,1,0
G18762618,0,1,1,1,0
G18000486,1,1,1,1,0
G18583079,0,1,1,1,0
G18755246,1,1,1,1,0
G18760273,0,1,1,1,0
G18584197,0,1,1,1,0
G18256168,1,1,1,1,0
G18584190,0,1,1,1,0
G18000049,1,1,1,1,0
G18584055,0,1,1,1,0
G18000561,1,1,1,1,0
G18000896,0,1,1,1,0
G18000873,1,1,1,1,0
G18255495,1,1,1,1,0
G18255541,1,1,1,1,0
G18764154,1,1,1,1,0
G18250104,0,1,1,1,0
G18503401,0,1,1,1,0
G18503179,0,1,1,1,0
G18000183,1,1,1,1,0
G18255236,0,1,1,1,0
G18253176,0,1,1,1,0
G18000248,0,1,1,1,0
G18000807,1,1,1,1,0
G18503412,0,1,1,1,0
G18503410,0,1,1,1,0
G18000320,1,0,0,0,0
G18255562,1,1,1,1,0
G18255542,1,1,1,1,0
G18000304,1,1,1,1,0
G18000744,1,1,1,1,0
G18000760,1,1,1,1,0
G18000272,0,1,1,1,0
G18000588,1,1,1,1,0
G18584139,0,1,1,1,0
G18255899,0,1,1,1,0
G18255102,1,1,1,1,0
G18001008,1,1,1,1,0
G18762780,0,1,1,1,0
G18503167,1,1,1,1,0
G18000024,1,0,0,0,0
G18000471,1,1,1,1,0
G18000936,1,1,1,1,0
G18584180,0,1,1,1,0
G18000224,1,1,1,1,0
G18000273,0,1,1,1,0
G18000201,1,1,1,1,0
G18255214,1,1,1,1,0
G18000969,1,1,1,1,0
G18755607,0,1,1,1,0
G18255544,0,1,1,1,0
G18253180,1,1,1,1,0
G18001005,1,1,1,1,0
G18000251,1,1,1,1,0
G18764034,0,1,1,1,0
G18253174,1,1,1,1,0
G18000558,0,1,1,1,0
G18255561,1,1,1,1,0
G18503175,0,1,1,1,0
G18000742,1,1,1,1,0
G18000141,0,1,1,1,0
G18000120,0,1,1,1,0
G18755307,1,1,1,1,0
G18000102,1,1,1,1,0
G18755703,0,1,1,1,0
G18755318,1,1,1,1,0
G18001064,1,1,1,1,0
G18255606,1,1,1,1,0
G18000348,1,1,1,1,0
G18762516,1,1,1,1,0
G18255216,1,1,1,1,0
G18584210,0,1,1,1,0
G18255186,0,1,1,1,0
G18584206,0,1,1,1,0
G18584196,0,1,1,1,0
G18000221,1,1,1,1,0
G18000560,1,1,1,1,0
G18762428,1,1,1,1,0
G18584166,0,1,1,1,0
G18000711,1,1,1,1,0
G18000037,0,1,1,1,0
G18755609,0,1,1,1,0
G18584031,0,1,1,1,0
G18583059,0,1,1,1,0
G18255256,1,1,1,1,0
G18255211,1,1,1,1,0
G18000892,0,1,1,1,0
G18000591,1,1,1,1,0
G18000865,1,1,1,1,0
G18584175,0,1,1,1,0
G18256178,1,1,1,1,0
G18255213,1,1,1,1,0
G18255577,1,1,1,1,0
G18255176,1,1,1,1,0
G18755301,1,1,1,1,0
G18600055,0,1,1,1,0
G18000027,0,1,1,1,0
G18255221,1,1,1,1,0
G18501056,1,1,1,1,0
G18001093,0,1,1,1,1
G18001080,1,1,1,1,0
G18000842,1,1,1,1,0
G18000059,1,1,1,1,0
G18755820,0,1,1,1,0
G18255144,1,1,1,1,0
G18755595,1,1,1,1,0
G18255528,1,1,1,1,0
G18000578,1,1,1,1,0
G18000020,1,1,1,1,0
G18001158,1,1,1,1,0
G18255184,0,1,1,1,0
G18760992,0,1,1,1,0
G18583099,0,1,1,1,0
G18000954,1,1,1,1,0
G18000776,1,1,1,1,0
G18762517,0,1,1,1,0
G18000869,1,1,1,1,0
G18584090,0,1,1,1,0
G18000740,1,1,1,1,0
G18000834,1,1,1,1,0
G18255171,1,1,1,1,0
G18000721,1,1,1,1,0
G18255097,0,1,1,1,0
G18001164,1,1,1,1,0
G18001137,1,1,1,1,0
G18255603,1,1,1,1,0
G18762485,1,1,1,1,0
G18000961,1,1,1,1,0
G18755337,1,1,1,1,0
G18760473,0,1,1,1,0
G18000827,1,1,1,1,0
G18255124,1,1,1,1,0
G18255519,1,1,1,1,0
G18755848,1,1,1,1,0
G18000648,1,1,1,1,0
G18001084,0,1,1,1,0
G18000523,1,1,1,1,0
G18761534,0,1,1,1,0
G18001086,1,1,1,1,0
G18000912,1,1,1,1,0
G18255218,1,1,1,1,0
G18000848,1,1,1,1,0
G18000875,1,1,1,1,0
G18255157,1,1,1,1,0
G18584145,0,1,1,1,0
G18503178,0,1,1,1,0
G18001069,1,1,1,1,0
G18256177,1,1,1,1,0
G18255203,1,1,1,1,0
G18001167,1,1,1,1,0
G18760543,0,1,1,1,0
G18255199,1,1,1,1,0
G18762725,0,1,1,1,0
G18255151,1,1,1,1,0
G18000567,1,0,0,0,0
G18255241,1,1,1,1,0
G18584198,0,1,1,1,0
G18653037,0,1,1,1,0
G18255571,1,1,1,1,0
G18584024,0,1,1,1,0
G18255112,1,1,1,1,0
G18001044,1,1,1,1,0
G18763990,0,1,1,1,0
G18000570,1,0,0,0,0
G18755338,1,1,1,1,0
G18503404,0,1,1,1,0
G18255283,1,1,1,1,0
G18255129,1,1,1,1,0
G18000696,1,1,1,1,0
G18000165,1,1,1,1,0
G18755757,0,1,1,1,0
G18000334,1,1,1,1,0
G18255198,1,1,1,1,0
G18755335,0,1,1,1,0
G18762239,0,1,1,1,0
G18255117,1,1,1,1,0
G18255529,1,1,1,1,0
G18001030,1,0,0,0,0
G18255217,1,1,1,1,0
G18762923,1,1,1,1,0
G18503403,0,1,1,1,0
G18250088,1,1,1,1,0
G18000769,1,1,1,1,0
G18000639,1,1,1,1,0
G18000778,1,1,1,1,0
G18000351,1,1,1,1,0
G18000501,1,1,1,1,0
G18755594,0,1,1,1,0
G18001150,1,1,1,1,0
G18000753,1,1,1,1,0
G18255886,1,1,1,1,0
G18000737,1,1,1,1,0
G18255121,1,1,1,1,0
G18000299,1,1,1,1,0
G18000797,1,1,1,1,0
G18255526,1,1,1,1,0
G18000335,1,1,1,1,0
G18255570,1,1,1,1,0
G18000968,1,1,1,1,0
G18000967,1,1,1,1,0
G18255100,1,1,1,1,0
G18584185,0,1,1,1,0
G18000431,1,1,1,1,0
G18001165,1,1,1,1,0
G18255253,1,1,1,1,0
G18000254,1,0,0,0,0
G18000681,0,1,1,1,0
G18755331,0,1,1,1,0
G18001016,1,1,1,1,0
G18001063,1,1,1,1,0
G18000916,0,1,1,1,0
G18000810,1,1,1,1,0
G18256179,1,1,1,1,0
G18000755,1,1,1,1,0
G18000490,1,1,1,1,0
G18000202,1,1,1,1,0
G18256182,0,1,1,1,0
G18000998,1,1,1,1,0
G18000621,1,1,1,1,0
G18584208,0,1,1,1,0
G18001115,1,1,1,1,0
G18585200,0,1,1,1,0
G18000685,0,1,1,1,0
G18000618,1,1,1,1,0
G18000761,1,1,1,1,0
G18255980,0,1,1,1,0
G18583078,0,1,1,1,0
G18000568,1,1,1,1,0
G18000611,1,1,1,1,0
G18000889,1,1,1,1,0
G18000086,0,1,1,1,0
G18000252,0,1,1,1,0
G18253211,1,1,1,1,0
G18000563,1,0,0,0,0
G18000295,1,1,1,1,0
G18584176,0,1,1,1,0
G18755581,0,1,1,1,0
G18001142,1,1,1,1,0
G18000269,1,1,1,1,0
G18000686,1,1,1,1,0
G18255168,1,1,1,1,0
G18255245,0,1,1,1,0
G18000228,1,1,1,1,0
G18000754,1,1,1,1,0
G18255148,1,1,1,1,0
G18000182,1,1,1,1,0
G18000422,1,1,1,1,0
G18255771,0,1,1,1,0
G18761616,1,0,0,0,0
G18255220,1,1,1,1,0
G18255523,1,1,1,1,0
G18755389,0,1,1,1,0
G18755315,1,1,1,1,0
G18763991,0,1,1,1,0
G18755324,1,1,1,1,0
G18000214,1,1,1,1,0
G18000783,1,1,1,1,0
G18000777,1,1,1,1,0
G18255145,1,1,1,1,0
G18255258,0,1,1,1,0
G18584171,0,1,1,1,0
G18255103,0,1,1,1,0
G18256167,1,1,1,1,0
G18000759,1,1,1,1,0
G18755773,0,1,1,1,0
G18000839,0,1,1,1,0
G18000767,1,1,1,1,0
G18000583,1,1,1,1,0
G18256183,0,1,1,1,0
G18001134,1,0,0,0,0
G18760603,0,1,1,1,0
G18762539,0,1,1,1,0
G18760161,0,1,1,1,0
G18000720,0,1,1,1,0
G18763765,1,1,1,1,0
G18001055,1,1,1,1,0
G18001153,1,1,1,1,0
G18255235,1,1,1,1,0
G18764125,1,1,1,1,0
G18000461,1,0,0,0,0
G18755299,1,1,1,1,0
G18584165,0,1,1,1,0
G18000900,1,1,1,1,0
G18763501,0,1,1,1,0
G18000542,1,0,0,0,0
G18000890,1,1,1,1,0
G18755295,0,1,1,1,0
G18600044,0,1,1,1,0
G18000327,1,1,1,1,0
G18000870,1,1,1,1,0
G18001021,1,1,1,1,0
G18001092,0,1,1,1,1
G18255175,1,1,1,1,0
G18255979,0,1,1,1,0
G18000145,1,1,1,1,0
G18255210,1,1,1,1,0
G18763064,1,1,1,1,0
G18000041,0,1,1,1,0
G18000887,1,1,1,1,0
G18584182,0,1,1,1,0
G18255275,0,1,1,1,0
G18255595,1,1,1,1,0
G18255274,0,1,1,1,0
G18000751,1,1,1,1,0
G18763126,1,1,1,1,0
G18000660,1,1,1,1,0
G18255219,1,1,1,1,0
G18755320,1,1,1,1,0
G18000237,1,1,1,1,0
G18255278,1,1,1,1,0
G18000580,1,1,1,1,0
G18255154,1,1,1,1,0
G18755856,0,1,1,1,0
G18760458,1,1,1,1,0
G18762508,1,1,1,1,0
G18001056,1,1,1,1,0
G18000658,0,1,1,1,0
G18762563,0,1,1,1,0
G18255564,1,1,1,1,0
G18763553,0,1,1,1,0
G18000835,1,1,1,1,0
G18255232,1,1,1,1,0
G18000338,1,1,1,1,0
G18000413,1,1,1,1,0
G18762502,0,1,1,1,0
G18755805,1,1,1,1,0
G18000450,1,1,1,1,0
G18000282,1,1,1,1,0
G18584047,0,1,1,1,0
G18755836,1,1,1,1,0
G18255885,0,1,1,1,0
G18763561,0,1,1,1,0
G18763985,1,1,1,1,0
G18000926,0,1,1,1,0
G18001133,1,1,1,1,0
G18000822,1,0,0,0,0
G18000500,1,1,1,1,0
G18001007,1,1,1,1,0
G18761865,0,1,1,1,0
G18000063,1,1,1,1,0
G18755332,0,1,1,1,0
G18762414,1,1,1,1,0
G18255111,1,1,1,1,0
G18000688,1,1,1,1,0
G18255224,1,1,1,1,0
G18255280,0,1,1,1,0
G18600047,0,1,1,1,0
G18000982,1,1,1,1,0
G18255545,1,1,1,1,0
G18000687,1,1,1,1,0
G18000189,1,1,1,1,0
G18000555,1,1,1,1,0
G18001014,0,1,1,1,0
G18001058,1,1,1,1,0
G18761052,1,1,1,1,0
G18253183,1,1,1,1,0
G18000616,0,1,1,1,0
G18762520,1,1,1,1,0
G18001052,1,1,1,1,0
G18255503,1,1,1,1,0
G18584137,0,1,1,1,0
G18255568,1,1,1,1,0
G18001123,1,1,1,1,0
G18584147,0,1,1,1,0
G18000367,1,0,0,0,0
G18255505,1,1,1,1,0
G18763145,1,1,1,1,0
G18001097,0,1,1,1,0
G18584167,0,1,1,1,0
G18000121,1,1,1,1,0
G18255135,1,1,1,1,0
G18250114,1,1,1,1,0
G18001135,1,1,1,1,0
G18755264,1,1,1,1,0
G18755623,0,1,1,1,0
G18001161,1,1,1,1,0
G18755429,0,1,1,1,0
G18255152,1,1,1,1,0
G18000372,1,1,1,1,0
G18000801,1,1,1,1,0
G18000859,1,1,1,1,0
G18255546,1,1,1,1,0
G18255123,1,1,1,1,0
G18761430,1,1,1,1,0
G18255279,1,1,1,1,0
G18000676,1,1,1,1,0
G18255530,1,1,1,1,0
G18761579,1,1,1,1,0
G18763767,1,1,1,1,0
G18000828,0,1,1,1,0
G18255550,1,1,1,1,0
G18000294,1,1,1,1,0
G18761006,0,0,0,0,0
G18255287,1,1,1,1,0
G18755789,1,1,1,1,0
G18000584,0,1,1,1,0
G18255594,1,1,1,1,0
G18000352,1,1,1,1,0
G18000318,1,1,1,1,0
G18584195,0,1,1,1,0
G18255525,0,1,1,1,0
G18255122,1,1,1,1,0
G18000970,1,1,1,1,0
G18001162,1,1,1,1,0
G18255155,1,1,1,1,0
G18755704,0,1,1,1,0
G18000268,0,1,1,1,0
G18762540,1,1,1,1,0
G18000860,0,1,1,1,0
G18755308,0,1,1,1,0
G18256185,1,1,1,1,0
G18001103,1,1,1,1,0
G18760184,0,1,1,1,0
G18585202,1,1,1,1,0
G18755706,0,1,1,1,0
G18755610,0,1,1,1,1
G18000439,1,1,1,1,0
G18000677,1,1,1,1,0
G18000114,1,1,1,1,0
G18761864,0,1,1,1,0
G18000487,1,1,1,1,0
G18256176,0,1,1,1,0
G18255174,1,1,1,1,0
G18600041,0,1,1,1,0
G18255596,1,1,1,1,0
G18755311,1,1,1,1,0
G18000506,0,1,1,1,0
G18000773,1,1,1,1,0
G18763374,1,1,1,1,0
G18000590,1,1,1,1,0
G18000918,1,1,1,1,0
G18255101,1,1,1,1,0
G18755317,1,1,1,1,0
G18000871,1,1,1,1,0
G18000920,1,1,1,1,0
G18255565,1,1,1,1,0
G18760513,0,1,1,1,0
G18000231,1,1,1,1,0
G18000957,1,1,1,1,0
G18762833,1,1,1,1,0
G18000996,1,1,1,1,0
G18000739,1,1,1,1,0
G18255149,1,1,1,1,0
G18000628,1,1,1,1,0
G18755735,0,1,1,1,0
G18000211,1,1,1,1,0
G18000999,1,1,1,1,0
G18255575,1,1,1,1,0
G18255604,1,1,1,1,0
G18000821,1,1,1,1,0
G18000222,1,1,1,1,0
G18000951,1,1,1,1,0
G18583077,0,1,1,1,0
G18583081,0,1,1,1,0
G18584202,0,1,1,1,0
G18255207,1,1,1,1,0
G18000073,1,1,1,1,0
G18256181,1,1,1,1,0
G18761720,1,1,1,1,0
G18584057,0,1,1,1,0
G18255556,1,1,1,1,0
G18600038,0,1,1,1,0
G18001049,1,1,1,1,0
G18255517,1,1,1,1,0
G18761454,1,1,1,1,0
G18255099,0,1,1,1,0
G18755312,1,1,1,1,0
G18760272,0,1,1,1,0
G18755690,1,1,1,1,0
G18255551,1,1,1,1,0
G18000606,1,0,0,0,0
G18000434,1,1,1,1,0
G18255098,1,1,1,1,0
G18255222,1,1,1,1,0
G18000849,1,1,1,1,0
G18000478,1,1,1,1,0
G18001105,1,1,1,1,0
G18000530,1,1,1,1,0
G18255547,1,1,1,1,0
G18755715,0,1,1,1,0
G18255518,1,1,1,1,0
G18001132,1,1,1,1,0