${AnsiColor.255}${AnsiBackground.RED}

  ____                            
 |  _ \  __ ___      ____ _ _ __  
 | | | |/ _` \ \ /\ / / _` | '_ \ 
 | |_| | (_| |\ V  V / (_| | | | |
 |____/ \__,_| \_/\_/ \__,_|_| |_|
                                  
                                  


${AnsiColor.DEFAULT}${AnsiBackground.DEFAULT}
${spring-boot.version}