

                                                   _   
  _ __ ___   ___  _ __  _   _ _ __ ___   ___ _ __ | |_ 
 | '_ ` _ \ / _ \| '_ \| | | | '_ ` _ \ / _ \ '_ \| __|
 | | | | | | (_) | | | | |_| | | | | | |  __/ | | | |_ 
 |_| |_| |_|\___/|_| |_|\__,_|_| |_| |_|\___|_| |_|\__|
                                                       

