

  ____                            
 |  _ \  __ ___      ____ _ _ __  
 | | | |/ _` \ \ /\ / / _` | '_ \ 
 | |_| | (_| |\ V  V / (_| | | | |
 |____/ \__,_| \_/\_/ \__,_|_| |_|
                                  

