

  ____  _ _     _ _       _   _      __                   
 | __ )(_) |__ | (_) ___ | |_| |__   \_\  __ _ _   _  ___ 
 |  _ \| | '_ \| | |/ _ \| __| '_ \ / _ \/ _` | | | |/ _ \
 | |_) | | |_) | | | (_) | |_| | | |  __/ (_| | |_| |  __/
 |____/|_|_.__/|_|_|\___/ \__|_| |_|\___|\__, |\__,_|\___|
                                            |_|           


