[{
    "id": 860,
    "firstName": "Superman",
    "lastName": "Yoda"
}, {
    "id": 870,
    "firstName": "Foo",
    "lastName": "Whateveryournameis"
}, {
    "id": 590,
    "firstName": "Toto",
    "lastName": "Titi"
},
    {
    "id": 803,
    "firstName": "Luke",
    "lastName": "Kyle"

    },{
    "id": 803,
    "firstName": "Luke",
    "lastName": "Kyle"

    },{
    "id": 803,
    "firstName": "Luke",
    "lastName": "Kyle"

    },{
    "id": 803,
    "firstName": "Luke",
    "lastName": "Kyle"

    },{
    "id": 803,
    "firstName": "Luke",
    "lastName": "Kyle"

    },{
    "id": 803,
    "firstName": "Luke",
    "lastName": "Kyle"

    },
    {
    "id": 803,
    "firstName": "Luke",
    "lastName": "Kyle"

    },{
    "id": 803,
    "firstName": "Luke",
    "lastName": "Kyle"

    },{
    "id": 803,
    "firstName": "Luke",
    "lastName": "Kyle"

    },{
    "id": 803,
    "firstName": "Luke",
    "lastName": "Kyle"

    },{
    "id": 803,
    "firstName": "Luke",
    "lastName": "Kyle"

    },{
    "id": 803,
    "firstName": "Luke",
    "lastName": "Kyle"

    },{
    "id": 803,
    "firstName": "Luke",
    "lastName": "Kyle"

    }


]