module gitlab.com/cewi/blockchain/node-smith

go 1.19

require (
	github.com/go-co-op/gocron v1.18.0
	github.com/gobeam/mongo-go-pagination v0.0.8
	github.com/golang/protobuf v1.5.2
	github.com/stretchr/testify v1.8.1
	go.mongodb.org/mongo-driver v1.11.1
	google.golang.org/grpc v1.51.0
)

require (
	github.com/davecgh/go-spew v1.1.1 // indirect
	github.com/golang/snappy v0.0.4 // indirect
	github.com/klauspost/compress v1.13.6 // indirect
	github.com/montanaflynn/stats v0.0.0-20171201202039-1bf9dbcd8cbe // indirect
	github.com/pkg/errors v0.9.1 // indirect
	github.com/pmezard/go-difflib v1.0.0 // indirect
	github.com/robfig/cron/v3 v3.0.1 // indirect
	github.com/xdg-go/pbkdf2 v1.0.0 // indirect
	github.com/xdg-go/scram v1.1.1 // indirect
	github.com/xdg-go/stringprep v1.0.3 // indirect
	github.com/youmark/pkcs8 v0.0.0-20201027041543-1326539a0a0a // indirect
	golang.org/x/crypto v0.0.0-20220622213112-05595931fe9d // indirect
	golang.org/x/net v0.4.0 // indirect
	golang.org/x/sync v0.0.0-20210220032951-036812b2e83c // indirect
	golang.org/x/sys v0.3.0 // indirect
	golang.org/x/text v0.5.0 // indirect
	google.golang.org/genproto v0.0.0-20221118155620-16455021b5e6 // indirect
	google.golang.org/protobuf v1.28.1 // indirect
	gopkg.in/robfig/cron.v2 v2.0.0-20150107220207-be2e0b0deed5 // indirect
	gopkg.in/yaml.v3 v3.0.1 // indirect
)
