File non trovato nel path \\DEUT\COL\DOC36\RETAIL_AURORA\NDG\2020-06-09 18_06_12\DB_FG_AOL_09062020_1632_101078\HQ72S01!.PDF
File non trovato nel path \\DEUT\COL\DOC36\RETAIL_AURORA\NDG\2020-06-09 18_06_08\DB_FG_AOL_09062020_1608_101080\HQ72_01!.PDF
File non trovato nel path \\DEUT\COL\DOC36\RETAIL_AURORA\NDG\2020-06-09 18_06_06\DB_FG_AOL_09062020_1608_101080\HQ72L01!.PDF
File non trovato nel path \\DEUT\COL\DOC36\RETAIL_AURORA\NDG\2020-06-09 18_06_04\DB_FG_AOL_09062020_1608_101079\HQ72J01!.PDF
File non trovato nel path \\DEUT\COL\DOC36\RETAIL_AURORA\NDG\2020-06-09 18_06_03\DB_FG_AOL_09062020_1608_101079\HQ72$01!.PDF
File non trovato nel path \\DEUT\COL\DOC36\RETAIL_AURORA\NDG\2020-06-09 18_06_02\DB_FG_AOL_09062020_1608_101079\HQ72H01!.PDF
File non trovato nel path \\DEUT\COL\DOC36\RETAIL_AURORA\NDG\2020-06-09 18_05_56\DB_FG_AOL_09062020_1608_101079\HQ72B01!.PDF
File non trovato nel path \\DEUT\COL\DOC36\RETAIL_AURORA\NDG\2020-06-09 18_05_44\DB_FG_AOL_09062020_1608_101079\HQ71Y01!.PDF
File non trovato nel path \\DEUT\COL\DOC36\RETAIL_AURORA\NDG\2020-06-09 18_05_37\DB_FG_AOL_09062020_1608_101078\HQ71S01!.PDF
File non trovato nel path \\DEUT\COL\DOC36\RETAIL_AURORA\NDG\2020-06-09 18_05_26\DB_FG_AOL_09062020_1607_101079\HQ71K01!.PDF
File non trovato nel path \\DEUT\COL\DOC36\RETAIL_AURORA\NDG\2020-06-09 18_05_21\DB_FG_AOL_09062020_1607_101076\HQ71G01!.PDF
File non trovato nel path \\DEUT\COL\DOC36\RETAIL_AURORA\NDG\2020-06-04 18_05_06\DB_FG_AOL_04062020_1154_101074\HQ70R01!.PDF
File non trovato nel path \\DEUT\COL\DOC36\RETAIL_AURORA\NDG\2020-05-22 18_05_13\DB_FG_AOL_22052020_1548_101069\HQ6X_01!.PDF
File non trovato nel path \\DEUT\COL\DOC36\RETAIL_AURORA\NDG\2020-05-05 17_36_24\DB_FG_AOL_05052020_1716_100412\HPY6C01!.PDF
File non trovato nel path \\DEUT\COL\DOC36\RETAIL_AURORA\NDG\2020-06-09 18_06_15\DB_FG_AOL_09062020_1632_101080\HQ72W01!.PDF
File non trovato nel path \\DEUT\COL\DOC36\RETAIL_AURORA\NDG\2020-06-09 18_06_11\DB_FG_AOL_09062020_1632_101076\HQ72R01!.PDF
File non trovato nel path \\DEUT\COL\DOC36\RETAIL_AURORA\NDG\2020-06-09 18_06_09\DB_FG_AOL_09062020_1608_101080\HQ72P01!.PDF
File non trovato nel path \\DEUT\COL\DOC36\RETAIL_AURORA\NDG\2020-06-09 18_06_02\DB_FG_AOL_09062020_1608_101079\HQ72G01!.PDF
File non trovato nel path \\DEUT\COL\DOC36\RETAIL_AURORA\NDG\2020-06-09 18_05_55\DB_FG_AOL_09062020_1608_101079\HQ72@01!.PDF
File non trovato nel path \\DEUT\COL\DOC36\RETAIL_AURORA\NDG\2020-06-09 18_05_48\DB_FG_AOL_09062020_1608_101079\HQ72201!.PDF
File non trovato nel path \\DEUT\COL\DOC36\RETAIL_AURORA\NDG\2020-06-09 18_05_47\DB_FG_AOL_09062020_1608_101079\HQ72101!.PDF
File non trovato nel path \\DEUT\COL\DOC36\RETAIL_AURORA\NDG\2020-06-09 18_05_46\DB_FG_AOL_09062020_1608_101079\HQ72001!.PDF
File non trovato nel path \\DEUT\COL\DOC36\RETAIL_AURORA\NDG\2020-06-09 18_05_43\DB_FG_AOL_09062020_1608_101079\HQ71X01!.PDF
File non trovato nel path \\DEUT\COL\DOC36\RETAIL_AURORA\NDG\2020-06-09 18_05_36\DB_FG_AOL_09062020_1608_101078\HQ71R01!.PDF
File non trovato nel path \\DEUT\COL\DOC36\RETAIL_AURORA\NDG\2020-06-09 18_05_20\DB_FG_AOL_09062020_1607_101076\HQ71F01!.PDF
File non trovato nel path \\DEUT\COL\DOC36\RETAIL_AURORA\NDG\2020-06-09 18_05_17\DB_FG_AOL_09062020_1607_101076\HQ71D01!.PDF
File non trovato nel path \\DEUT\COL\DOC36\RETAIL_AURORA\NDG\2020-06-04 18_05_09\DB_FG_AOL_04062020_1154_101074\HQ70S01!.PDF
File non trovato nel path \\DEUT\COL\DOC36\RETAIL_AURORA\NDG\2020-05-22 18_05_10\DB_FG_AOL_22052020_1548_101069\HQ6XN01!.PDF
File non trovato nel path \\DEUT\COL\DOC36\RETAIL_AURORA\NDG\2020-06-09 18_06_14\DB_FG_AOL_09062020_1632_101079\HQ72V01!.PDF
File non trovato nel path \\DEUT\COL\DOC36\RETAIL_AURORA\NDG\2020-06-09 18_06_13\DB_FG_AOL_09062020_1632_101079\HQ72%01!.PDF
File non trovato nel path \\DEUT\COL\DOC36\RETAIL_AURORA\NDG\2020-06-09 18_06_07\DB_FG_AOL_09062020_1608_101080\HQ72M01!.PDF
File non trovato nel path \\DEUT\COL\DOC36\RETAIL_AURORA\NDG\2020-06-09 18_05_58\DB_FG_AOL_09062020_1608_101079\HQ72D01!.PDF
File non trovato nel path \\DEUT\COL\DOC36\RETAIL_AURORA\NDG\2020-06-09 18_05_54\DB_FG_AOL_09062020_1608_101079\HQ72901!.PDF
File non trovato nel path \\DEUT\COL\DOC36\RETAIL_AURORA\NDG\2020-06-09 18_05_53\DB_FG_AOL_09062020_1608_101079\HQ72801!.PDF
File non trovato nel path \\DEUT\COL\DOC36\RETAIL_AURORA\NDG\2020-06-09 18_05_52\DB_FG_AOL_09062020_1608_101079\HQ72701!.PDF
File non trovato nel path \\DEUT\COL\DOC36\RETAIL_AURORA\NDG\2020-06-09 18_05_41\DB_FG_AOL_09062020_1608_101079\HQ71V01!.PDF
File non trovato nel path \\DEUT\COL\DOC36\RETAIL_AURORA\NDG\2020-06-09 18_05_40\DB_FG_AOL_09062020_1608_101079\HQ71%01!.PDF
File non trovato nel path \\DEUT\COL\DOC36\RETAIL_AURORA\NDG\2020-06-09 18_05_31\DB_FG_AOL_09062020_1608_101078\HQ71_01!.PDF
File non trovato nel path \\DEUT\COL\DOC36\RETAIL_AURORA\NDG\2020-06-09 18_05_28\DB_FG_AOL_09062020_1607_101080\HQ71M01!.PDF
File non trovato nel path \\DEUT\COL\DOC36\RETAIL_AURORA\NDG\2020-06-09 18_05_24\DB_FG_AOL_09062020_1607_101079\HQ71$01!.PDF
File non trovato nel path \\DEUT\COL\DOC36\RETAIL_AURORA\NDG\2020-05-22 18_05_07\DB_FG_AOL_22052020_1548_100191\HQ6XK01!.PDF
File non trovato nel path \\DEUT\COL\DOC36\RETAIL_AURORA\NDG\2020-06-09 18_06_10\DB_FG_AOL_09062020_1608_101080\HQ72Q01!.PDF
File non trovato nel path \\DEUT\COL\DOC36\RETAIL_AURORA\NDG\2020-06-09 18_06_01\DB_FG_AOL_09062020_1608_101079\HQ72F01!.PDF
File non trovato nel path \\DEUT\COL\DOC36\RETAIL_AURORA\NDG\2020-06-09 18_05_45\DB_FG_AOL_09062020_1608_101079\HQ71Z01!.PDF
File non trovato nel path \\DEUT\COL\DOC36\RETAIL_AURORA\NDG\2020-06-09 18_05_34\DB_FG_AOL_09062020_1608_101078\HQ71Q01!.PDF
File non trovato nel path \\DEUT\COL\DOC36\RETAIL_AURORA\NDG\2020-06-09 18_05_19\DB_FG_AOL_09062020_1607_101076\HQ71#01!.PDF
File non trovato nel path \\DEUT\COL\DOC36\RETAIL_AURORA\NDG\2020-06-09 18_05_16\DB_FG_AOL_09062020_1607_101076\HQ71C01!.PDF
File non trovato nel path \\DEUT\COL\DOC36\RETAIL_AURORA\NDG\2020-05-22 18_05_09\DB_FG_AOL_22052020_1548_101069\HQ6XM01!.PDF
File non trovato nel path \\DEUT\COL\DOC36\RETAIL_AURORA\NDG\2020-06-09 18_06_07\DB_FG_AOL_09062020_1608_101080\HQ72N01!.PDF
File non trovato nel path \\DEUT\COL\DOC36\RETAIL_AURORA\NDG\2020-06-09 18_06_00\DB_FG_AOL_09062020_1608_101079\HQ72#01!.PDF
File non trovato nel path \\DEUT\COL\DOC36\RETAIL_AURORA\NDG\2020-06-09 18_05_42\DB_FG_AOL_09062020_1608_101079\HQ71W01!.PDF
File non trovato nel path \\DEUT\COL\DOC36\RETAIL_AURORA\NDG\2020-06-09 18_05_33\DB_FG_AOL_09062020_1608_101078\HQ71P01!.PDF
File non trovato nel path \\DEUT\COL\DOC36\RETAIL_AURORA\NDG\2020-06-09 18_05_25\DB_FG_AOL_09062020_1607_101079\HQ71J01!.PDF
File non trovato nel path \\DEUT\COL\DOC36\RETAIL_AURORA\NDG\2020-06-09 18_05_14\DB_FG_AOL_09062020_1607_101076\HQ71B01!.PDF
File non trovato nel path \\DEUT\COL\DOC36\RETAIL_AURORA\NDG\2020-05-22 18_05_08\DB_FG_AOL_22052020_1548_100191\HQ6XL01!.PDF
File non trovato nel path \\DEUT\COL\DOC36\RETAIL_AURORA\NDG\2020-06-04 18_05_09\DB_FG_AOL_04062020_1154_101076\HQ70T01!.PDF
File non trovato nel path \\DEUT\COL\DOC36\RETAIL_AURORA\NDG\2020-06-09 18_06_13\DB_FG_AOL_09062020_1632_101079\HQ72T01!.PDF
File non trovato nel path \\DEUT\COL\DOC36\RETAIL_AURORA\NDG\2020-06-09 18_06_05\DB_FG_AOL_09062020_1608_101079\HQ72K01!.PDF
File non trovato nel path \\DEUT\COL\DOC36\RETAIL_AURORA\NDG\2020-06-09 18_05_57\DB_FG_AOL_09062020_1608_101079\HQ72C01!.PDF
File non trovato nel path \\DEUT\COL\DOC36\RETAIL_AURORA\NDG\2020-06-09 18_05_51\DB_FG_AOL_09062020_1608_101079\HQ72601!.PDF
File non trovato nel path \\DEUT\COL\DOC36\RETAIL_AURORA\NDG\2020-06-09 18_05_51\DB_FG_AOL_09062020_1608_101079\HQ72501!.PDF
File non trovato nel path \\DEUT\COL\DOC36\RETAIL_AURORA\NDG\2020-06-09 18_05_50\DB_FG_AOL_09062020_1608_101079\HQ72401!.PDF
File non trovato nel path \\DEUT\COL\DOC36\RETAIL_AURORA\NDG\2020-06-09 18_05_49\DB_FG_AOL_09062020_1608_101079\HQ72301!.PDF
File non trovato nel path \\DEUT\COL\DOC36\RETAIL_AURORA\NDG\2020-06-09 18_05_39\DB_FG_AOL_09062020_1608_101078\HQ71T01!.PDF
File non trovato nel path \\DEUT\COL\DOC36\RETAIL_AURORA\NDG\2020-06-09 18_05_29\DB_FG_AOL_09062020_1608_101078\HQ71N01!.PDF
File non trovato nel path \\DEUT\COL\DOC36\RETAIL_AURORA\NDG\2020-06-09 18_05_26\DB_FG_AOL_09062020_1607_101080\HQ71L01!.PDF
File non trovato nel path \\DEUT\COL\DOC36\RETAIL_AURORA\NDG\2020-06-09 18_05_22\DB_FG_AOL_09062020_1607_101079\HQ71H01!.PDF
File non trovato nel path \\DEUT\COL\DOC36\RETAIL_AURORA\NDG\2020-05-22 18_05_05\DB_FG_AOL_22052020_1548_100191\HQ6XJ01!.PDF
File non trovato nel path \\DEUT\COL\DOC36\RETAIL_AURORA\NDG\2020-06-10 18_05_34\DB_FG_AOL_10062020_1300_101080\HQ73T01!.PDF
File non trovato nel path \\DEUT\COL\DOC36\RETAIL_AURORA\NDG\2020-06-10 18_05_31\DB_FG_AOL_10062020_1300_101078\HQ73P01!.PDF
File non trovato nel path \\DEUT\COL\DOC36\RETAIL_AURORA\NDG\2020-06-10 18_05_30\DB_FG_AOL_10062020_1300_101078\HQ73N01!.PDF
File non trovato nel path \\DEUT\COL\DOC36\RETAIL_AURORA\NDG\2020-06-10 18_05_21\DB_FG_AOL_10062020_1300_101076\HQ73B01!.PDF
File non trovato nel path \\DEUT\COL\DOC36\RETAIL_AURORA\NDG\2020-06-10 18_05_21\DB_FG_AOL_10062020_1259_101080\HQ73@01!.PDF
File non trovato nel path \\DEUT\COL\DOC36\RETAIL_AURORA\NDG\2020-06-10 18_05_20\DB_FG_AOL_10062020_1259_101080\HQ73901!.PDF
File non trovato nel path \\DEUT\COL\DOC36\RETAIL_AURORA\NDG\2020-06-10 18_05_17\DB_FG_AOL_10062020_1259_101077\HQ73601!.PDF
File non trovato nel path \\DEUT\COL\DOC36\RETAIL_AURORA\NDG\2020-06-10 18_05_16\DB_FG_AOL_10062020_1259_101077\HQ73501!.PDF
File non trovato nel path \\DEUT\COL\DOC36\RETAIL_AURORA\NDG\2020-06-10 18_05_32\DB_FG_AOL_10062020_1300_101078\HQ73Q01!.PDF
File non trovato nel path \\DEUT\COL\DOC36\RETAIL_AURORA\NDG\2020-06-10 18_05_31\DB_FG_AOL_10062020_1300_101078\HQ73_01!.PDF
File non trovato nel path \\DEUT\COL\DOC36\RETAIL_AURORA\NDG\2020-06-10 18_05_29\DB_FG_AOL_10062020_1300_101078\HQ73M01!.PDF
File non trovato nel path \\DEUT\COL\DOC36\RETAIL_AURORA\NDG\2020-06-10 18_05_25\DB_FG_AOL_10062020_1300_101077\HQ73H01!.PDF
File non trovato nel path \\DEUT\COL\DOC36\RETAIL_AURORA\NDG\2020-06-10 18_05_19\DB_FG_AOL_10062020_1259_101080\HQ73801!.PDF
File non trovato nel path \\DEUT\COL\DOC36\RETAIL_AURORA\NDG\2020-06-10 18_05_15\DB_FG_AOL_10062020_1259_101077\HQ73401!.PDF
File non trovato nel path \\DEUT\COL\DOC36\RETAIL_AURORA\NDG\2020-06-10 18_05_13\DB_FG_AOL_10062020_1259_101077\HQ73301!.PDF
File non trovato nel path \\DEUT\COL\DOC36\RETAIL_AURORA\NDG\2020-06-10 18_05_12\DB_FG_AOL_10062020_1259_101077\HQ73201!.PDF
File non trovato nel path \\DEUT\COL\DOC36\RETAIL_AURORA\NDG\2020-06-10 18_05_33\DB_FG_AOL_10062020_1300_101079\HQ73S01!.PDF
File non trovato nel path \\DEUT\COL\DOC36\RETAIL_AURORA\NDG\2020-06-10 18_05_33\DB_FG_AOL_10062020_1300_101079\HQ73R01!.PDF
File non trovato nel path \\DEUT\COL\DOC36\RETAIL_AURORA\NDG\2020-06-10 18_05_25\DB_FG_AOL_10062020_1300_101077\HQ73G01!.PDF
File non trovato nel path \\DEUT\COL\DOC36\RETAIL_AURORA\NDG\2020-06-10 18_05_24\DB_FG_AOL_10062020_1300_101077\HQ73F01!.PDF
File non trovato nel path \\DEUT\COL\DOC36\RETAIL_AURORA\NDG\2020-06-10 18_05_23\DB_FG_AOL_10062020_1300_101077\HQ73#01!.PDF
File non trovato nel path \\DEUT\COL\DOC36\RETAIL_AURORA\NDG\2020-06-10 18_05_26\DB_FG_AOL_10062020_1300_101077\HQ73$01!.PDF
File non trovato nel path \\DEUT\COL\DOC36\RETAIL_AURORA\NDG\2020-06-10 18_05_18\DB_FG_AOL_10062020_1259_101079\HQ73701!.PDF
File non trovato nel path \\DEUT\COL\DOC36\RETAIL_AURORA\NDG\2020-06-10 18_05_34\DB_FG_AOL_10062020_1607_101078\HQ73%01!.PDF
File non trovato nel path \\DEUT\COL\DOC36\RETAIL_AURORA\NDG\2020-06-10 18_05_28\DB_FG_AOL_10062020_1300_101078\HQ73L01!.PDF
File non trovato nel path \\DEUT\COL\DOC36\RETAIL_AURORA\NDG\2020-06-10 18_05_28\DB_FG_AOL_10062020_1300_101078\HQ73K01!.PDF
File non trovato nel path \\DEUT\COL\DOC36\RETAIL_AURORA\NDG\2020-06-10 18_05_27\DB_FG_AOL_10062020_1300_101078\HQ73J01!.PDF
File non trovato nel path \\DEUT\COL\DOC36\RETAIL_AURORA\NDG\2020-06-10 18_05_35\DB_FG_AOL_10062020_1732_101076\HQ73V01!.PDF
File non trovato nel path \\DEUT\COL\DOC36\RETAIL_AURORA\NDG\2020-06-10 18_05_23\DB_FG_AOL_10062020_1300_101077\HQ73D01!.PDF
File non trovato nel path \\DEUT\COL\DOC36\RETAIL_AURORA\NDG\2020-06-10 18_05_22\DB_FG_AOL_10062020_1300_101076\HQ73C01!.PDF
File non trovato nel path \\DEUT\COL\DOC36\RETAIL_AURORA\NDG\2020-06-10 18_05_10\DB_FG_AOL_10062020_1259_101076\HQ73101!.PDF
File non trovato nel path \\DEUT\COL\DOC36\RETAIL_AURORA\NDG\2020-06-10 18_05_09\DB_FG_AOL_10062020_1259_101076\HQ73001!.PDF
File non trovato nel path \\DEUT\COL\DOC36\RETAIL_AURORA\NDG\2020-06-10 18_05_08\DB_FG_AOL_10062020_1259_101076\HQ72Z01!.PDF
