Designator,Val,Package,Mid X,Mid Y,Rotation,Layer
"C1","10uF","C_0805_2012Metric",110.998000,-71.501000,90,top
"C2","10uF","C_0805_2012Metric",118.999000,-71.501000,270,top
"C3","1uF","C_0603_1608Metric",120.904000,-71.501000,270,top
"C4","10uF","C_0805_2012Metric",104.648000,-91.948000,180,top
"C5","1uF","C_0603_1608Metric",105.918000,-78.740000,180,top
"C6","100nF","C_0603_1608Metric",105.918000,-80.264000,180,top
"C7","10uF","C_0805_2012Metric",112,-76,90,top
"C8","100nF","C_0603_1608Metric",109.982000,-75.946000,90,top
"CHARGE1","BLUE","LED_0603_1608Metric",107.696000,-87.503000,90,top
"D1","B5819W","D_SOD-123",105.537000,-73.533000,90,top
"D2","B5819W","D_SOD-123",120.904000,-85.979000,180,top
"IC1","MMBT2222ATT1G","SOT-416",120.523000,-75.946000,180,top
"IC2","MMBT2222ATT1G","SOT-416",120.523000,-82.804000,0,top
"Q1","DMP2045U","SOT-23",106.934000,-83.820000,180,top
"R1","100K","R_0603_1608Metric",107.696000,-73.533000,90,top
"R2","100K","R_0603_1608Metric",112.903000,-71.501000,270,top
"R3","4.7K","R_0603_1608Metric",103.505000,-85.979000,180,top
"R4","1K","R_0603_1608Metric",101.854000,-89.027000,270,top
"R5","10K","R_0603_1608Metric",121.666000,-79.375000,270,top
"R6","10K","R_0603_1608Metric",119.380000,-79.375000,90,top
"U1","AP2112K-3.3TRG1","SOT-23-5",115.824000,-71.501000,180,top
"U2","MCP73831T-2ATI/OT","SOT-23-5",104.648000,-88.900000,270,top
"U3","USBLC6-2SC6","SOT-23-6",115,-76,90,top
"U4","CP2102-GMR","QFN-28-1EP_5x5mm_P0.5mm_EP3.35x3.35mm",113.500000,-82,180,top
