G04 #@! TF.GenerationSoftware,KiCad,Pcbnew,(5.1.5)-3*
G04 #@! TF.CreationDate,2020-11-06T19:44:15+01:00*
G04 #@! TF.ProjectId,ESP32-CAM-Battery,45535033-322d-4434-914d-2d4261747465,rev?*
G04 #@! TF.SameCoordinates,Original*
G04 #@! TF.FileFunction,Other,Fab,Top*
%FSLAX46Y46*%
G04 Gerber Fmt 4.6, Leading zero omitted, Abs format (unit mm)*
G04 Created by KiCad (PCBNEW (5.1.5)-3) date 2020-11-06 19:44:15*
%MOMM*%
%LPD*%
G04 APERTURE LIST*
%ADD10C,0.150000*%
%ADD11C,0.100000*%
%ADD12C,0.060000*%
%ADD13C,0.050000*%
%ADD14C,0.075000*%
%ADD15C,0.080000*%
G04 APERTURE END LIST*
D10*
X102000000Y-64000000D02*
X102000000Y-66000000D01*
X125000000Y-64000000D02*
X125000000Y-66000000D01*
X100000000Y-65000000D02*
X127000000Y-65000000D01*
X113500000Y-100000000D02*
X113500000Y-60000000D01*
D11*
X108096000Y-86703000D02*
X107296000Y-86703000D01*
X108096000Y-88303000D02*
X108096000Y-86703000D01*
X107596000Y-88303000D02*
X108096000Y-88303000D01*
X107296000Y-88003000D02*
X107596000Y-88303000D01*
X107296000Y-86703000D02*
X107296000Y-88003000D01*
X120673000Y-83704000D02*
X120973000Y-83404000D01*
X120973000Y-81904000D02*
X120073000Y-81904000D01*
X120073000Y-83704000D02*
X120073000Y-81904000D01*
X120673000Y-83704000D02*
X120073000Y-83704000D01*
X120973000Y-83404000D02*
X120973000Y-81904000D01*
X120373000Y-75046000D02*
X120073000Y-75346000D01*
X120073000Y-76846000D02*
X120973000Y-76846000D01*
X120973000Y-75046000D02*
X120973000Y-76846000D01*
X120373000Y-75046000D02*
X120973000Y-75046000D01*
X120073000Y-75346000D02*
X120073000Y-76846000D01*
X122304000Y-86879000D02*
X119504000Y-86879000D01*
X119504000Y-86879000D02*
X119504000Y-85079000D01*
X119504000Y-85079000D02*
X122304000Y-85079000D01*
X122304000Y-85079000D02*
X122304000Y-86879000D01*
X121654000Y-85979000D02*
X121254000Y-85979000D01*
X121254000Y-85979000D02*
X121254000Y-86529000D01*
X121254000Y-85979000D02*
X121254000Y-85429000D01*
X121254000Y-85979000D02*
X120654000Y-86379000D01*
X120654000Y-86379000D02*
X120654000Y-85579000D01*
X120654000Y-85579000D02*
X121254000Y-85979000D01*
X120654000Y-85979000D02*
X120154000Y-85979000D01*
X112500000Y-91107107D02*
X113000000Y-90400000D01*
X112000000Y-90400000D02*
X112500000Y-91107107D01*
X117450000Y-88800000D02*
X117450000Y-96400000D01*
X109550000Y-88800000D02*
X109550000Y-96400000D01*
X109550000Y-96400000D02*
X117450000Y-96400000D01*
X116650000Y-88800000D02*
X117450000Y-88800000D01*
X116650000Y-90400000D02*
X116650000Y-88800000D01*
X110350000Y-90400000D02*
X116650000Y-90400000D01*
X110350000Y-88800000D02*
X110350000Y-90400000D01*
X109550000Y-88800000D02*
X110350000Y-88800000D01*
X116724000Y-69951000D02*
X116724000Y-73051000D01*
X116724000Y-73051000D02*
X114924000Y-73051000D01*
X114924000Y-70601000D02*
X114924000Y-73051000D01*
X116724000Y-69951000D02*
X115574000Y-69951000D01*
X114924000Y-70601000D02*
X115574000Y-69951000D01*
D10*
X109914000Y-66704000D02*
X109914000Y-66479000D01*
X110364000Y-66704000D02*
X109914000Y-66704000D01*
X110364000Y-66479000D02*
X110364000Y-66704000D01*
X110139000Y-66304000D02*
X110364000Y-66479000D01*
X109914000Y-66479000D02*
X110139000Y-66304000D01*
X111539000Y-60004000D02*
X106139000Y-60004000D01*
X104839000Y-66004000D02*
X112839000Y-66004000D01*
X104839000Y-60604000D02*
X104839000Y-66004000D01*
X105139000Y-60604000D02*
X104839000Y-60604000D01*
X105139000Y-59404000D02*
X105139000Y-60604000D01*
X112539000Y-59404000D02*
X105139000Y-59404000D01*
X112539000Y-60604000D02*
X112539000Y-59404000D01*
X112839000Y-60604000D02*
X112539000Y-60604000D01*
X112839000Y-66004000D02*
X112839000Y-60604000D01*
D11*
X115141000Y-63103000D02*
X121841000Y-63103000D01*
X115141000Y-60503000D02*
X115141000Y-63103000D01*
X121841000Y-60503000D02*
X115141000Y-60503000D01*
X121841000Y-63103000D02*
X121841000Y-60503000D01*
X118591000Y-59203000D02*
X118591000Y-60503000D01*
X118641000Y-59153000D02*
X118591000Y-59203000D01*
X118841000Y-58953000D02*
X118641000Y-59153000D01*
X119691000Y-58953000D02*
X118841000Y-58953000D01*
X119891000Y-59153000D02*
X119691000Y-58953000D01*
X119891000Y-60453000D02*
X119891000Y-59153000D01*
X119780000Y-78575000D02*
X119780000Y-80175000D01*
X118980000Y-78575000D02*
X119780000Y-78575000D01*
X118980000Y-80175000D02*
X118980000Y-78575000D01*
X119780000Y-80175000D02*
X118980000Y-80175000D01*
X121266000Y-80175000D02*
X121266000Y-78575000D01*
X122066000Y-80175000D02*
X121266000Y-80175000D01*
X122066000Y-78575000D02*
X122066000Y-80175000D01*
X121266000Y-78575000D02*
X122066000Y-78575000D01*
X101454000Y-89827000D02*
X101454000Y-88227000D01*
X102254000Y-89827000D02*
X101454000Y-89827000D01*
X102254000Y-88227000D02*
X102254000Y-89827000D01*
X101454000Y-88227000D02*
X102254000Y-88227000D01*
X102705000Y-85579000D02*
X104305000Y-85579000D01*
X102705000Y-86379000D02*
X102705000Y-85579000D01*
X104305000Y-86379000D02*
X102705000Y-86379000D01*
X104305000Y-85579000D02*
X104305000Y-86379000D01*
X112503000Y-72301000D02*
X112503000Y-70701000D01*
X113303000Y-72301000D02*
X112503000Y-72301000D01*
X113303000Y-70701000D02*
X113303000Y-72301000D01*
X112503000Y-70701000D02*
X113303000Y-70701000D01*
X108096000Y-72733000D02*
X108096000Y-74333000D01*
X107296000Y-72733000D02*
X108096000Y-72733000D01*
X107296000Y-74333000D02*
X107296000Y-72733000D01*
X108096000Y-74333000D02*
X107296000Y-74333000D01*
X106234000Y-85340000D02*
X107634000Y-85340000D01*
X107634000Y-82300000D02*
X107634000Y-85340000D01*
X106234000Y-82870000D02*
X106784000Y-82300000D01*
X106784000Y-82300000D02*
X107634000Y-82300000D01*
X106234000Y-82870000D02*
X106234000Y-85320000D01*
X105118000Y-78340000D02*
X106718000Y-78340000D01*
X105118000Y-79140000D02*
X105118000Y-78340000D01*
X106718000Y-79140000D02*
X105118000Y-79140000D01*
X106718000Y-78340000D02*
X106718000Y-79140000D01*
X110382000Y-75146000D02*
X110382000Y-76746000D01*
X109582000Y-75146000D02*
X110382000Y-75146000D01*
X109582000Y-76746000D02*
X109582000Y-75146000D01*
X110382000Y-76746000D02*
X109582000Y-76746000D01*
X105118000Y-79864000D02*
X106718000Y-79864000D01*
X105118000Y-80664000D02*
X105118000Y-79864000D01*
X106718000Y-80664000D02*
X105118000Y-80664000D01*
X106718000Y-79864000D02*
X106718000Y-80664000D01*
X120504000Y-72301000D02*
X120504000Y-70701000D01*
X121304000Y-72301000D02*
X120504000Y-72301000D01*
X121304000Y-70701000D02*
X121304000Y-72301000D01*
X120504000Y-70701000D02*
X121304000Y-70701000D01*
X116550000Y-76900000D02*
X113450000Y-76900000D01*
X113450000Y-76900000D02*
X113450000Y-75100000D01*
X115900000Y-75100000D02*
X113450000Y-75100000D01*
X116550000Y-76900000D02*
X116550000Y-75750000D01*
X115900000Y-75100000D02*
X116550000Y-75750000D01*
X115000000Y-79500000D02*
X116000000Y-80500000D01*
X111000000Y-79500000D02*
X115000000Y-79500000D01*
X111000000Y-84500000D02*
X111000000Y-79500000D01*
X116000000Y-84500000D02*
X111000000Y-84500000D01*
X116000000Y-80500000D02*
X116000000Y-84500000D01*
X103098000Y-88000000D02*
X106198000Y-88000000D01*
X106198000Y-88000000D02*
X106198000Y-89800000D01*
X103748000Y-89800000D02*
X106198000Y-89800000D01*
X103098000Y-88000000D02*
X103098000Y-89150000D01*
X103748000Y-89800000D02*
X103098000Y-89150000D01*
X126270000Y-63730000D02*
X126270000Y-84050000D01*
X123730000Y-63730000D02*
X126270000Y-63730000D01*
X123730000Y-83415000D02*
X123730000Y-63730000D01*
X124365000Y-84050000D02*
X123730000Y-83415000D01*
X126270000Y-84050000D02*
X124365000Y-84050000D01*
X100730000Y-84050000D02*
X100730000Y-63730000D01*
X103270000Y-84050000D02*
X100730000Y-84050000D01*
X103270000Y-64365000D02*
X103270000Y-84050000D01*
X102635000Y-63730000D02*
X103270000Y-64365000D01*
X100730000Y-63730000D02*
X102635000Y-63730000D01*
X104637000Y-74933000D02*
X104637000Y-72133000D01*
X104637000Y-72133000D02*
X106437000Y-72133000D01*
X106437000Y-72133000D02*
X106437000Y-74933000D01*
X106437000Y-74933000D02*
X104637000Y-74933000D01*
X105537000Y-74283000D02*
X105537000Y-73883000D01*
X105537000Y-73883000D02*
X104987000Y-73883000D01*
X105537000Y-73883000D02*
X106087000Y-73883000D01*
X105537000Y-73883000D02*
X105137000Y-73283000D01*
X105137000Y-73283000D02*
X105937000Y-73283000D01*
X105937000Y-73283000D02*
X105537000Y-73883000D01*
X105537000Y-73283000D02*
X105537000Y-72783000D01*
X112600000Y-75000000D02*
X112600000Y-77000000D01*
X111400000Y-75000000D02*
X112600000Y-75000000D01*
X111400000Y-77000000D02*
X111400000Y-75000000D01*
X112600000Y-77000000D02*
X111400000Y-77000000D01*
X103648000Y-91348000D02*
X105648000Y-91348000D01*
X103648000Y-92548000D02*
X103648000Y-91348000D01*
X105648000Y-92548000D02*
X103648000Y-92548000D01*
X105648000Y-91348000D02*
X105648000Y-92548000D01*
X118399000Y-72501000D02*
X118399000Y-70501000D01*
X119599000Y-72501000D02*
X118399000Y-72501000D01*
X119599000Y-70501000D02*
X119599000Y-72501000D01*
X118399000Y-70501000D02*
X119599000Y-70501000D01*
X111598000Y-70501000D02*
X111598000Y-72501000D01*
X110398000Y-70501000D02*
X111598000Y-70501000D01*
X110398000Y-72501000D02*
X110398000Y-70501000D01*
X111598000Y-72501000D02*
X110398000Y-72501000D01*
D12*
X107838857Y-88531571D02*
X107857904Y-88550619D01*
X107876952Y-88607761D01*
X107876952Y-88645857D01*
X107857904Y-88703000D01*
X107819809Y-88741095D01*
X107781714Y-88760142D01*
X107705523Y-88779190D01*
X107648380Y-88779190D01*
X107572190Y-88760142D01*
X107534095Y-88741095D01*
X107496000Y-88703000D01*
X107476952Y-88645857D01*
X107476952Y-88607761D01*
X107496000Y-88550619D01*
X107515047Y-88531571D01*
X107876952Y-88360142D02*
X107476952Y-88360142D01*
X107667428Y-88360142D02*
X107667428Y-88131571D01*
X107876952Y-88131571D02*
X107476952Y-88131571D01*
X107762666Y-87960142D02*
X107762666Y-87769666D01*
X107876952Y-87998238D02*
X107476952Y-87864904D01*
X107876952Y-87731571D01*
X107876952Y-87369666D02*
X107686476Y-87503000D01*
X107876952Y-87598238D02*
X107476952Y-87598238D01*
X107476952Y-87445857D01*
X107496000Y-87407761D01*
X107515047Y-87388714D01*
X107553142Y-87369666D01*
X107610285Y-87369666D01*
X107648380Y-87388714D01*
X107667428Y-87407761D01*
X107686476Y-87445857D01*
X107686476Y-87598238D01*
X107496000Y-86988714D02*
X107476952Y-87026809D01*
X107476952Y-87083952D01*
X107496000Y-87141095D01*
X107534095Y-87179190D01*
X107572190Y-87198238D01*
X107648380Y-87217285D01*
X107705523Y-87217285D01*
X107781714Y-87198238D01*
X107819809Y-87179190D01*
X107857904Y-87141095D01*
X107876952Y-87083952D01*
X107876952Y-87045857D01*
X107857904Y-86988714D01*
X107838857Y-86969666D01*
X107705523Y-86969666D01*
X107705523Y-87045857D01*
X107667428Y-86798238D02*
X107667428Y-86664904D01*
X107876952Y-86607761D02*
X107876952Y-86798238D01*
X107476952Y-86798238D01*
X107476952Y-86607761D01*
X107876952Y-86226809D02*
X107876952Y-86455380D01*
X107876952Y-86341095D02*
X107476952Y-86341095D01*
X107534095Y-86379190D01*
X107572190Y-86417285D01*
X107591238Y-86455380D01*
D13*
X120681333Y-83145666D02*
X120331333Y-83145666D01*
X120648000Y-82779000D02*
X120664666Y-82795666D01*
X120681333Y-82845666D01*
X120681333Y-82879000D01*
X120664666Y-82929000D01*
X120631333Y-82962333D01*
X120598000Y-82979000D01*
X120531333Y-82995666D01*
X120481333Y-82995666D01*
X120414666Y-82979000D01*
X120381333Y-82962333D01*
X120348000Y-82929000D01*
X120331333Y-82879000D01*
X120331333Y-82845666D01*
X120348000Y-82795666D01*
X120364666Y-82779000D01*
X120364666Y-82645666D02*
X120348000Y-82629000D01*
X120331333Y-82595666D01*
X120331333Y-82512333D01*
X120348000Y-82479000D01*
X120364666Y-82462333D01*
X120398000Y-82445666D01*
X120431333Y-82445666D01*
X120481333Y-82462333D01*
X120681333Y-82662333D01*
X120681333Y-82445666D01*
X120681333Y-76287666D02*
X120331333Y-76287666D01*
X120648000Y-75921000D02*
X120664666Y-75937666D01*
X120681333Y-75987666D01*
X120681333Y-76021000D01*
X120664666Y-76071000D01*
X120631333Y-76104333D01*
X120598000Y-76121000D01*
X120531333Y-76137666D01*
X120481333Y-76137666D01*
X120414666Y-76121000D01*
X120381333Y-76104333D01*
X120348000Y-76071000D01*
X120331333Y-76021000D01*
X120331333Y-75987666D01*
X120348000Y-75937666D01*
X120364666Y-75921000D01*
X120681333Y-75587666D02*
X120681333Y-75787666D01*
X120681333Y-75687666D02*
X120331333Y-75687666D01*
X120381333Y-75721000D01*
X120414666Y-75754333D01*
X120431333Y-75787666D01*
D10*
X120165904Y-88431380D02*
X120165904Y-87431380D01*
X120404000Y-87431380D01*
X120546857Y-87479000D01*
X120642095Y-87574238D01*
X120689714Y-87669476D01*
X120737333Y-87859952D01*
X120737333Y-88002809D01*
X120689714Y-88193285D01*
X120642095Y-88288523D01*
X120546857Y-88383761D01*
X120404000Y-88431380D01*
X120165904Y-88431380D01*
X121118285Y-87526619D02*
X121165904Y-87479000D01*
X121261142Y-87431380D01*
X121499238Y-87431380D01*
X121594476Y-87479000D01*
X121642095Y-87526619D01*
X121689714Y-87621857D01*
X121689714Y-87717095D01*
X121642095Y-87859952D01*
X121070666Y-88431380D01*
X121689714Y-88431380D01*
X111904761Y-93428571D02*
X112047619Y-93476190D01*
X112095238Y-93523809D01*
X112142857Y-93619047D01*
X112142857Y-93761904D01*
X112095238Y-93857142D01*
X112047619Y-93904761D01*
X111952380Y-93952380D01*
X111571428Y-93952380D01*
X111571428Y-92952380D01*
X111904761Y-92952380D01*
X112000000Y-93000000D01*
X112047619Y-93047619D01*
X112095238Y-93142857D01*
X112095238Y-93238095D01*
X112047619Y-93333333D01*
X112000000Y-93380952D01*
X111904761Y-93428571D01*
X111571428Y-93428571D01*
X112523809Y-93666666D02*
X113000000Y-93666666D01*
X112428571Y-93952380D02*
X112761904Y-92952380D01*
X113095238Y-93952380D01*
X113285714Y-92952380D02*
X113857142Y-92952380D01*
X113571428Y-93952380D02*
X113571428Y-92952380D01*
X114047619Y-92952380D02*
X114619047Y-92952380D01*
X114333333Y-93952380D02*
X114333333Y-92952380D01*
X115476190Y-93952380D02*
X114904761Y-93952380D01*
X115190476Y-93952380D02*
X115190476Y-92952380D01*
X115095238Y-93095238D01*
X115000000Y-93190476D01*
X114904761Y-93238095D01*
D14*
X115398190Y-66351952D02*
X115802952Y-66351952D01*
X115850571Y-66328142D01*
X115874380Y-66304333D01*
X115898190Y-66256714D01*
X115898190Y-66161476D01*
X115874380Y-66113857D01*
X115850571Y-66090047D01*
X115802952Y-66066238D01*
X115398190Y-66066238D01*
X115898190Y-65566238D02*
X115898190Y-65851952D01*
X115898190Y-65709095D02*
X115398190Y-65709095D01*
X115469619Y-65756714D01*
X115517238Y-65804333D01*
X115541047Y-65851952D01*
D10*
X107100904Y-62156380D02*
X107100904Y-62965904D01*
X107148523Y-63061142D01*
X107196142Y-63108761D01*
X107291380Y-63156380D01*
X107481857Y-63156380D01*
X107577095Y-63108761D01*
X107624714Y-63061142D01*
X107672333Y-62965904D01*
X107672333Y-62156380D01*
X108100904Y-63108761D02*
X108243761Y-63156380D01*
X108481857Y-63156380D01*
X108577095Y-63108761D01*
X108624714Y-63061142D01*
X108672333Y-62965904D01*
X108672333Y-62870666D01*
X108624714Y-62775428D01*
X108577095Y-62727809D01*
X108481857Y-62680190D01*
X108291380Y-62632571D01*
X108196142Y-62584952D01*
X108148523Y-62537333D01*
X108100904Y-62442095D01*
X108100904Y-62346857D01*
X108148523Y-62251619D01*
X108196142Y-62204000D01*
X108291380Y-62156380D01*
X108529476Y-62156380D01*
X108672333Y-62204000D01*
X109434238Y-62632571D02*
X109577095Y-62680190D01*
X109624714Y-62727809D01*
X109672333Y-62823047D01*
X109672333Y-62965904D01*
X109624714Y-63061142D01*
X109577095Y-63108761D01*
X109481857Y-63156380D01*
X109100904Y-63156380D01*
X109100904Y-62156380D01*
X109434238Y-62156380D01*
X109529476Y-62204000D01*
X109577095Y-62251619D01*
X109624714Y-62346857D01*
X109624714Y-62442095D01*
X109577095Y-62537333D01*
X109529476Y-62584952D01*
X109434238Y-62632571D01*
X109100904Y-62632571D01*
X110291380Y-62156380D02*
X110386619Y-62156380D01*
X110481857Y-62204000D01*
X110529476Y-62251619D01*
X110577095Y-62346857D01*
X110624714Y-62537333D01*
X110624714Y-62775428D01*
X110577095Y-62965904D01*
X110529476Y-63061142D01*
X110481857Y-63108761D01*
X110386619Y-63156380D01*
X110291380Y-63156380D01*
X110196142Y-63108761D01*
X110148523Y-63061142D01*
X110100904Y-62965904D01*
X110053285Y-62775428D01*
X110053285Y-62537333D01*
X110100904Y-62346857D01*
X110148523Y-62251619D01*
X110196142Y-62204000D01*
X110291380Y-62156380D01*
X117157666Y-65707761D02*
X117300523Y-65755380D01*
X117538619Y-65755380D01*
X117633857Y-65707761D01*
X117681476Y-65660142D01*
X117729095Y-65564904D01*
X117729095Y-65469666D01*
X117681476Y-65374428D01*
X117633857Y-65326809D01*
X117538619Y-65279190D01*
X117348142Y-65231571D01*
X117252904Y-65183952D01*
X117205285Y-65136333D01*
X117157666Y-65041095D01*
X117157666Y-64945857D01*
X117205285Y-64850619D01*
X117252904Y-64803000D01*
X117348142Y-64755380D01*
X117586238Y-64755380D01*
X117729095Y-64803000D01*
X118062428Y-64755380D02*
X118300523Y-65755380D01*
X118491000Y-65041095D01*
X118681476Y-65755380D01*
X118919571Y-64755380D01*
X119824333Y-65755380D02*
X119252904Y-65755380D01*
X119538619Y-65755380D02*
X119538619Y-64755380D01*
X119443380Y-64898238D01*
X119348142Y-64993476D01*
X119252904Y-65041095D01*
D12*
X119560952Y-79441666D02*
X119370476Y-79575000D01*
X119560952Y-79670238D02*
X119160952Y-79670238D01*
X119160952Y-79517857D01*
X119180000Y-79479761D01*
X119199047Y-79460714D01*
X119237142Y-79441666D01*
X119294285Y-79441666D01*
X119332380Y-79460714D01*
X119351428Y-79479761D01*
X119370476Y-79517857D01*
X119370476Y-79670238D01*
X119160952Y-79098809D02*
X119160952Y-79175000D01*
X119180000Y-79213095D01*
X119199047Y-79232142D01*
X119256190Y-79270238D01*
X119332380Y-79289285D01*
X119484761Y-79289285D01*
X119522857Y-79270238D01*
X119541904Y-79251190D01*
X119560952Y-79213095D01*
X119560952Y-79136904D01*
X119541904Y-79098809D01*
X119522857Y-79079761D01*
X119484761Y-79060714D01*
X119389523Y-79060714D01*
X119351428Y-79079761D01*
X119332380Y-79098809D01*
X119313333Y-79136904D01*
X119313333Y-79213095D01*
X119332380Y-79251190D01*
X119351428Y-79270238D01*
X119389523Y-79289285D01*
X121846952Y-79441666D02*
X121656476Y-79575000D01*
X121846952Y-79670238D02*
X121446952Y-79670238D01*
X121446952Y-79517857D01*
X121466000Y-79479761D01*
X121485047Y-79460714D01*
X121523142Y-79441666D01*
X121580285Y-79441666D01*
X121618380Y-79460714D01*
X121637428Y-79479761D01*
X121656476Y-79517857D01*
X121656476Y-79670238D01*
X121446952Y-79079761D02*
X121446952Y-79270238D01*
X121637428Y-79289285D01*
X121618380Y-79270238D01*
X121599333Y-79232142D01*
X121599333Y-79136904D01*
X121618380Y-79098809D01*
X121637428Y-79079761D01*
X121675523Y-79060714D01*
X121770761Y-79060714D01*
X121808857Y-79079761D01*
X121827904Y-79098809D01*
X121846952Y-79136904D01*
X121846952Y-79232142D01*
X121827904Y-79270238D01*
X121808857Y-79289285D01*
X102034952Y-89093666D02*
X101844476Y-89227000D01*
X102034952Y-89322238D02*
X101634952Y-89322238D01*
X101634952Y-89169857D01*
X101654000Y-89131761D01*
X101673047Y-89112714D01*
X101711142Y-89093666D01*
X101768285Y-89093666D01*
X101806380Y-89112714D01*
X101825428Y-89131761D01*
X101844476Y-89169857D01*
X101844476Y-89322238D01*
X101768285Y-88750809D02*
X102034952Y-88750809D01*
X101615904Y-88846047D02*
X101901619Y-88941285D01*
X101901619Y-88693666D01*
X103438333Y-86159952D02*
X103305000Y-85969476D01*
X103209761Y-86159952D02*
X103209761Y-85759952D01*
X103362142Y-85759952D01*
X103400238Y-85779000D01*
X103419285Y-85798047D01*
X103438333Y-85836142D01*
X103438333Y-85893285D01*
X103419285Y-85931380D01*
X103400238Y-85950428D01*
X103362142Y-85969476D01*
X103209761Y-85969476D01*
X103571666Y-85759952D02*
X103819285Y-85759952D01*
X103685952Y-85912333D01*
X103743095Y-85912333D01*
X103781190Y-85931380D01*
X103800238Y-85950428D01*
X103819285Y-85988523D01*
X103819285Y-86083761D01*
X103800238Y-86121857D01*
X103781190Y-86140904D01*
X103743095Y-86159952D01*
X103628809Y-86159952D01*
X103590714Y-86140904D01*
X103571666Y-86121857D01*
X113083952Y-71567666D02*
X112893476Y-71701000D01*
X113083952Y-71796238D02*
X112683952Y-71796238D01*
X112683952Y-71643857D01*
X112703000Y-71605761D01*
X112722047Y-71586714D01*
X112760142Y-71567666D01*
X112817285Y-71567666D01*
X112855380Y-71586714D01*
X112874428Y-71605761D01*
X112893476Y-71643857D01*
X112893476Y-71796238D01*
X112722047Y-71415285D02*
X112703000Y-71396238D01*
X112683952Y-71358142D01*
X112683952Y-71262904D01*
X112703000Y-71224809D01*
X112722047Y-71205761D01*
X112760142Y-71186714D01*
X112798238Y-71186714D01*
X112855380Y-71205761D01*
X113083952Y-71434333D01*
X113083952Y-71186714D01*
X107876952Y-73599666D02*
X107686476Y-73733000D01*
X107876952Y-73828238D02*
X107476952Y-73828238D01*
X107476952Y-73675857D01*
X107496000Y-73637761D01*
X107515047Y-73618714D01*
X107553142Y-73599666D01*
X107610285Y-73599666D01*
X107648380Y-73618714D01*
X107667428Y-73637761D01*
X107686476Y-73675857D01*
X107686476Y-73828238D01*
X107876952Y-73218714D02*
X107876952Y-73447285D01*
X107876952Y-73333000D02*
X107476952Y-73333000D01*
X107534095Y-73371095D01*
X107572190Y-73409190D01*
X107591238Y-73447285D01*
D14*
X107207809Y-83867619D02*
X107184000Y-83915238D01*
X107136380Y-83962857D01*
X107064952Y-84034285D01*
X107041142Y-84081904D01*
X107041142Y-84129523D01*
X107160190Y-84105714D02*
X107136380Y-84153333D01*
X107088761Y-84200952D01*
X106993523Y-84224761D01*
X106826857Y-84224761D01*
X106731619Y-84200952D01*
X106684000Y-84153333D01*
X106660190Y-84105714D01*
X106660190Y-84010476D01*
X106684000Y-83962857D01*
X106731619Y-83915238D01*
X106826857Y-83891428D01*
X106993523Y-83891428D01*
X107088761Y-83915238D01*
X107136380Y-83962857D01*
X107160190Y-84010476D01*
X107160190Y-84105714D01*
X107160190Y-83415238D02*
X107160190Y-83700952D01*
X107160190Y-83558095D02*
X106660190Y-83558095D01*
X106731619Y-83605714D01*
X106779238Y-83653333D01*
X106803047Y-83700952D01*
D12*
X105851333Y-78882857D02*
X105832285Y-78901904D01*
X105775142Y-78920952D01*
X105737047Y-78920952D01*
X105679904Y-78901904D01*
X105641809Y-78863809D01*
X105622761Y-78825714D01*
X105603714Y-78749523D01*
X105603714Y-78692380D01*
X105622761Y-78616190D01*
X105641809Y-78578095D01*
X105679904Y-78540000D01*
X105737047Y-78520952D01*
X105775142Y-78520952D01*
X105832285Y-78540000D01*
X105851333Y-78559047D01*
X106213238Y-78520952D02*
X106022761Y-78520952D01*
X106003714Y-78711428D01*
X106022761Y-78692380D01*
X106060857Y-78673333D01*
X106156095Y-78673333D01*
X106194190Y-78692380D01*
X106213238Y-78711428D01*
X106232285Y-78749523D01*
X106232285Y-78844761D01*
X106213238Y-78882857D01*
X106194190Y-78901904D01*
X106156095Y-78920952D01*
X106060857Y-78920952D01*
X106022761Y-78901904D01*
X106003714Y-78882857D01*
X110124857Y-76012666D02*
X110143904Y-76031714D01*
X110162952Y-76088857D01*
X110162952Y-76126952D01*
X110143904Y-76184095D01*
X110105809Y-76222190D01*
X110067714Y-76241238D01*
X109991523Y-76260285D01*
X109934380Y-76260285D01*
X109858190Y-76241238D01*
X109820095Y-76222190D01*
X109782000Y-76184095D01*
X109762952Y-76126952D01*
X109762952Y-76088857D01*
X109782000Y-76031714D01*
X109801047Y-76012666D01*
X109934380Y-75784095D02*
X109915333Y-75822190D01*
X109896285Y-75841238D01*
X109858190Y-75860285D01*
X109839142Y-75860285D01*
X109801047Y-75841238D01*
X109782000Y-75822190D01*
X109762952Y-75784095D01*
X109762952Y-75707904D01*
X109782000Y-75669809D01*
X109801047Y-75650761D01*
X109839142Y-75631714D01*
X109858190Y-75631714D01*
X109896285Y-75650761D01*
X109915333Y-75669809D01*
X109934380Y-75707904D01*
X109934380Y-75784095D01*
X109953428Y-75822190D01*
X109972476Y-75841238D01*
X110010571Y-75860285D01*
X110086761Y-75860285D01*
X110124857Y-75841238D01*
X110143904Y-75822190D01*
X110162952Y-75784095D01*
X110162952Y-75707904D01*
X110143904Y-75669809D01*
X110124857Y-75650761D01*
X110086761Y-75631714D01*
X110010571Y-75631714D01*
X109972476Y-75650761D01*
X109953428Y-75669809D01*
X109934380Y-75707904D01*
X105851333Y-80406857D02*
X105832285Y-80425904D01*
X105775142Y-80444952D01*
X105737047Y-80444952D01*
X105679904Y-80425904D01*
X105641809Y-80387809D01*
X105622761Y-80349714D01*
X105603714Y-80273523D01*
X105603714Y-80216380D01*
X105622761Y-80140190D01*
X105641809Y-80102095D01*
X105679904Y-80064000D01*
X105737047Y-80044952D01*
X105775142Y-80044952D01*
X105832285Y-80064000D01*
X105851333Y-80083047D01*
X106194190Y-80044952D02*
X106118000Y-80044952D01*
X106079904Y-80064000D01*
X106060857Y-80083047D01*
X106022761Y-80140190D01*
X106003714Y-80216380D01*
X106003714Y-80368761D01*
X106022761Y-80406857D01*
X106041809Y-80425904D01*
X106079904Y-80444952D01*
X106156095Y-80444952D01*
X106194190Y-80425904D01*
X106213238Y-80406857D01*
X106232285Y-80368761D01*
X106232285Y-80273523D01*
X106213238Y-80235428D01*
X106194190Y-80216380D01*
X106156095Y-80197333D01*
X106079904Y-80197333D01*
X106041809Y-80216380D01*
X106022761Y-80235428D01*
X106003714Y-80273523D01*
X121046857Y-71567666D02*
X121065904Y-71586714D01*
X121084952Y-71643857D01*
X121084952Y-71681952D01*
X121065904Y-71739095D01*
X121027809Y-71777190D01*
X120989714Y-71796238D01*
X120913523Y-71815285D01*
X120856380Y-71815285D01*
X120780190Y-71796238D01*
X120742095Y-71777190D01*
X120704000Y-71739095D01*
X120684952Y-71681952D01*
X120684952Y-71643857D01*
X120704000Y-71586714D01*
X120723047Y-71567666D01*
X120684952Y-71434333D02*
X120684952Y-71186714D01*
X120837333Y-71320047D01*
X120837333Y-71262904D01*
X120856380Y-71224809D01*
X120875428Y-71205761D01*
X120913523Y-71186714D01*
X121008761Y-71186714D01*
X121046857Y-71205761D01*
X121065904Y-71224809D01*
X121084952Y-71262904D01*
X121084952Y-71377190D01*
X121065904Y-71415285D01*
X121046857Y-71434333D01*
D14*
X116769047Y-70756190D02*
X116769047Y-71160952D01*
X116792857Y-71208571D01*
X116816666Y-71232380D01*
X116864285Y-71256190D01*
X116959523Y-71256190D01*
X117007142Y-71232380D01*
X117030952Y-71208571D01*
X117054761Y-71160952D01*
X117054761Y-70756190D01*
X117245238Y-70756190D02*
X117554761Y-70756190D01*
X117388095Y-70946666D01*
X117459523Y-70946666D01*
X117507142Y-70970476D01*
X117530952Y-70994285D01*
X117554761Y-71041904D01*
X117554761Y-71160952D01*
X117530952Y-71208571D01*
X117507142Y-71232380D01*
X117459523Y-71256190D01*
X117316666Y-71256190D01*
X117269047Y-71232380D01*
X117245238Y-71208571D01*
D10*
X117152380Y-80591904D02*
X117961904Y-80591904D01*
X118057142Y-80544285D01*
X118104761Y-80496666D01*
X118152380Y-80401428D01*
X118152380Y-80210952D01*
X118104761Y-80115714D01*
X118057142Y-80068095D01*
X117961904Y-80020476D01*
X117152380Y-80020476D01*
X117485714Y-79115714D02*
X118152380Y-79115714D01*
X117104761Y-79353809D02*
X117819047Y-79591904D01*
X117819047Y-78972857D01*
X123538095Y-97452380D02*
X123538095Y-96452380D01*
X123538095Y-96928571D02*
X124109523Y-96928571D01*
X124109523Y-97452380D02*
X124109523Y-96452380D01*
X124538095Y-96547619D02*
X124585714Y-96500000D01*
X124680952Y-96452380D01*
X124919047Y-96452380D01*
X125014285Y-96500000D01*
X125061904Y-96547619D01*
X125109523Y-96642857D01*
X125109523Y-96738095D01*
X125061904Y-96880952D01*
X124490476Y-97452380D01*
X125109523Y-97452380D01*
X102538095Y-97452380D02*
X102538095Y-96452380D01*
X102538095Y-96928571D02*
X103109523Y-96928571D01*
X103109523Y-97452380D02*
X103109523Y-96452380D01*
X104109523Y-97452380D02*
X103538095Y-97452380D01*
X103823809Y-97452380D02*
X103823809Y-96452380D01*
X103728571Y-96595238D01*
X103633333Y-96690476D01*
X103538095Y-96738095D01*
X106275476Y-66582380D02*
X106608809Y-67582380D01*
X106942142Y-66582380D01*
X107608809Y-67058571D02*
X107751666Y-67106190D01*
X107799285Y-67153809D01*
X107846904Y-67249047D01*
X107846904Y-67391904D01*
X107799285Y-67487142D01*
X107751666Y-67534761D01*
X107656428Y-67582380D01*
X107275476Y-67582380D01*
X107275476Y-66582380D01*
X107608809Y-66582380D01*
X107704047Y-66630000D01*
X107751666Y-66677619D01*
X107799285Y-66772857D01*
X107799285Y-66868095D01*
X107751666Y-66963333D01*
X107704047Y-67010952D01*
X107608809Y-67058571D01*
X107275476Y-67058571D01*
X108275476Y-66582380D02*
X108275476Y-67391904D01*
X108323095Y-67487142D01*
X108370714Y-67534761D01*
X108465952Y-67582380D01*
X108656428Y-67582380D01*
X108751666Y-67534761D01*
X108799285Y-67487142D01*
X108846904Y-67391904D01*
X108846904Y-66582380D01*
X109275476Y-67534761D02*
X109418333Y-67582380D01*
X109656428Y-67582380D01*
X109751666Y-67534761D01*
X109799285Y-67487142D01*
X109846904Y-67391904D01*
X109846904Y-67296666D01*
X109799285Y-67201428D01*
X109751666Y-67153809D01*
X109656428Y-67106190D01*
X109465952Y-67058571D01*
X109370714Y-67010952D01*
X109323095Y-66963333D01*
X109275476Y-66868095D01*
X109275476Y-66772857D01*
X109323095Y-66677619D01*
X109370714Y-66630000D01*
X109465952Y-66582380D01*
X109704047Y-66582380D01*
X109846904Y-66630000D01*
X110799285Y-67582380D02*
X110227857Y-67582380D01*
X110513571Y-67582380D02*
X110513571Y-66582380D01*
X110418333Y-66725238D01*
X110323095Y-66820476D01*
X110227857Y-66868095D01*
D14*
X104267047Y-88626190D02*
X104267047Y-89030952D01*
X104290857Y-89078571D01*
X104314666Y-89102380D01*
X104362285Y-89126190D01*
X104457523Y-89126190D01*
X104505142Y-89102380D01*
X104528952Y-89078571D01*
X104552761Y-89030952D01*
X104552761Y-88626190D01*
X104767047Y-88673809D02*
X104790857Y-88650000D01*
X104838476Y-88626190D01*
X104957523Y-88626190D01*
X105005142Y-88650000D01*
X105028952Y-88673809D01*
X105052761Y-88721428D01*
X105052761Y-88769047D01*
X105028952Y-88840476D01*
X104743238Y-89126190D01*
X105052761Y-89126190D01*
D10*
X124452380Y-74223333D02*
X125166666Y-74223333D01*
X125309523Y-74270952D01*
X125404761Y-74366190D01*
X125452380Y-74509047D01*
X125452380Y-74604285D01*
X124547619Y-73794761D02*
X124500000Y-73747142D01*
X124452380Y-73651904D01*
X124452380Y-73413809D01*
X124500000Y-73318571D01*
X124547619Y-73270952D01*
X124642857Y-73223333D01*
X124738095Y-73223333D01*
X124880952Y-73270952D01*
X125452380Y-73842380D01*
X125452380Y-73223333D01*
X101452380Y-74223333D02*
X102166666Y-74223333D01*
X102309523Y-74270952D01*
X102404761Y-74366190D01*
X102452380Y-74509047D01*
X102452380Y-74604285D01*
X102452380Y-73223333D02*
X102452380Y-73794761D01*
X102452380Y-73509047D02*
X101452380Y-73509047D01*
X101595238Y-73604285D01*
X101690476Y-73699523D01*
X101738095Y-73794761D01*
X118141904Y-91141000D02*
X118046666Y-91093380D01*
X117903809Y-91093380D01*
X117760952Y-91141000D01*
X117665714Y-91236238D01*
X117618095Y-91331476D01*
X117570476Y-91521952D01*
X117570476Y-91664809D01*
X117618095Y-91855285D01*
X117665714Y-91950523D01*
X117760952Y-92045761D01*
X117903809Y-92093380D01*
X117999047Y-92093380D01*
X118141904Y-92045761D01*
X118189523Y-91998142D01*
X118189523Y-91664809D01*
X117999047Y-91664809D01*
X118618095Y-92093380D02*
X118618095Y-91093380D01*
X119189523Y-92093380D01*
X119189523Y-91093380D01*
X119665714Y-92093380D02*
X119665714Y-91093380D01*
X119903809Y-91093380D01*
X120046666Y-91141000D01*
X120141904Y-91236238D01*
X120189523Y-91331476D01*
X120237142Y-91521952D01*
X120237142Y-91664809D01*
X120189523Y-91855285D01*
X120141904Y-91950523D01*
X120046666Y-92045761D01*
X119903809Y-92093380D01*
X119665714Y-92093380D01*
X121189523Y-92093380D02*
X120618095Y-92093380D01*
X120903809Y-92093380D02*
X120903809Y-91093380D01*
X120808571Y-91236238D01*
X120713333Y-91331476D01*
X120618095Y-91379095D01*
X103989380Y-74271095D02*
X102989380Y-74271095D01*
X102989380Y-74033000D01*
X103037000Y-73890142D01*
X103132238Y-73794904D01*
X103227476Y-73747285D01*
X103417952Y-73699666D01*
X103560809Y-73699666D01*
X103751285Y-73747285D01*
X103846523Y-73794904D01*
X103941761Y-73890142D01*
X103989380Y-74033000D01*
X103989380Y-74271095D01*
X103989380Y-72747285D02*
X103989380Y-73318714D01*
X103989380Y-73033000D02*
X102989380Y-73033000D01*
X103132238Y-73128238D01*
X103227476Y-73223476D01*
X103275095Y-73318714D01*
D15*
X112178571Y-76083333D02*
X112202380Y-76107142D01*
X112226190Y-76178571D01*
X112226190Y-76226190D01*
X112202380Y-76297619D01*
X112154761Y-76345238D01*
X112107142Y-76369047D01*
X112011904Y-76392857D01*
X111940476Y-76392857D01*
X111845238Y-76369047D01*
X111797619Y-76345238D01*
X111750000Y-76297619D01*
X111726190Y-76226190D01*
X111726190Y-76178571D01*
X111750000Y-76107142D01*
X111773809Y-76083333D01*
X111726190Y-75916666D02*
X111726190Y-75583333D01*
X112226190Y-75797619D01*
X104564666Y-92126571D02*
X104540857Y-92150380D01*
X104469428Y-92174190D01*
X104421809Y-92174190D01*
X104350380Y-92150380D01*
X104302761Y-92102761D01*
X104278952Y-92055142D01*
X104255142Y-91959904D01*
X104255142Y-91888476D01*
X104278952Y-91793238D01*
X104302761Y-91745619D01*
X104350380Y-91698000D01*
X104421809Y-91674190D01*
X104469428Y-91674190D01*
X104540857Y-91698000D01*
X104564666Y-91721809D01*
X104993238Y-91840857D02*
X104993238Y-92174190D01*
X104874190Y-91650380D02*
X104755142Y-92007523D01*
X105064666Y-92007523D01*
X119177571Y-71584333D02*
X119201380Y-71608142D01*
X119225190Y-71679571D01*
X119225190Y-71727190D01*
X119201380Y-71798619D01*
X119153761Y-71846238D01*
X119106142Y-71870047D01*
X119010904Y-71893857D01*
X118939476Y-71893857D01*
X118844238Y-71870047D01*
X118796619Y-71846238D01*
X118749000Y-71798619D01*
X118725190Y-71727190D01*
X118725190Y-71679571D01*
X118749000Y-71608142D01*
X118772809Y-71584333D01*
X118772809Y-71393857D02*
X118749000Y-71370047D01*
X118725190Y-71322428D01*
X118725190Y-71203380D01*
X118749000Y-71155761D01*
X118772809Y-71131952D01*
X118820428Y-71108142D01*
X118868047Y-71108142D01*
X118939476Y-71131952D01*
X119225190Y-71417666D01*
X119225190Y-71108142D01*
X111176571Y-71584333D02*
X111200380Y-71608142D01*
X111224190Y-71679571D01*
X111224190Y-71727190D01*
X111200380Y-71798619D01*
X111152761Y-71846238D01*
X111105142Y-71870047D01*
X111009904Y-71893857D01*
X110938476Y-71893857D01*
X110843238Y-71870047D01*
X110795619Y-71846238D01*
X110748000Y-71798619D01*
X110724190Y-71727190D01*
X110724190Y-71679571D01*
X110748000Y-71608142D01*
X110771809Y-71584333D01*
X111224190Y-71108142D02*
X111224190Y-71393857D01*
X111224190Y-71251000D02*
X110724190Y-71251000D01*
X110795619Y-71298619D01*
X110843238Y-71346238D01*
X110867047Y-71393857D01*
D10*
X105148380Y-91585428D02*
X105910285Y-91585428D01*
X105529333Y-91966380D02*
X105529333Y-91204476D01*
X106719809Y-91442571D02*
X106862666Y-91490190D01*
X106910285Y-91537809D01*
X106957904Y-91633047D01*
X106957904Y-91775904D01*
X106910285Y-91871142D01*
X106862666Y-91918761D01*
X106767428Y-91966380D01*
X106386476Y-91966380D01*
X106386476Y-90966380D01*
X106719809Y-90966380D01*
X106815047Y-91014000D01*
X106862666Y-91061619D01*
X106910285Y-91156857D01*
X106910285Y-91252095D01*
X106862666Y-91347333D01*
X106815047Y-91394952D01*
X106719809Y-91442571D01*
X106386476Y-91442571D01*
X107338857Y-91680666D02*
X107815047Y-91680666D01*
X107243619Y-91966380D02*
X107576952Y-90966380D01*
X107910285Y-91966380D01*
X108100761Y-90966380D02*
X108672190Y-90966380D01*
X108386476Y-91966380D02*
X108386476Y-90966380D01*
X108862666Y-90966380D02*
X109434095Y-90966380D01*
X109148380Y-91966380D02*
X109148380Y-90966380D01*
X110291238Y-91966380D02*
X109719809Y-91966380D01*
X110005523Y-91966380D02*
X110005523Y-90966380D01*
X109910285Y-91109238D01*
X109815047Y-91204476D01*
X109719809Y-91252095D01*
X119269095Y-66185428D02*
X120031000Y-66185428D01*
X119650047Y-66566380D02*
X119650047Y-65804476D01*
X120411952Y-65566380D02*
X121031000Y-65566380D01*
X120697666Y-65947333D01*
X120840523Y-65947333D01*
X120935761Y-65994952D01*
X120983380Y-66042571D01*
X121031000Y-66137809D01*
X121031000Y-66375904D01*
X120983380Y-66471142D01*
X120935761Y-66518761D01*
X120840523Y-66566380D01*
X120554809Y-66566380D01*
X120459571Y-66518761D01*
X120411952Y-66471142D01*
X121316714Y-65566380D02*
X121650047Y-66566380D01*
X121983380Y-65566380D01*
X122840523Y-66566380D02*
X122269095Y-66566380D01*
X122554809Y-66566380D02*
X122554809Y-65566380D01*
X122459571Y-65709238D01*
X122364333Y-65804476D01*
X122269095Y-65852095D01*
M02*
