EESchema Schematic File Version 4
EELAYER 30 0
EELAYER END
$Descr A4 11693 8268
encoding utf-8
Sheet 1 1
Title "ESP32 CAM-Battery"
Date "2020-11-04"
Rev "v1.0"
Comp "Cesare Schwabl"
Comment1 ""
Comment2 ""
Comment3 ""
Comment4 ""
$EndDescr
$Comp
L Connector:TestPoint +3V1
U 1 1 5E0E8A64
P 7300 3250
F 0 "+3V1" H 7358 3368 50  0000 L CNN
F 1 "3V3" H 7358 3277 50  0000 L CNN
F 2 "TestPoint:TestPoint_Pad_D1.0mm" H 7500 3250 50  0001 C CNN
F 3 "~" H 7500 3250 50  0001 C CNN
F 4 "-" H 7300 3250 50  0001 C CNN "LCSC_Part_Number"
F 5 "-" H 7300 3250 50  0001 C CNN "Manufacturer_Name"
F 6 "-" H 7300 3250 50  0001 C CNN "Manufacturer_Part_Number"
	1    7300 3250
	1    0    0    -1  
$EndComp
$Comp
L Connector:TestPoint GND1
U 1 1 5E0E95D8
P 8250 3250
F 0 "GND1" H 8308 3368 50  0000 L CNN
F 1 "GND" H 8308 3277 50  0000 L CNN
F 2 "TestPoint:TestPoint_Pad_D1.0mm" H 8450 3250 50  0001 C CNN
F 3 "~" H 8450 3250 50  0001 C CNN
F 4 "-" H 8250 3250 50  0001 C CNN "LCSC_Part_Number"
F 5 "-" H 8250 3250 50  0001 C CNN "Manufacturer_Name"
F 6 "-" H 8250 3250 50  0001 C CNN "Manufacturer_Part_Number"
	1    8250 3250
	1    0    0    -1  
$EndComp
Wire Wire Line
	7300 3250 7300 3400
Wire Wire Line
	7300 3400 7600 3400
Wire Wire Line
	8250 3250 8250 3400
Wire Wire Line
	8250 3400 8600 3400
Text Label 7600 3400 2    50   ~ 0
+3V3
Text Label 8600 3400 2    50   ~ 0
GND
$Comp
L Regulator_Linear:AP2112K-3.3 U1
U 1 1 5E0CB678
P 2450 6300
F 0 "U1" H 2450 6642 50  0000 C CNN
F 1 "AP2112K-3.3TRG1" H 2450 6551 50  0000 C CNN
F 2 "Package_TO_SOT_SMD:SOT-23-5" H 2450 6625 50  0001 C CNN
F 3 "https://www.diodes.com/assets/Datasheets/AP2112.pdf" H 2450 6400 50  0001 C CNN
F 4 "C51118" H 2450 6300 50  0001 C CNN "LCSC_Part_Number"
F 5 "Diodes Incorporated" H 2450 6300 50  0001 C CNN "Manufacturer_Name"
F 6 "AP2112K-3.3TRG1" H 2450 6300 50  0001 C CNN "Manufacturer_Part_Number"
	1    2450 6300
	1    0    0    -1  
$EndComp
$Comp
L power:VBUS #PWR016
U 1 1 5E0CE20D
P 1000 5700
F 0 "#PWR016" H 1000 5550 50  0001 C CNN
F 1 "VBUS" H 1015 5873 50  0000 C CNN
F 2 "" H 1000 5700 50  0001 C CNN
F 3 "" H 1000 5700 50  0001 C CNN
	1    1000 5700
	1    0    0    -1  
$EndComp
$Comp
L power:GND #PWR017
U 1 1 5E0CF247
P 1000 6800
F 0 "#PWR017" H 1000 6550 50  0001 C CNN
F 1 "GND" H 1005 6627 50  0000 C CNN
F 2 "" H 1000 6800 50  0001 C CNN
F 3 "" H 1000 6800 50  0001 C CNN
	1    1000 6800
	1    0    0    -1  
$EndComp
$Comp
L power:+BATT #PWR020
U 1 1 5E0CFDCB
P 1400 5400
F 0 "#PWR020" H 1400 5250 50  0001 C CNN
F 1 "+BATT" H 1415 5573 50  0000 C CNN
F 2 "" H 1400 5400 50  0001 C CNN
F 3 "" H 1400 5400 50  0001 C CNN
	1    1400 5400
	1    0    0    -1  
$EndComp
Wire Wire Line
	1000 5700 1000 5850
Wire Wire Line
	1000 5850 1100 5850
Connection ~ 1000 5850
$Comp
L Device:R_Small R2
U 1 1 5E0EA8C4
P 1700 6500
F 0 "R2" H 1550 6500 50  0000 L CNN
F 1 "100K" H 1450 6600 50  0000 L CNN
F 2 "Resistor_SMD:R_0603_1608Metric" H 1700 6500 50  0001 C CNN
F 3 "~" H 1700 6500 50  0001 C CNN
F 4 "C25803" H 1700 6500 50  0001 C CNN "LCSC_Part_Number"
F 5 "Uniroyal Elec" H 1700 6500 50  0001 C CNN "Manufacturer_Name"
F 6 "0603WAF1003T5E" H 1700 6500 50  0001 C CNN "Manufacturer_Part_Number"
	1    1700 6500
	-1   0    0    1   
$EndComp
$Comp
L Device:R_Small R1
U 1 1 5E0F3B04
P 1000 6500
F 0 "R1" H 1050 6500 50  0000 L CNN
F 1 "100K" H 1050 6600 50  0000 L CNN
F 2 "Resistor_SMD:R_0603_1608Metric" H 1000 6500 50  0001 C CNN
F 3 "~" H 1000 6500 50  0001 C CNN
F 4 "C25803" H 1000 6500 50  0001 C CNN "LCSC_Part_Number"
F 5 "Uniroyal Elec" H 1000 6500 50  0001 C CNN "Manufacturer_Name"
F 6 "0603WAF1003T5E" H 1000 6500 50  0001 C CNN "Manufacturer_Part_Number"
	1    1000 6500
	-1   0    0    1   
$EndComp
$Comp
L power:GND #PWR021
U 1 1 5E0F50F3
P 1550 6800
F 0 "#PWR021" H 1550 6550 50  0001 C CNN
F 1 "GND" H 1555 6627 50  0000 C CNN
F 2 "" H 1550 6800 50  0001 C CNN
F 3 "" H 1550 6800 50  0001 C CNN
	1    1550 6800
	1    0    0    -1  
$EndComp
$Comp
L power:GND #PWR025
U 1 1 5E0F59D0
P 2450 6800
F 0 "#PWR025" H 2450 6550 50  0001 C CNN
F 1 "GND" H 2455 6627 50  0000 C CNN
F 2 "" H 2450 6800 50  0001 C CNN
F 3 "" H 2450 6800 50  0001 C CNN
	1    2450 6800
	1    0    0    -1  
$EndComp
Wire Wire Line
	2450 6800 2450 6600
Wire Wire Line
	1000 6600 1000 6800
$Comp
L Device:C_Small C1
U 1 1 5E102A5F
P 1550 6500
F 0 "C1" H 1350 6500 50  0000 C CNN
F 1 "10uF" H 1400 6400 50  0000 C CNN
F 2 "Capacitor_SMD:C_0805_2012Metric" H 1550 6500 50  0001 C CNN
F 3 "~" H 1550 6500 50  0001 C CNN
F 4 "C15850" H 1550 6500 50  0001 C CNN "LCSC_Part_Number"
F 5 "Samsung Electro-Mechanics" H 1550 6500 50  0001 C CNN "Manufacturer_Name"
F 6 "CL21A106KAYNNNE" H 1550 6500 50  0001 C CNN "Manufacturer_Part_Number"
	1    1550 6500
	1    0    0    -1  
$EndComp
$Comp
L Device:C_Small C2
U 1 1 5E103B01
P 2900 6450
F 0 "C2" H 2750 6450 50  0000 C CNN
F 1 "10uF" H 2800 6350 50  0000 C CNN
F 2 "Capacitor_SMD:C_0805_2012Metric" H 2900 6450 50  0001 C CNN
F 3 "~" H 2900 6450 50  0001 C CNN
F 4 "C15850" H 2900 6450 50  0001 C CNN "LCSC_Part_Number"
F 5 "Samsung Electro-Mechanics" H 2900 6450 50  0001 C CNN "Manufacturer_Name"
F 6 "CL21A106KAYNNNE" H 2900 6450 50  0001 C CNN "Manufacturer_Part_Number"
	1    2900 6450
	1    0    0    -1  
$EndComp
$Comp
L Device:C_Small C3
U 1 1 5E104EA1
P 3250 6450
F 0 "C3" H 3125 6450 50  0000 C CNN
F 1 "1uF" H 3150 6350 50  0000 C CNN
F 2 "Capacitor_SMD:C_0603_1608Metric" H 3250 6450 50  0001 C CNN
F 3 "~" H 3250 6450 50  0001 C CNN
F 4 "C15849" H 3250 6450 50  0001 C CNN "LCSC_Part_Number"
F 5 "Samsung Electro-Mechanics" H 3250 6450 50  0001 C CNN "Manufacturer_Name"
F 6 "CL10A105KB8NNNC" H 3250 6450 50  0001 C CNN "Manufacturer_Part_Number"
	1    3250 6450
	1    0    0    -1  
$EndComp
Wire Wire Line
	3250 6200 3250 6000
Wire Wire Line
	3250 6200 3250 6350
Connection ~ 3250 6200
Wire Wire Line
	2900 6350 2900 6200
Wire Wire Line
	2900 6800 2900 6550
Wire Wire Line
	3250 6800 3250 6550
Wire Wire Line
	1550 6800 1550 6600
Wire Wire Line
	1550 6400 1550 6200
Connection ~ 1550 6200
Wire Wire Line
	1550 6200 1700 6200
$Comp
L power:+3V3 #PWR027
U 1 1 5E122BDA
P 3250 6000
F 0 "#PWR027" H 3250 5850 50  0001 C CNN
F 1 "+3V3" H 3265 6173 50  0000 C CNN
F 2 "" H 3250 6000 50  0001 C CNN
F 3 "" H 3250 6000 50  0001 C CNN
	1    3250 6000
	1    0    0    -1  
$EndComp
$Comp
L power:GND #PWR026
U 1 1 5E123738
P 2900 6800
F 0 "#PWR026" H 2900 6550 50  0001 C CNN
F 1 "GND" H 2905 6627 50  0000 C CNN
F 2 "" H 2900 6800 50  0001 C CNN
F 3 "" H 2900 6800 50  0001 C CNN
	1    2900 6800
	1    0    0    -1  
$EndComp
$Comp
L power:GND #PWR028
U 1 1 5E123BB1
P 3250 6800
F 0 "#PWR028" H 3250 6550 50  0001 C CNN
F 1 "GND" H 3255 6627 50  0000 C CNN
F 2 "" H 3250 6800 50  0001 C CNN
F 3 "" H 3250 6800 50  0001 C CNN
	1    3250 6800
	1    0    0    -1  
$EndComp
$Comp
L Connector_Generic:Conn_01x02 BATT1
U 1 1 5E12997A
P 8900 1750
F 0 "BATT1" H 8980 1742 50  0000 L CNN
F 1 "JST" H 8980 1651 50  0000 L CNN
F 2 "0_cesare:Adafruit_1769" H 8900 1750 50  0001 C CNN
F 3 "~" H 8900 1750 50  0001 C CNN
F 4 "-" H 8900 1750 50  0001 C CNN "LCSC_Part_Number"
F 5 "Adafruit" H 8900 1750 50  0001 C CNN "Manufacturer_Name"
F 6 "1769" H 8900 1750 50  0001 C CNN "Manufacturer_Part_Number"
	1    8900 1750
	1    0    0    -1  
$EndComp
Wire Wire Line
	8700 1750 8600 1750
Wire Wire Line
	8600 1750 8600 1350
Wire Wire Line
	8700 1850 8600 1850
Wire Wire Line
	8600 1850 8600 2150
$Comp
L power:GND #PWR030
U 1 1 5E13380F
P 8600 2150
F 0 "#PWR030" H 8600 1900 50  0001 C CNN
F 1 "GND" H 8605 1977 50  0000 C CNN
F 2 "" H 8600 2150 50  0001 C CNN
F 3 "" H 8600 2150 50  0001 C CNN
	1    8600 2150
	1    0    0    -1  
$EndComp
$Comp
L power:+BATT #PWR029
U 1 1 5E133CD5
P 8600 1350
F 0 "#PWR029" H 8600 1200 50  0001 C CNN
F 1 "+BATT" H 8615 1523 50  0000 C CNN
F 2 "" H 8600 1350 50  0001 C CNN
F 3 "" H 8600 1350 50  0001 C CNN
	1    8600 1350
	1    0    0    -1  
$EndComp
Wire Wire Line
	2900 6200 3250 6200
Wire Wire Line
	2750 6200 2900 6200
Connection ~ 2900 6200
Text Notes 825  4975 0    98   ~ 20
POWER AND FILTERING
$Comp
L Battery_Management:MCP73831-2-OT U2
U 1 1 5E3FDB93
P 5150 6325
F 0 "U2" H 5150 6806 50  0000 C CNN
F 1 "MCP73831T-2ATI/OT" H 5150 6715 50  0000 C CNN
F 2 "Package_TO_SOT_SMD:SOT-23-5" H 5200 6075 50  0001 L CIN
F 3 "http://ww1.microchip.com/downloads/en/DeviceDoc/20001984g.pdf" H 5000 6275 50  0001 C CNN
F 4 "C424093" H 5150 6325 50  0001 C CNN "LCSC_Part_Number"
F 5 "Microchip Tech" H 5150 6325 50  0001 C CNN "Manufacturer_Name"
F 6 "MCP73831T-2ACI/OT" H 5150 6325 50  0001 C CNN "Manufacturer_Part_Number"
	1    5150 6325
	1    0    0    -1  
$EndComp
$Comp
L Device:LED_Small CHARGE1
U 1 1 5E3FF092
P 6200 6425
F 0 "CHARGE1" H 6200 6575 50  0000 C CNN
F 1 "BLUE" H 6200 6325 50  0000 C CNN
F 2 "LED_SMD:LED_0603_1608Metric" V 6200 6425 50  0001 C CNN
F 3 "~" V 6200 6425 50  0001 C CNN
F 4 "C72041" H 6200 6425 50  0001 C CNN "LCSC_Part_Number"
F 5 "Everlight Elec" H 6200 6425 50  0001 C CNN "Manufacturer_Name"
F 6 "19-217/BHC-ZL1M2RY/3T" H 6200 6425 50  0001 C CNN "Manufacturer_Part_Number"
	1    6200 6425
	1    0    0    -1  
$EndComp
$Comp
L Device:R_Small R4
U 1 1 5E401799
P 5800 6425
F 0 "R4" V 5650 6375 50  0000 L CNN
F 1 "1K" V 5900 6325 50  0000 L CNN
F 2 "Resistor_SMD:R_0603_1608Metric" H 5800 6425 50  0001 C CNN
F 3 "~" H 5800 6425 50  0001 C CNN
F 4 "C21190" H 5800 6425 50  0001 C CNN "LCSC_Part_Number"
F 5 "Uniroyal Elec" H 5800 6425 50  0001 C CNN "Manufacturer_Name"
F 6 "0603WAF1001T5E" H 5800 6425 50  0001 C CNN "Manufacturer_Part_Number"
	1    5800 6425
	0    1    1    0   
$EndComp
Wire Wire Line
	5700 6425 5550 6425
Wire Wire Line
	6100 6425 5900 6425
Wire Wire Line
	5150 6025 6450 6025
Wire Wire Line
	6450 6025 6450 6425
Wire Wire Line
	6450 6425 6300 6425
Wire Wire Line
	6450 6025 6450 5825
Connection ~ 6450 6025
$Comp
L Device:R_Small R3
U 1 1 5E427090
P 4450 6425
F 0 "R3" V 4350 6375 50  0000 L CNN
F 1 "4.7K" V 4550 6325 50  0000 L CNN
F 2 "Resistor_SMD:R_0603_1608Metric" H 4450 6425 50  0001 C CNN
F 3 "~" H 4450 6425 50  0001 C CNN
F 4 "C23162" H 4450 6425 50  0001 C CNN "LCSC_Part_Number"
F 5 "Uniroyal Elec" H 4450 6425 50  0001 C CNN "Manufacturer_Name"
F 6 "0603WAF4701T5E" H 4450 6425 50  0001 C CNN "Manufacturer_Part_Number"
	1    4450 6425
	0    1    1    0   
$EndComp
Wire Wire Line
	4750 6425 4550 6425
Wire Wire Line
	4350 6425 4250 6425
Wire Wire Line
	4250 6425 4250 6625
Wire Wire Line
	5150 6625 4250 6625
Connection ~ 4250 6625
Wire Wire Line
	4250 6625 4250 6775
$Comp
L power:GND #PWR01
U 1 1 5E4453DD
P 4250 6775
F 0 "#PWR01" H 4250 6525 50  0001 C CNN
F 1 "GND" H 4255 6602 50  0000 C CNN
F 2 "" H 4250 6775 50  0001 C CNN
F 3 "" H 4250 6775 50  0001 C CNN
	1    4250 6775
	1    0    0    -1  
$EndComp
$Comp
L power:VBUS #PWR09
U 1 1 5E445E70
P 6450 5825
F 0 "#PWR09" H 6450 5675 50  0001 C CNN
F 1 "VBUS" H 6465 5998 50  0000 C CNN
F 2 "" H 6450 5825 50  0001 C CNN
F 3 "" H 6450 5825 50  0001 C CNN
	1    6450 5825
	1    0    0    -1  
$EndComp
Wire Wire Line
	5550 6225 5600 6225
Wire Wire Line
	5600 6225 5600 5825
$Comp
L power:GND #PWR07
U 1 1 5E45BC5E
P 5600 6775
F 0 "#PWR07" H 5600 6525 50  0001 C CNN
F 1 "GND" H 5605 6602 50  0000 C CNN
F 2 "" H 5600 6775 50  0001 C CNN
F 3 "" H 5600 6775 50  0001 C CNN
	1    5600 6775
	1    0    0    -1  
$EndComp
$Comp
L power:+BATT #PWR06
U 1 1 5E45C3FC
P 5600 5825
F 0 "#PWR06" H 5600 5675 50  0001 C CNN
F 1 "+BATT" H 5615 5998 50  0000 C CNN
F 2 "" H 5600 5825 50  0001 C CNN
F 3 "" H 5600 5825 50  0001 C CNN
	1    5600 5825
	1    0    0    -1  
$EndComp
Text Notes 725  800  0    98   ~ 20
LIPO CHARGING + USB to Serial
Text Notes 4100 6125 0    50   ~ 0
10K = 100mA\n 5K = 200mA\n 2K = 500mA\n 1K = 1000mA
$Comp
L Connector:TestPoint VBUS1
U 1 1 5E66AD6D
P 8800 3250
F 0 "VBUS1" H 8858 3368 50  0000 L CNN
F 1 "VBUS" H 8858 3277 50  0000 L CNN
F 2 "TestPoint:TestPoint_Pad_D1.0mm" H 9000 3250 50  0001 C CNN
F 3 "~" H 9000 3250 50  0001 C CNN
F 4 "-" H 8800 3250 50  0001 C CNN "LCSC_Part_Number"
F 5 "-" H 8800 3250 50  0001 C CNN "Manufacturer_Name"
F 6 "-" H 8800 3250 50  0001 C CNN "Manufacturer_Part_Number"
	1    8800 3250
	1    0    0    -1  
$EndComp
$Comp
L Connector:TestPoint +BATT1
U 1 1 5E66AD73
P 7750 3250
F 0 "+BATT1" H 7808 3368 50  0000 L CNN
F 1 "+BATT" H 7808 3277 50  0000 L CNN
F 2 "TestPoint:TestPoint_Pad_D1.0mm" H 7950 3250 50  0001 C CNN
F 3 "~" H 7950 3250 50  0001 C CNN
F 4 "-" H 7750 3250 50  0001 C CNN "LCSC_Part_Number"
F 5 "-" H 7750 3250 50  0001 C CNN "Manufacturer_Name"
F 6 "-" H 7750 3250 50  0001 C CNN "Manufacturer_Part_Number"
	1    7750 3250
	1    0    0    -1  
$EndComp
Wire Wire Line
	8800 3250 8800 3400
Wire Wire Line
	8800 3400 9100 3400
Wire Wire Line
	7750 3250 7750 3400
Wire Wire Line
	7750 3400 8100 3400
Text Label 9100 3400 2    50   ~ 0
VBUS
Text Label 8100 3400 2    50   ~ 0
+BATT
Wire Wire Line
	7225 2100 7225 2150
$Comp
L power:VBUS #PWR011
U 1 1 5E6D6CB6
P 2375 2800
F 0 "#PWR011" H 2375 2650 50  0001 C CNN
F 1 "VBUS" H 2390 2973 50  0000 C CNN
F 2 "" H 2375 2800 50  0001 C CNN
F 3 "" H 2375 2800 50  0001 C CNN
	1    2375 2800
	1    0    0    -1  
$EndComp
NoConn ~ 7625 1900
$Comp
L power:GND #PWR010
U 1 1 5E72A9D1
P 7325 2150
F 0 "#PWR010" H 7325 1900 50  0001 C CNN
F 1 "GND" H 7330 1977 50  0000 C CNN
F 2 "" H 7325 2150 50  0001 C CNN
F 3 "" H 7325 2150 50  0001 C CNN
	1    7325 2150
	1    0    0    -1  
$EndComp
Text Notes 7050 2950 0    98   ~ 20
TP
$Comp
L Device:C_Small C4
U 1 1 5E20CA08
P 5600 6625
F 0 "C4" H 5725 6550 50  0000 C CNN
F 1 "10uF" H 5775 6475 50  0000 C CNN
F 2 "Capacitor_SMD:C_0805_2012Metric" H 5600 6625 50  0001 C CNN
F 3 "~" H 5600 6625 50  0001 C CNN
F 4 "C15850" H 5600 6625 50  0001 C CNN "LCSC_Part_Number"
F 5 "Samsung Electro-Mechanics" H 5600 6625 50  0001 C CNN "Manufacturer_Name"
F 6 "CL21A106KAYNNNE" H 5600 6625 50  0001 C CNN "Manufacturer_Part_Number"
	1    5600 6625
	1    0    0    -1  
$EndComp
Wire Wire Line
	5600 6725 5600 6775
Wire Wire Line
	5600 6525 5600 6225
Connection ~ 5600 6225
Text Label 2100 6300 2    50   ~ 0
RESET
Wire Wire Line
	1000 6200 1000 6400
Wire Wire Line
	1000 5850 1000 6200
Connection ~ 1000 6200
Wire Wire Line
	1000 6200 1050 6200
$Comp
L Device:D_Schottky_Small D1
U 1 1 5E101D50
P 1150 6200
F 0 "D1" H 1150 5995 50  0000 C CNN
F 1 "B5819W" H 1150 6086 50  0000 C CNN
F 2 "Diode_SMD:D_SOD-123" V 1150 6200 50  0001 C CNN
F 3 "~" V 1150 6200 50  0001 C CNN
F 4 "C8598" H 1150 6200 50  0001 C CNN "LCSC_Part_Number"
F 5 "Changjiang Electronics Tech (CJ)" H 1150 6200 50  0001 C CNN "Manufacturer_Name"
F 6 "B5819W" H 1150 6200 50  0001 C CNN "Manufacturer_Part_Number"
	1    1150 6200
	-1   0    0    1   
$EndComp
$Comp
L Mechanical:MountingHole H1
U 1 1 5E107D44
P 9675 3200
F 0 "H1" H 9625 3325 50  0000 L CNN
F 1 "M3" H 9625 3075 50  0000 L CNN
F 2 "MountingHole:MountingHole_2.7mm_M2.5" H 9675 3200 50  0001 C CNN
F 3 "~" H 9675 3200 50  0001 C CNN
F 4 "-" H 9675 3200 50  0001 C CNN "LCSC_Part_Number"
F 5 "-" H 9675 3200 50  0001 C CNN "Manufacturer_Name"
F 6 "-" H 9675 3200 50  0001 C CNN "Manufacturer_Part_Number"
	1    9675 3200
	1    0    0    -1  
$EndComp
$Comp
L Mechanical:MountingHole H2
U 1 1 5E12030D
P 10025 3200
F 0 "H2" H 9975 3325 50  0000 L CNN
F 1 "M3" H 9975 3075 50  0000 L CNN
F 2 "MountingHole:MountingHole_2.7mm_M2.5" H 10025 3200 50  0001 C CNN
F 3 "~" H 10025 3200 50  0001 C CNN
F 4 "-" H 10025 3200 50  0001 C CNN "LCSC_Part_Number"
F 5 "-" H 10025 3200 50  0001 C CNN "Manufacturer_Name"
F 6 "-" H 10025 3200 50  0001 C CNN "Manufacturer_Part_Number"
	1    10025 3200
	1    0    0    -1  
$EndComp
NoConn ~ 7225 2150
$Comp
L Connector:USB_B_Micro USB0
U 1 1 5E6797FB
P 7325 1700
F 0 "USB0" H 7325 2150 50  0000 C CNN
F 1 "USB_B_Micro" H 7382 2076 50  0000 C CNN
F 2 "0_cesare:Wuerth_629105150521" H 7475 1650 50  0001 C CNN
F 3 "~" H 7475 1650 50  0001 C CNN
F 4 "-" H 7325 1700 50  0001 C CNN "LCSC_Part_Number"
F 5 "Wurth Elektronik" H 7325 1700 50  0001 C CNN "Manufacturer_Name"
F 6 "629105150521" H 7325 1700 50  0001 C CNN "Manufacturer_Part_Number"
	1    7325 1700
	1    0    0    -1  
$EndComp
Wire Notes Line
	7000 3525 11250 3525
Wire Notes Line
	6975 6525 6975 475 
Wire Notes Line
	6975 4600 475  4600
Wire Notes Line
	475  2650 475  2675
Wire Wire Line
	2150 6200 1700 6200
Connection ~ 1700 6200
Wire Wire Line
	1250 6200 1400 6200
Wire Wire Line
	1400 6050 1400 6200
Connection ~ 1400 6200
Wire Wire Line
	1400 6200 1550 6200
$Comp
L 0_cesare:Logo Logo1
U 1 1 5ECCE9BA
P 10300 3125
F 0 "Logo1" H 10400 3125 50  0000 L CNN
F 1 "CS Logo" H 10325 3080 50  0001 L CNN
F 2 "0_cesare:cs_5mm" H 10300 3125 50  0001 C CNN
F 3 "" H 10300 3125 50  0001 C CNN
F 4 "-" H 10300 3125 50  0001 C CNN "LCSC_Part_Number"
F 5 "-" H 10300 3125 50  0001 C CNN "Manufacturer_Name"
F 6 "-" H 10300 3125 50  0001 C CNN "Manufacturer_Part_Number"
	1    10300 3125
	1    0    0    -1  
$EndComp
$Comp
L Device:C_Small C7
U 1 1 5FACE6FF
P 5925 1200
F 0 "C7" H 6100 1200 50  0000 C CNN
F 1 "10uF" H 6150 1125 50  0000 C CNN
F 2 "Capacitor_SMD:C_0805_2012Metric" H 5925 1200 50  0001 C CNN
F 3 "~" H 5925 1200 50  0001 C CNN
F 4 "C15850" H 5925 1200 50  0001 C CNN "LCSC_Part_Number"
F 5 "Samsung Electro-Mechanics" H 5925 1200 50  0001 C CNN "Manufacturer_Name"
F 6 "CL21A106KAYNNNE" H 5925 1200 50  0001 C CNN "Manufacturer_Part_Number"
	1    5925 1200
	1    0    0    -1  
$EndComp
Wire Wire Line
	4575 1050 4575 925 
$Comp
L power:GND #PWR0110
U 1 1 5FB11571
P 4800 1350
F 0 "#PWR0110" H 4800 1100 50  0001 C CNN
F 1 "GND" H 4805 1177 50  0000 C CNN
F 2 "" H 4800 1350 50  0001 C CNN
F 3 "" H 4800 1350 50  0001 C CNN
	1    4800 1350
	1    0    0    -1  
$EndComp
$Comp
L 0_cesare:MMBT2222ALT1G IC2
U 1 1 5FB13611
P 1900 2050
F 0 "IC2" H 2300 1685 50  0000 C CNN
F 1 "MMBT2222ATT1G" H 2300 1776 50  0000 C CNN
F 2 "Package_TO_SOT_SMD:SOT-416" H 2550 2150 50  0001 L CNN
F 3 "http://www.onsemi.com/pub/Collateral/MMBT2222LT1-D.PDF" H 2550 2050 50  0001 L CNN
F 4 "MMBT2222ALT1G, NPN Bipolar Transistor,  0.6 A 40 V HFE:35 300 MHz Small Signal, 3-Pin SOT-23" H 2550 1950 50  0001 L CNN "Description"
F 5 "1.11" H 2550 1850 50  0001 L CNN "Height"
F 6 "" H 2550 1750 50  0001 L CNN "Mouser Part Number"
F 7 "" H 2550 1650 50  0001 L CNN "Mouser Price/Stock"
F 8 "ON Semicon" H 2550 1550 50  0001 L CNN "Manufacturer_Name"
F 9 "MMBT2222ATT1G" H 2550 1450 50  0001 L CNN "Manufacturer_Part_Number"
F 10 "C94417" H 1900 2050 50  0001 C CNN "LCSC_Part_Number"
	1    1900 2050
	1    0    0    1   
$EndComp
$Comp
L Device:R_Small R5
U 1 1 5FB140F7
P 1525 1425
F 0 "R5" V 1425 1375 50  0000 L CNN
F 1 "10K" V 1625 1325 50  0000 L CNN
F 2 "Resistor_SMD:R_0603_1608Metric" H 1525 1425 50  0001 C CNN
F 3 "~" H 1525 1425 50  0001 C CNN
F 4 "C25804" H 1525 1425 50  0001 C CNN "LCSC_Part_Number"
F 5 "Uniroyal Elec" H 1525 1425 50  0001 C CNN "Manufacturer_Name"
F 6 "0603WAF1002T5E" H 1525 1425 50  0001 C CNN "Manufacturer_Part_Number"
	1    1525 1425
	0    1    1    0   
$EndComp
$Comp
L Device:R_Small R6
U 1 1 5FB14846
P 1525 2050
F 0 "R6" V 1425 2000 50  0000 L CNN
F 1 "10K" V 1625 1950 50  0000 L CNN
F 2 "Resistor_SMD:R_0603_1608Metric" H 1525 2050 50  0001 C CNN
F 3 "~" H 1525 2050 50  0001 C CNN
F 4 "C25804" H 1525 2050 50  0001 C CNN "LCSC_Part_Number"
F 5 "Uniroyal Elec" H 1525 2050 50  0001 C CNN "Manufacturer_Name"
F 6 "0603WAF1002T5E" H 1525 2050 50  0001 C CNN "Manufacturer_Part_Number"
	1    1525 2050
	0    1    1    0   
$EndComp
Wire Wire Line
	1250 1650 1250 1425
$Comp
L 0_cesare:MMBT2222ALT1G IC1
U 1 1 5FB11F50
P 1900 1425
F 0 "IC1" H 2300 1690 50  0000 C CNN
F 1 "MMBT2222ATT1G" H 2300 1599 50  0000 C CNN
F 2 "Package_TO_SOT_SMD:SOT-416" H 2550 1525 50  0001 L CNN
F 3 "http://www.onsemi.com/pub/Collateral/MMBT2222LT1-D.PDF" H 2550 1425 50  0001 L CNN
F 4 "MMBT2222ALT1G, NPN Bipolar Transistor,  0.6 A 40 V HFE:35 300 MHz Small Signal, 3-Pin SOT-23" H 2550 1325 50  0001 L CNN "Description"
F 5 "1.11" H 2550 1225 50  0001 L CNN "Height"
F 6 "" H 2550 1125 50  0001 L CNN "Mouser Part Number"
F 7 "" H 2550 1025 50  0001 L CNN "Mouser Price/Stock"
F 8 "ON Semicon" H 2550 925 50  0001 L CNN "Manufacturer_Name"
F 9 "MMBT2222ATT1G" H 2550 825 50  0001 L CNN "Manufacturer_Part_Number"
F 10 "C94417" H 1900 1425 50  0001 C CNN "LCSC_Part_Number"
	1    1900 1425
	1    0    0    -1  
$EndComp
Wire Wire Line
	1900 1425 1625 1425
Wire Wire Line
	2700 2050 2800 2050
Connection ~ 1250 1425
Wire Wire Line
	1250 1425 1250 1250
Connection ~ 1250 2050
Wire Wire Line
	1250 2050 1250 2300
Wire Wire Line
	1900 1950 1900 1825
Wire Wire Line
	1900 1525 1900 1650
Wire Wire Line
	1900 1650 1675 1825
Wire Wire Line
	1900 1825 1675 1650
Wire Wire Line
	1675 1650 1250 1650
Wire Wire Line
	1675 1825 1250 1825
Wire Wire Line
	1250 1825 1250 2050
Wire Wire Line
	1625 2050 1900 2050
Wire Wire Line
	1250 2050 1425 2050
Wire Wire Line
	1250 1425 1425 1425
Text Label 3350 2050 2    50   ~ 0
RESET
$Comp
L Connector_Generic:Conn_01x08 J1
U 1 1 5FAE5E86
P 9875 1725
F 0 "J1" H 9825 2275 50  0000 L CNN
F 1 "Links" H 9775 2175 50  0000 L CNN
F 2 "Connector_PinSocket_2.54mm:PinSocket_1x08_P2.54mm_Vertical" H 9875 1725 50  0001 C CNN
F 3 "~" H 9875 1725 50  0001 C CNN
F 4 "-" H 9875 1725 50  0001 C CNN "LCSC_Part_Number"
F 5 "-" H 9875 1725 50  0001 C CNN "Manufacturer_Name"
F 6 "-" H 9875 1725 50  0001 C CNN "Manufacturer_Part_Number"
	1    9875 1725
	1    0    0    -1  
$EndComp
$Comp
L Connector_Generic:Conn_01x08 J2
U 1 1 5FAE6FB3
P 10500 1825
F 0 "J2" H 10500 1175 50  0000 C CNN
F 1 "Rechts" H 10500 1275 50  0000 C CNN
F 2 "Connector_PinSocket_2.54mm:PinSocket_1x08_P2.54mm_Vertical" H 10500 1825 50  0001 C CNN
F 3 "~" H 10500 1825 50  0001 C CNN
F 4 "-" H 10500 1825 50  0001 C CNN "LCSC_Part_Number"
F 5 "-" H 10500 1825 50  0001 C CNN "Manufacturer_Name"
F 6 "-" H 10500 1825 50  0001 C CNN "Manufacturer_Part_Number"
	1    10500 1825
	-1   0    0    1   
$EndComp
Wire Wire Line
	9600 1425 9675 1425
Wire Wire Line
	9600 1525 9675 1525
Wire Wire Line
	9600 1625 9675 1625
Wire Wire Line
	9600 1725 9675 1725
Wire Wire Line
	9600 1825 9675 1825
Wire Wire Line
	9600 1925 9675 1925
Wire Wire Line
	9600 2025 9675 2025
Wire Wire Line
	9600 2125 9675 2125
Wire Wire Line
	10775 1425 10700 1425
Wire Wire Line
	10775 1525 10700 1525
Wire Wire Line
	10775 1625 10700 1625
Wire Wire Line
	10775 1725 10700 1725
Wire Wire Line
	10775 1825 10700 1825
Wire Wire Line
	10775 1925 10700 1925
Wire Wire Line
	10775 2025 10700 2025
$Comp
L power:VBUS #PWR02
U 1 1 5FB17091
P 9300 1350
F 0 "#PWR02" H 9300 1200 50  0001 C CNN
F 1 "VBUS" H 9315 1523 50  0000 C CNN
F 2 "" H 9300 1350 50  0001 C CNN
F 3 "" H 9300 1350 50  0001 C CNN
	1    9300 1350
	1    0    0    -1  
$EndComp
$Comp
L Jumper:SolderJumper_2_Open JP1
U 1 1 5FB18D87
P 9450 1425
F 0 "JP1" H 9450 1630 50  0000 C CNN
F 1 "5V" H 9450 1539 50  0000 C CNN
F 2 "Jumper:SolderJumper-2_P1.3mm_Open_TrianglePad1.0x1.5mm" H 9450 1425 50  0001 C CNN
F 3 "~" H 9450 1425 50  0001 C CNN
F 4 "-" H 9450 1425 50  0001 C CNN "LCSC_Part_Number"
F 5 "-" H 9450 1425 50  0001 C CNN "Manufacturer_Name"
F 6 "-" H 9450 1425 50  0001 C CNN "Manufacturer_Part_Number"
	1    9450 1425
	1    0    0    -1  
$EndComp
Wire Wire Line
	9300 1425 9300 1350
Text GLabel 9600 1525 0    50   Input ~ 0
GND
Text GLabel 10775 1725 2    50   Input ~ 0
GND
Text GLabel 10775 2125 2    50   Input ~ 0
GND
Text GLabel 10775 2025 2    50   Input ~ 0
TX
Text GLabel 10775 1925 2    50   Input ~ 0
RX
Text GLabel 10775 1825 2    50   Input ~ 0
VCC
Text GLabel 10775 1625 2    50   Input ~ 0
GPIO0
Text GLabel 10775 1525 2    50   Input ~ 0
GPIO16
$Comp
L power:+3V3 #PWR04
U 1 1 5FB205FD
P 10775 1325
F 0 "#PWR04" H 10775 1175 50  0001 C CNN
F 1 "+3V3" H 10790 1498 50  0000 C CNN
F 2 "" H 10775 1325 50  0001 C CNN
F 3 "" H 10775 1325 50  0001 C CNN
	1    10775 1325
	1    0    0    -1  
$EndComp
Wire Wire Line
	10775 1425 10775 1325
Text GLabel 9600 2125 0    50   Input ~ 0
GPIO4
Text GLabel 9600 2025 0    50   Input ~ 0
GPIO2
Text GLabel 9600 1925 0    50   Input ~ 0
GPIO14
Text GLabel 9600 1825 0    50   Input ~ 0
GPIO15
Text GLabel 9600 1725 0    50   Input ~ 0
GPIO13
Text GLabel 9600 1625 0    50   Input ~ 0
GPIO12
Text GLabel 5975 1825 2    50   Input ~ 0
TX
Text GLabel 5975 1925 2    50   Input ~ 0
RX
Wire Wire Line
	10750 2125 10750 2250
Wire Wire Line
	10700 2125 10750 2125
Connection ~ 10750 2125
Wire Wire Line
	10750 2125 10775 2125
$Comp
L power:GND #PWR03
U 1 1 5FB49041
P 10750 2250
F 0 "#PWR03" H 10750 2000 50  0001 C CNN
F 1 "GND" H 10755 2077 50  0000 C CNN
F 2 "" H 10750 2250 50  0001 C CNN
F 3 "" H 10750 2250 50  0001 C CNN
	1    10750 2250
	1    0    0    -1  
$EndComp
Wire Wire Line
	7325 2100 7325 2150
Wire Wire Line
	5975 1825 5875 1825
Wire Wire Line
	5975 1925 5875 1925
NoConn ~ 5875 1625
NoConn ~ 5875 2225
NoConn ~ 5875 2025
NoConn ~ 5875 2325
NoConn ~ 5875 2525
NoConn ~ 5875 2625
NoConn ~ 5875 2825
NoConn ~ 5875 2925
NoConn ~ 5875 3025
NoConn ~ 5875 3225
NoConn ~ 5875 3325
NoConn ~ 5875 3425
NoConn ~ 5875 3525
NoConn ~ 5875 3625
NoConn ~ 5875 3725
NoConn ~ 5875 3825
$Comp
L power:GND #PWR0101
U 1 1 5FBDC5F5
P 5375 4100
F 0 "#PWR0101" H 5375 3850 50  0001 C CNN
F 1 "GND" H 5380 3927 50  0000 C CNN
F 2 "" H 5375 4100 50  0001 C CNN
F 3 "" H 5375 4100 50  0001 C CNN
	1    5375 4100
	1    0    0    -1  
$EndComp
Wire Wire Line
	5375 4025 5375 4100
NoConn ~ 4875 1825
$Comp
L Device:C_Small C6
U 1 1 5FC31853
P 4875 1200
F 0 "C6" H 5025 1200 50  0000 C CNN
F 1 "100nF" H 5075 1125 50  0000 C CNN
F 2 "Capacitor_SMD:C_0603_1608Metric" H 4875 1200 50  0001 C CNN
F 3 "~" H 4875 1200 50  0001 C CNN
F 4 "C14663" H 4875 1200 50  0001 C CNN "LCSC_Part_Number"
F 5 "YAGEO" H 4875 1200 50  0001 C CNN "Manufacturer_Name"
F 6 "CC0603KRX7R9BB104" H 4875 1200 50  0001 C CNN "Manufacturer_Part_Number"
	1    4875 1200
	1    0    0    -1  
$EndComp
$Comp
L Device:C_Small C8
U 1 1 5FC32B36
P 5750 1200
F 0 "C8" H 5575 1200 50  0000 C CNN
F 1 "100nF" H 5625 1125 50  0000 C CNN
F 2 "Capacitor_SMD:C_0603_1608Metric" H 5750 1200 50  0001 C CNN
F 3 "~" H 5750 1200 50  0001 C CNN
F 4 "C14663" H 5750 1200 50  0001 C CNN "LCSC_Part_Number"
F 5 "YAGEO" H 5750 1200 50  0001 C CNN "Manufacturer_Name"
F 6 "CC0603KRX7R9BB104" H 5750 1200 50  0001 C CNN "Manufacturer_Part_Number"
	1    5750 1200
	1    0    0    -1  
$EndComp
$Comp
L Device:C_Small C5
U 1 1 5FC33788
P 4700 1200
F 0 "C5" H 4475 1200 50  0000 C CNN
F 1 "1uF" H 4500 1125 50  0000 C CNN
F 2 "Capacitor_SMD:C_0603_1608Metric" H 4700 1200 50  0001 C CNN
F 3 "~" H 4700 1200 50  0001 C CNN
F 4 "C15849" H 4700 1200 50  0001 C CNN "LCSC_Part_Number"
F 5 "Samsung Electro-Mechanics" H 4700 1200 50  0001 C CNN "Manufacturer_Name"
F 6 "CL10A105KB8NNNC" H 4700 1200 50  0001 C CNN "Manufacturer_Part_Number"
	1    4700 1200
	1    0    0    -1  
$EndComp
Wire Wire Line
	5925 1050 5925 1100
Wire Wire Line
	5750 1100 5750 1050
Connection ~ 5750 1050
Wire Wire Line
	5750 1050 5925 1050
Wire Wire Line
	4875 1100 4875 1050
Connection ~ 4875 1050
Wire Wire Line
	4700 1100 4700 1050
Connection ~ 4700 1050
Wire Wire Line
	4700 1050 4875 1050
Wire Wire Line
	4575 1050 4700 1050
Wire Wire Line
	4875 1300 4800 1300
Wire Wire Line
	5275 1425 5275 1050
Wire Wire Line
	5375 1425 5375 1050
Wire Wire Line
	5925 1050 6075 1050
Connection ~ 5925 1050
$Comp
L power:+3V3 #PWR0102
U 1 1 5FC61774
P 6075 900
F 0 "#PWR0102" H 6075 750 50  0001 C CNN
F 1 "+3V3" H 6090 1073 50  0000 C CNN
F 2 "" H 6075 900 50  0001 C CNN
F 3 "" H 6075 900 50  0001 C CNN
	1    6075 900 
	1    0    0    -1  
$EndComp
Wire Wire Line
	6075 900  6075 1050
$Comp
L power:GND #PWR0103
U 1 1 5FC6565A
P 6025 1350
F 0 "#PWR0103" H 6025 1100 50  0001 C CNN
F 1 "GND" H 6030 1177 50  0000 C CNN
F 2 "" H 6025 1350 50  0001 C CNN
F 3 "" H 6025 1350 50  0001 C CNN
	1    6025 1350
	1    0    0    -1  
$EndComp
Wire Wire Line
	6025 1350 6025 1300
Wire Wire Line
	6025 1300 5925 1300
Connection ~ 5925 1300
Wire Wire Line
	5925 1300 5750 1300
$Comp
L Power_Protection:USBLC6-2SC6 U3
U 1 1 5FC75BB2
P 2375 3550
F 0 "U3" H 2600 4025 50  0000 C CNN
F 1 "USBLC6-2SC6" H 2825 3925 50  0000 C CNN
F 2 "Package_TO_SOT_SMD:SOT-23-6" H 1625 3950 50  0001 C CNN
F 3 "http://www2.st.com/resource/en/datasheet/CD00050750.pdf" H 2575 3900 50  0001 C CNN
F 4 "C7519" H 2375 3550 50  0001 C CNN "LCSC_Part_Number"
F 5 "STMicroelectronics" H 2375 3550 50  0001 C CNN "Manufacturer_Name"
F 6 "USBLC6-2SC6" H 2375 3550 50  0001 C CNN "Manufacturer_Part_Number"
	1    2375 3550
	1    0    0    -1  
$EndComp
Wire Wire Line
	4775 2125 4875 2125
Wire Wire Line
	7625 1800 7700 1800
$Comp
L Switch:SW_SPDT SW1
U 1 1 5FB83087
P 1975 6800
F 0 "SW1" H 1800 6900 50  0000 L CNN
F 1 "SW_SPDT" H 1625 6975 50  0000 L CNN
F 2 "Button_Switch_SMD:SW_SPDT_PCM12" H 1975 6800 50  0001 C CNN
F 3 "~" H 1975 6800 50  0001 C CNN
F 4 "-" H 1975 6800 50  0001 C CNN "LCSC_Part_Number"
F 5 "C&K" H 1975 6800 50  0001 C CNN "Manufacturer_Name"
F 6 "PCM12SMTR" H 1975 6800 50  0001 C CNN "Manufacturer_Part_Number"
	1    1975 6800
	-1   0    0    1   
$EndComp
Wire Wire Line
	1400 5400 1400 5450
Wire Wire Line
	7700 1700 7625 1700
Wire Wire Line
	7700 1500 7625 1500
Wire Wire Line
	5975 2125 5875 2125
Text GLabel 5975 2125 2    50   Input ~ 0
DTR
Text GLabel 7700 1700 2    50   Input ~ 0
USB_CONN_D+
Text GLabel 7700 1800 2    50   Input ~ 0
USB_CONN_D-
Wire Notes Line
	6975 2700 11200 2700
Wire Notes Line
	9425 2700 9425 3525
Text Notes 4025 5000 0    98   ~ 20
LIPO CHARGING
$Comp
L Interface_USB:CP2102N-A01-GQFN28 U4
U 1 1 5FB5B0F3
P 5375 2725
F 0 "U4" H 5700 4025 50  0000 C CNN
F 1 "CP2102-GMR" H 5725 1450 50  0000 C CNN
F 2 "Package_DFN_QFN:QFN-28-1EP_5x5mm_P0.5mm_EP3.35x3.35mm" H 5825 1525 50  0001 L CNN
F 3 "https://www.silabs.com/documents/public/data-sheets/cp2102n-datasheet.pdf" H 5425 1975 50  0001 C CNN
F 4 "C6568" H 5375 2725 50  0001 C CNN "LCSC_Part_Number"
F 5 "SILICON LABS" H 5375 2725 50  0001 C CNN "Manufacturer_Name"
F 6 "CP2102-GMR" H 5375 2725 50  0001 C CNN "Manufacturer_Part_Number"
	1    5375 2725
	1    0    0    -1  
$EndComp
Text GLabel 1825 3650 0    50   Input ~ 0
USB_CONN_D+
Wire Wire Line
	1825 3650 1850 3650
Text GLabel 2925 3650 2    50   Input ~ 0
USB_CONN_D-
Wire Wire Line
	2875 3650 2900 3650
Wire Wire Line
	4775 2225 4875 2225
Text GLabel 4775 2125 0    50   Input ~ 0
USB_D+
Text GLabel 4775 2225 0    50   Input ~ 0
USB_D-
Text GLabel 2925 3450 2    50   Input ~ 0
USB_D-
Text GLabel 1825 3450 0    50   Input ~ 0
USB_D+
Wire Wire Line
	2875 3450 2925 3450
$Comp
L power:GND #PWR0104
U 1 1 5FBC6B1C
P 2375 4125
F 0 "#PWR0104" H 2375 3875 50  0001 C CNN
F 1 "GND" H 2380 3952 50  0000 C CNN
F 2 "" H 2375 4125 50  0001 C CNN
F 3 "" H 2375 4125 50  0001 C CNN
	1    2375 4125
	1    0    0    -1  
$EndComp
Wire Wire Line
	2375 4125 2375 4050
Text GLabel 1250 2300 3    50   Input ~ 0
DTR
Text GLabel 5975 1725 2    50   Input ~ 0
RTS
Wire Wire Line
	5975 1725 5875 1725
Text GLabel 1250 1250 1    50   Input ~ 0
RTS
Text GLabel 2775 1425 2    50   Input ~ 0
GPIO0
Wire Wire Line
	2775 1425 2700 1425
Wire Notes Line
	3675 4600 3675 7775
Wire Notes Line
	3675 7775 3700 7775
Text Notes 9550 2950 0    98   ~ 20
Mechanical + Logo
Text Notes 7125 800  0    98   ~ 20
Connector
Text Notes 4850 5800 0    50   ~ 10
Extended Part
Text Notes 2200 5925 0    50   ~ 10
Extended Part
Text Notes 2550 3000 0    50   ~ 10
Extended Part
Text Notes 1525 5650 0    50   ~ 10
Extended Part
Text Notes 2025 1125 0    50   ~ 10
Extended Part
Wire Wire Line
	4875 1050 5275 1050
Wire Wire Line
	4800 1350 4800 1300
Connection ~ 4800 1300
Wire Wire Line
	4800 1300 4700 1300
Wire Wire Line
	4575 1050 4575 2025
Wire Wire Line
	4575 2025 4875 2025
Connection ~ 4575 1050
Wire Wire Line
	5375 1050 5750 1050
$Comp
L power:VBUS #PWR0105
U 1 1 5FC2A801
P 4575 925
F 0 "#PWR0105" H 4575 775 50  0001 C CNN
F 1 "VBUS" H 4590 1098 50  0000 C CNN
F 2 "" H 4575 925 50  0001 C CNN
F 3 "" H 4575 925 50  0001 C CNN
	1    4575 925 
	1    0    0    -1  
$EndComp
Wire Wire Line
	2375 2800 2375 3050
$Comp
L power:VBUS #PWR0106
U 1 1 5FC2F43B
P 7700 1425
F 0 "#PWR0106" H 7700 1275 50  0001 C CNN
F 1 "VBUS" H 7715 1598 50  0000 C CNN
F 2 "" H 7700 1425 50  0001 C CNN
F 3 "" H 7700 1425 50  0001 C CNN
	1    7700 1425
	1    0    0    -1  
$EndComp
Wire Wire Line
	7700 1425 7700 1500
Wire Wire Line
	1700 6200 1700 6400
Wire Wire Line
	1700 6600 1700 6700
Wire Wire Line
	1700 6700 1775 6700
Wire Wire Line
	1775 6900 1725 6900
Wire Wire Line
	1725 6900 1725 7000
Wire Wire Line
	2175 6800 2175 6500
Wire Wire Line
	2175 6500 2025 6500
Wire Wire Line
	2025 6500 2025 6300
Wire Wire Line
	2025 6300 2150 6300
$Comp
L power:GND #PWR0107
U 1 1 5FC55E1B
P 1725 7000
F 0 "#PWR0107" H 1725 6750 50  0001 C CNN
F 1 "GND" H 1730 6827 50  0000 C CNN
F 2 "" H 1725 7000 50  0001 C CNN
F 3 "" H 1725 7000 50  0001 C CNN
	1    1725 7000
	1    0    0    -1  
$EndComp
$Comp
L 0_cesare:DMP2045U-7 Q1
U 1 1 5E0D1295
P 1100 5850
F 0 "Q1" H 1530 5996 50  0000 L CNN
F 1 "DMP2045U" H 1530 5905 50  0000 L CNN
F 2 "Package_TO_SOT_SMD:SOT-23" H 1550 5800 50  0001 L CNN
F 3 "https://datasheet.lcsc.com/szlcsc/1912111437_Diodes-Incorporated-DMP2045U-7_C459541.pdf" H 1550 5700 50  0001 L CNN
F 4 "P CHANNEL -20V 4.3A 1V @ 250UA 45MΩ @ 4A,4.5V 800MW SOT-23 MOSFET ROHS" H 1550 5600 50  0001 L CNN "Description"
F 5 "" H 1550 5500 50  0001 L CNN "Height"
F 6 "Diodes Incorporated" H 1550 5200 50  0001 L CNN "Manufacturer_Name"
F 7 "DMP2045U-7" H 1550 5100 50  0001 L CNN "Manufacturer_Part_Number"
F 8 "C459541" H 1100 5850 50  0001 C CNN "LCSC_Part_Number"
	1    1100 5850
	1    0    0    -1  
$EndComp
$Comp
L Connector:TestPoint USB2
U 1 1 5FCEC844
P 2900 3825
F 0 "USB2" H 2958 3943 50  0001 L CNN
F 1 "D-" H 2850 4075 50  0000 L CNN
F 2 "TestPoint:TestPoint_Pad_D1.0mm" H 3100 3825 50  0001 C CNN
F 3 "~" H 3100 3825 50  0001 C CNN
F 4 "-" H 2900 3825 50  0001 C CNN "LCSC_Part_Number"
F 5 "-" H 2900 3825 50  0001 C CNN "Manufacturer_Name"
F 6 "-" H 2900 3825 50  0001 C CNN "Manufacturer_Part_Number"
	1    2900 3825
	-1   0    0    1   
$EndComp
$Comp
L Connector:TestPoint USB1
U 1 1 5FCEC84D
P 1850 3800
F 0 "USB1" H 1908 3918 50  0001 L CNN
F 1 "D+" H 1800 4050 50  0000 L CNN
F 2 "TestPoint:TestPoint_Pad_D1.0mm" H 2050 3800 50  0001 C CNN
F 3 "~" H 2050 3800 50  0001 C CNN
F 4 "-" H 1850 3800 50  0001 C CNN "LCSC_Part_Number"
F 5 "-" H 1850 3800 50  0001 C CNN "Manufacturer_Name"
F 6 "-" H 1850 3800 50  0001 C CNN "Manufacturer_Part_Number"
	1    1850 3800
	-1   0    0    1   
$EndComp
Wire Wire Line
	1850 3800 1850 3650
Connection ~ 1850 3650
Wire Wire Line
	1850 3650 1875 3650
Wire Wire Line
	2900 3825 2900 3650
Connection ~ 2900 3650
Wire Wire Line
	2900 3650 2925 3650
Wire Wire Line
	1825 3450 1875 3450
$Comp
L Mechanical:Fiducial FID1
U 1 1 5FD3DFA7
P 10300 3325
F 0 "FID1" H 10385 3371 50  0000 L CNN
F 1 "Fiducial" H 10385 3280 50  0000 L CNN
F 2 "0_cesare:JLCPCB_Tooling_Hole" H 10300 3325 50  0001 C CNN
F 3 "~" H 10300 3325 50  0001 C CNN
F 4 "-" H 10300 3325 50  0001 C CNN "LCSC_Part_Number"
F 5 "-" H 10300 3325 50  0001 C CNN "Manufacturer_Name"
F 6 "-" H 10300 3325 50  0001 C CNN "Manufacturer_Part_Number"
	1    10300 3325
	1    0    0    -1  
$EndComp
$Comp
L Mechanical:Fiducial FID2
U 1 1 5FD3EBA4
P 10750 3325
F 0 "FID2" H 10835 3371 50  0000 L CNN
F 1 "Fiducial" H 10835 3280 50  0000 L CNN
F 2 "0_cesare:JLCPCB_Tooling_Hole" H 10750 3325 50  0001 C CNN
F 3 "~" H 10750 3325 50  0001 C CNN
F 4 "-" H 10750 3325 50  0001 C CNN "LCSC_Part_Number"
F 5 "-" H 10750 3325 50  0001 C CNN "Manufacturer_Name"
F 6 "-" H 10750 3325 50  0001 C CNN "Manufacturer_Part_Number"
	1    10750 3325
	1    0    0    -1  
$EndComp
$Comp
L Device:D_Schottky_Small D2
U 1 1 5FD622A2
P 2900 2050
F 0 "D2" H 2900 1845 50  0000 C CNN
F 1 "B5819W" H 2900 1936 50  0000 C CNN
F 2 "Diode_SMD:D_SOD-123" V 2900 2050 50  0001 C CNN
F 3 "~" V 2900 2050 50  0001 C CNN
F 4 "C8598" H 2900 2050 50  0001 C CNN "LCSC_Part_Number"
F 5 "Changjiang Electronics Tech (CJ)" H 2900 2050 50  0001 C CNN "Manufacturer_Name"
F 6 "B5819W" H 2900 2050 50  0001 C CNN "Manufacturer_Part_Number"
	1    2900 2050
	-1   0    0    1   
$EndComp
Wire Wire Line
	3000 2050 3350 2050
$EndSCHEMATC
