{
  "$schema": "../../node_modules/ng-packagr/ng-package.schema.json",
  "dest": "../../dist/ng-miam",
  "lib": {
    "entryFile": "src/public_api.ts",
    "umdModuleIds": {
      "ngx-jsonapi": "ngx-jsonapi"
    }
  }
}