/home/cesar/Documents/projetoboa/src/main/java/br/com/boasalasdeatendimento/dao/UnidadeDao.java
/home/cesar/Documents/projetoboa/src/main/java/br/com/boasalasdeatendimento/model/Status.java
/home/cesar/Documents/projetoboa/src/main/java/br/com/boasalasdeatendimento/conf/SpringMVCServlet.java
/home/cesar/Documents/projetoboa/src/main/java/br/com/boasalasdeatendimento/model/RelatorioAgendamento.java
/home/cesar/Documents/projetoboa/src/main/java/br/com/boasalasdeatendimento/controllers/AutenticacaoController.java
/home/cesar/Documents/projetoboa/src/main/java/br/com/boasalasdeatendimento/dao/ConexaoDao1.java
/home/cesar/Documents/projetoboa/src/main/java/br/com/boasalasdeatendimento/model/Sala.java
/home/cesar/Documents/projetoboa/src/main/java/br/com/boasalasdeatendimento/dao/EnderecoDao.java
/home/cesar/Documents/projetoboa/src/main/java/br/com/boasalasdeatendimento/model/Unidade.java
/home/cesar/Documents/projetoboa/src/main/java/br/com/boasalasdeatendimento/controllers/SalaRestController.java
/home/cesar/Documents/projetoboa/src/main/java/br/com/boasalasdeatendimento/model/Email.java
/home/cesar/Documents/projetoboa/src/main/java/br/com/boasalasdeatendimento/util/DataUtil.java
/home/cesar/Documents/projetoboa/src/main/java/br/com/boasalasdeatendimento/util/CsvUtil.java
/home/cesar/Documents/projetoboa/src/main/java/br/com/boasalasdeatendimento/controllers/AdministrativoController.java
/home/cesar/Documents/projetoboa/src/main/java/br/com/boasalasdeatendimento/dao/AgendamentoDao.java
/home/cesar/Documents/projetoboa/src/main/java/br/com/boasalasdeatendimento/security/GenerateHashPasswordUtil.java
/home/cesar/Documents/projetoboa/src/main/java/br/com/boasalasdeatendimento/controllers/HorarioRestController.java
/home/cesar/Documents/projetoboa/src/main/java/br/com/boasalasdeatendimento/util/CommonsMail.java
/home/cesar/Documents/projetoboa/src/main/java/br/com/boasalasdeatendimento/dao/PerfilDao.java
/home/cesar/Documents/projetoboa/src/main/java/br/com/boasalasdeatendimento/conf/AppWebConfiguration.java
/home/cesar/Documents/projetoboa/src/main/java/br/com/boasalasdeatendimento/controllers/MeusAgendamentosController.java
/home/cesar/Documents/projetoboa/src/main/java/br/com/boasalasdeatendimento/util/Util.java
/home/cesar/Documents/projetoboa/src/main/java/br/com/boasalasdeatendimento/model/Cliente.java
/home/cesar/Documents/projetoboa/src/main/java/br/com/boasalasdeatendimento/controllers/ClienteController.java
/home/cesar/Documents/projetoboa/src/main/java/br/com/boasalasdeatendimento/model/Horario.java
/home/cesar/Documents/projetoboa/src/main/java/br/com/boasalasdeatendimento/controllers/HomeController.java
/home/cesar/Documents/projetoboa/src/main/java/br/com/boasalasdeatendimento/model/Endereco.java
/home/cesar/Documents/projetoboa/src/main/java/br/com/boasalasdeatendimento/validators/ValidaCPF.java
/home/cesar/Documents/projetoboa/src/main/java/br/com/boasalasdeatendimento/dao/SalaDao.java
/home/cesar/Documents/projetoboa/src/main/java/br/com/boasalasdeatendimento/model/Autenticacao.java
/home/cesar/Documents/projetoboa/src/main/java/br/com/boasalasdeatendimento/dao/ClienteDao.java
/home/cesar/Documents/projetoboa/src/main/java/br/com/boasalasdeatendimento/validators/ValidatorCliente.java
/home/cesar/Documents/projetoboa/src/main/java/br/com/boasalasdeatendimento/dao/AutenticarDao.java
/home/cesar/Documents/projetoboa/src/main/java/br/com/boasalasdeatendimento/dao/HorarioDao.java
/home/cesar/Documents/projetoboa/src/main/java/br/com/boasalasdeatendimento/dao/ConexaoDao.java
/home/cesar/Documents/projetoboa/src/main/java/br/com/boasalasdeatendimento/model/Agendamento.java
/home/cesar/Documents/projetoboa/src/main/java/br/com/boasalasdeatendimento/controllers/AgendamentoController.java
/home/cesar/Documents/projetoboa/src/main/java/br/com/boasalasdeatendimento/model/UnidadeDao.java
/home/cesar/Documents/projetoboa/src/main/java/br/com/boasalasdeatendimento/model/ConsultaSala.java
/home/cesar/Documents/projetoboa/src/main/java/br/com/boasalasdeatendimento/model/Perfil.java
