module gitlab.com/cesar.oliveira2/k8s-study

go 1.19

require (
	github.com/chmenegatti/k8s-study v0.0.0-20221019013412-a3c045fa8e6b
	github.com/gofiber/fiber/v2 v2.38.1
	github.com/google/uuid v1.3.0
	github.com/jinzhu/gorm v1.9.16
	github.com/joho/godotenv v1.4.0
	gorm.io/driver/postgres v1.4.4
	gorm.io/gorm v1.24.0
)

require (
	github.com/andybalholm/brotli v1.0.4 // indirect
	github.com/jackc/chunkreader/v2 v2.0.1 // indirect
	github.com/jackc/pgconn v1.13.0 // indirect
	github.com/jackc/pgio v1.0.0 // indirect
	github.com/jackc/pgpassfile v1.0.0 // indirect
	github.com/jackc/pgproto3/v2 v2.3.1 // indirect
	github.com/jackc/pgservicefile v0.0.0-20200714003250-2b9c44734f2b // indirect
	github.com/jackc/pgtype v1.12.0 // indirect
	github.com/jackc/pgx/v4 v4.17.2 // indirect
	github.com/jinzhu/inflection v1.0.0 // indirect
	github.com/jinzhu/now v1.1.4 // indirect
	github.com/klauspost/compress v1.15.0 // indirect
	github.com/valyala/bytebufferpool v1.0.0 // indirect
	github.com/valyala/fasthttp v1.40.0 // indirect
	github.com/valyala/tcplisten v1.0.0 // indirect
	golang.org/x/crypto v0.0.0-20220722155217-630584e8d5aa // indirect
	golang.org/x/sys v0.0.0-20220227234510-4e6760a101f9 // indirect
	golang.org/x/text v0.3.7 // indirect
)
