Removed Pin From Net: NetName=VMOT Pin=P2-4
Removed Pin From Net: NetName=VMOT Pin=U5-1
Removed Pin From Net: NetName=VMOT Pin=U6-1
Removed Pin From Net: NetName=VMOT Pin=U7-1
Added Pin To Net: NetName=NetC11_2 Pin=P2-4
Added Pin To Net: NetName=NetC11_2 Pin=U5-1
Added Pin To Net: NetName=NetC11_2 Pin=U6-1
Added Pin To Net: NetName=NetC11_2 Pin=U7-1
Change Net Name : Old Net Name=NetC11_2 New Net Name=VMOT
Change Net Name : Old Net Name=VMOT New Net Name=NetCon1_1
