<?xml version="1.0" encoding="UTF-8" standalone="no"?>
<svg width="7px" height="15px" viewBox="0 0 7 15" version="1.1" xmlns="http://www.w3.org/2000/svg" xmlns:xlink="http://www.w3.org/1999/xlink" xmlns:sketch="http://www.bohemiancoding.com/sketch/ns">
    <!-- Generator: Sketch 3.3 (11970) - http://www.bohemiancoding.com/sketch -->
    <title>Path 34 Copy</title>
    <desc>Created with Sketch.</desc>
    <defs></defs>
    <g id="Page-1" stroke="none" stroke-width="1" fill="none" fill-rule="evenodd" sketch:type="MSPage">
        <g id="Mobile" sketch:type="MSArtboardGroup" transform="translate(-321.000000, -1097.000000)" stroke="#4A4A4A">
            <g id="Group" sketch:type="MSLayerGroup" transform="translate(0.000000, 1059.000000)">
                <g id="Rectangle-60-+-Path-34-Copy-+-Warning-Critical-vul" sketch:type="MSShapeGroup">
                    <path d="M318,42.2488264 L324.382383,49 L331,42" id="Path-34-Copy" transform="translate(324.500000, 45.500000) rotate(-90.000000) translate(-324.500000, -45.500000) "></path>
                </g>
            </g>
        </g>
    </g>
</svg>
