<?xml version="1.0" encoding="UTF-8"?>
<testsuite failures="0" errors="0" skipped="3" tests="3" time="3.007459" name="Todo list">
<testcase classname="Todo list" name="todo_01 - adding a todo item" time="2.738368">
  <skipped/>
  <system-out>
    <![CDATA[]]>
  </system-out>
  <system-err>
    <![CDATA[]]>
  </system-err>
</testcase>
<testcase classname="Todo list" name="todo_02 - removing all todo items" time="0.130016">
  <skipped/>
  <system-out>
    <![CDATA[]]>
  </system-out>
  <system-err>
    <![CDATA[]]>
  </system-err>
</testcase>
<testcase classname="Todo list" name="todo_03 - confirming the progress bar" time="0.139076">
  <skipped/>
  <system-out>
    <![CDATA[]]>
  </system-out>
  <system-err>
    <![CDATA[]]>
  </system-err>
</testcase>
</testsuite>
