ajout de fichier 
ajout de ligne

j'essaye vraiment d'jouter une ligne....
dernière ligne































ajout de ligne a la fin "kader"
>>>>>>> 896048993db838717fa6ea27f8de16206dc7c55d
