{
  "name": "preinstalled-software",
  "description": "Installs common software tools that can be used during CI execution",
  "long_description": "",
  "maintainer": "GitLab Inc.",
  "maintainer_email": "support@gitlab.com",
  "license": "All rights reserved",
  "version": "0.1.0",
  "privacy": false,
  "chef_versions": [
    [
      ">= 14.0"
    ]
  ]
}
