[
    {
        "diplome": "Licence pro. Concepteur Développeur d'Applications",
        "annee": "2022",
        "etablissement": "Aston Ecole",
        "ville": "Arcueil (94)"
    },
    {
        "diplome": "BTS SIO SLAM",
        "annee": "2020",
        "etablissement": "Greta des Yvelines",
        "ville": "Saint-Germain-en-Laye (78)"
    },
    {
        "diplome": "Titre pro. Technicien Assistance Informatique",
        "annee": "2019",
        "etablissement": "Greta des Yvelines",
        "ville": "La Celle-Saint-Cloud (78)"
    },
    {
        "diplome": "Licence pro. Management",
        "annee": "2009",
        "etablissement": "Rise",
        "ville": "Villeneuve d'Ascq (59)"
    },
    {
        "diplome": "BTS Commerce International",
        "annee": "2008",
        "etablissement": "Bury Sup",
        "ville": "Margency (95)"
    }
]