<?xml version="1.0" encoding="UTF-8" standalone="no"?>
<!-- Created with Inkscape (http://www.inkscape.org/) -->

<svg
   xmlns:dc="http://purl.org/dc/elements/1.1/"
   xmlns:cc="http://creativecommons.org/ns#"
   xmlns:rdf="http://www.w3.org/1999/02/22-rdf-syntax-ns#"
   xmlns:svg="http://www.w3.org/2000/svg"
   xmlns="http://www.w3.org/2000/svg"
   xmlns:sodipodi="http://sodipodi.sourceforge.net/DTD/sodipodi-0.dtd"
   xmlns:inkscape="http://www.inkscape.org/namespaces/inkscape"
   version="1.1"
   id="svg2"
   width="440"
   height="200"
   viewBox="0 0 440 200"
   sodipodi:docname="genie23 avec texte.svg"
   inkscape:version="0.92.4 (5da689c313, 2019-01-14)"
   inkscape:export-filename="D:\Utilisateurs\sphin\Images\Genie23.fr\genie23.1156x512.png"
   inkscape:export-xdpi="273.53897"
   inkscape:export-ydpi="273.53897">
  <metadata
     id="metadata8">
    <rdf:RDF>
      <cc:Work
         rdf:about="">
        <dc:format>image/svg+xml</dc:format>
        <dc:type
           rdf:resource="http://purl.org/dc/dcmitype/StillImage" />
        <dc:title></dc:title>
      </cc:Work>
    </rdf:RDF>
  </metadata>
  <defs
     id="defs6" />
  <sodipodi:namedview
     pagecolor="#ffffff"
     bordercolor="#666666"
     borderopacity="1"
     objecttolerance="10"
     gridtolerance="10"
     guidetolerance="10"
     inkscape:pageopacity="0"
     inkscape:pageshadow="2"
     inkscape:window-width="1920"
     inkscape:window-height="1017"
     id="namedview4"
     showgrid="false"
     inkscape:zoom="1.668772"
     inkscape:cx="118.80941"
     inkscape:cy="100"
     inkscape:window-x="-8"
     inkscape:window-y="-8"
     inkscape:window-maximized="1"
     inkscape:current-layer="svg2"
     inkscape:pagecheckerboard="false"
     inkscape:showpageshadow="false"
     showborder="true" />
  <g
     id="g826">
    <ellipse
       ry="80.298569"
       rx="80.59819"
       cy="109.51431"
       cx="99.773964"
       id="path4542"
       style="opacity:1;fill:#ffcc00;fill-opacity:1;stroke-width:2.06661916" />
    <path
       inkscape:connector-curvature="0"
       id="path28"
       d="M 85.5,188.51712 C 54.459141,182.74182 30.137283,160.13836 21.865098,129.37816 18.598432,117.23103 18.838095,99.465922 22.43006,87.5 c 1.485905,-4.95 4.584512,-12.561878 6.885793,-16.915284 4.812871,-9.104661 13.805321,-19.119664 18.114853,-20.174737 3.99753,-0.978687 7.670097,1.25958 9.362406,5.70597 1.666201,4.377795 0.750775,6.690768 -7.145517,18.054316 -12.7159,18.299443 -14.496534,38.449285 -5.518309,62.445735 1.107927,2.9612 2.37583,5.384 2.817563,5.384 0.441733,0 1.07782,-1.37335 1.413527,-3.05188 1.596697,-7.98348 12.105595,-25.30415 19.613683,-32.32709 6.246452,-5.84282 10.442414,-6.29166 14.437047,-1.5443 C 83.834998,106.76892 85,109.26627 85,110.62639 c 0,2.86992 -2.177358,7.44599 -4.434063,9.31889 -2.431086,2.01762 -1.850466,3.04021 1.184063,2.08538 1.5125,-0.47592 3.974357,-1.13279 5.470793,-1.45971 2.498144,-0.54575 2.635921,-0.81762 1.683657,-3.32227 -1.976216,-5.19784 1.946541,-15.62651 7.529957,-20.018424 l 2.43582,-1.916017 -5.374311,-2.227527 C 90.540045,91.861572 86.015963,89.005724 83.442399,86.740383 80.868836,84.475042 77.353975,81.872667 75.631596,80.957328 70.442701,78.199747 66.694139,71.919612 66.205592,65.165518 65.707748,58.282908 67.251562,54.498395 73.003942,48.5 75.113712,46.3 79.238413,41.975886 82.169944,38.890858 88.397962,32.336736 95.911583,29 104.44205,29 h 5.36703 l 3.04551,-5.396334 c 1.67502,-2.967983 4.30548,-6.28422 5.84545,-7.369415 3.37173,-2.375998 11.38678,-6.5017005 11.7612,-6.054012 0.14709,0.175868 1.28474,3.469761 2.52812,7.319761 5.17012,16.008754 7.90843,22.008406 10.83351,23.736294 6.03303,3.563798 14.33442,11.246974 19.56634,18.109206 21.83292,28.636242 23.14179,65.29437 3.38586,94.8298 -17.824,26.64717 -49.86514,40.18578 -81.27507,34.34182 z m 36,-8.50924 c 3.85,-1.21287 10.05496,-3.80073 13.78879,-5.7508 l 6.7888,-3.54559 -1.97218,-2.10574 c -4.73799,-5.05887 -4.94284,-11.53094 -0.49717,-15.70744 3.10946,-2.92118 8.39733,-3.10142 14.20158,-0.48407 4.95524,2.2345 5.75912,1.77851 10.09054,-5.72378 l 2.94586,-5.10242 -8.6131,-3.32988 c -12.95766,-5.00952 -19.52249,-9.36636 -21.38438,-14.19203 -1.26049,-3.26697 0.46437,-7.22916 4.07574,-9.36245 5.37697,-3.17625 20.62258,-4.20725 30.94108,-2.0924 2.33636,0.47885 2.36068,0.39848 1.97035,-6.50955 -0.21737,-3.8469 -0.66222,-7.261378 -0.98856,-7.587716 -0.32634,-0.326337 -4.58799,-0.10636 -9.47035,0.488838 -10.98768,1.339488 -17.58132,-0.02029 -20.74369,-4.277871 -2.03868,-2.744744 -2.0405,-2.813405 -0.16637,-6.293445 1.79073,-3.325191 10.37402,-9.8174 18.29985,-13.841606 3.85702,-1.958335 3.66335,-2.593954 -3.63399,-11.926421 C 151.21385,55.093853 143.56625,49 139.98551,49 c -2.96635,0 -3.06224,-0.179253 -9.36135,-17.5 -1.40014,-3.85 -3.01377,-8.267855 -3.58583,-9.817456 l -1.04012,-2.817456 -2.91328,2.074435 C 118.84614,23.957806 116,30.522287 116,37.280541 c 0,4.485925 -0.38336,5.854261 -1.86186,6.645529 -2.6751,1.43167 -4.96099,-0.680128 -5.33217,-4.92607 L 108.5,35.5 l -4.96282,0.26382 c -6.284576,0.334082 -12.022854,3.101044 -16.998499,8.196567 -3.615802,3.702917 -3.804732,4.173975 -2.586811,6.449682 C 85.849414,53.955661 84.679855,56 80.753891,56 75.241769,56 73,58.319257 73,64.021908 c 0,4.064339 0.533754,5.516412 3.103592,8.443296 C 77.810568,74.409342 79.810792,76 80.548536,76 c 0.737743,0 3.201764,1.984916 5.475602,4.410925 6.151032,6.562673 12.551735,8.972473 22.094592,8.318391 5.33514,-0.365679 8.07022,-0.149509 9.01922,0.712844 0.74913,0.680723 3.61205,2.053253 6.36205,3.050067 3.05484,1.10731 6.8762,3.671014 9.82272,6.589943 4.20731,4.16791 4.68134,5.04172 3.71482,6.84769 -1.62335,3.03326 -4.19738,2.54045 -8.09137,-1.5491 C 124.66339,99.882893 120.40048,98 114.5,98 104.37423,98 95,105.44252 95,113.48172 c 0,4.60135 2.774266,4.16802 7.81697,-1.22099 7.56555,-8.08512 15.26642,-9.05868 21.25252,-2.68677 1.86144,1.98142 2.13547,2.87816 1.28986,4.22098 -1.62373,2.57848 -4.26857,2.63897 -6.90941,0.15803 -2.12168,-1.99321 -2.68913,-2.09653 -5.38394,-0.98031 -2.98997,1.23849 -3.00766,1.29217 -2.3859,7.24081 0.57628,5.51357 1.00014,6.34267 5.29739,10.36225 6.44166,6.02542 10.22218,14.06031 10.80032,22.9544 0.3752,5.77199 0.15253,7.28281 -1.24424,8.44202 -3.11361,2.58407 -4.9649,0.0983 -5.64217,-7.57599 -0.33473,-3.79288 -1.07747,-8.02115 -1.65052,-9.39615 -2.17653,-5.22243 -7.09081,-10.60827 -12.31799,-13.5 -4.76888,-2.63819 -6.387705,-2.99791 -13.42289,-2.98269 -6.286367,0.0136 -8.88428,0.4866 -12.128213,2.20819 C 76.578684,132.73854 68,141.2732 68,143.0338 c 0,1.1227 -2.79717,1.98126 -4.422681,1.3575 -2.783582,-1.06816 -2.551273,-3.67276 0.824666,-9.24601 1.880768,-3.10491 4.860299,-8.66966 6.62118,-12.36612 1.760882,-3.69645 3.82603,-7.23905 4.589219,-7.87244 C 76.375573,114.27334 77,112.93677 77,111.93657 c 0,-9.31378 -16.036913,11.39231 -21.724183,28.04923 -3.258768,9.5443 -3.029144,12.20223 1.342225,15.53644 8.506291,6.48806 21.726618,8.53508 32.843989,5.08552 5.176745,-1.60627 5.169458,-1.60875 7.568733,2.57141 0.809606,1.41054 0.124349,1.98995 -4.283487,3.62186 -11.449053,4.23877 -22.216858,3.649 -33.418972,-1.83042 C 44.35913,157.64856 33.4071,137.3112 31.386663,113.08442 30.176083,98.568519 35.432157,81.556614 45.476642,67.48053 52.724725,57.323252 50.807517,52.749525 43.074527,61.75 37.902204,67.770099 31.862522,79.334686 28.843034,89 c -3.010938,9.637947 -3.286594,28.80696 -0.560831,39 7.311258,27.34057 29.438527,48.00651 57.792983,53.9762 7.706648,1.62254 27.521104,0.52158 35.424814,-1.96832 z M 97.489324,77.337914 C 93.645196,74.773767 90.204134,72.227074 89.84252,71.678598 89.034916,70.453667 89.883854,68 91.115268,68 c 2.210199,0 16.841352,10.629188 16.862212,12.25 0.0372,2.893993 -3.08231,2.027835 -10.488156,-2.912086 z m 3.302646,-8.170917 c -11.681501,-4.000369 -13.186105,-4.91124 -11.804679,-7.146433 0.766512,-1.240243 2.743691,-0.863783 12.999499,2.475136 10.37128,3.376511 12.05399,4.216526 11.80435,5.892749 -0.16013,1.075192 -0.74114,2.065291 -1.29114,2.20022 -0.55,0.134929 -5.81861,-1.404823 -11.70803,-3.421672 z M 100.17866,54.5 C 99.024126,53.032248 97.186669,52 95.728525,52 c -2.963423,0 -5.000893,-2.126646 -4.153397,-4.335185 1.51483,-3.947583 9.057172,-3.07894 12.897842,1.485428 2.95754,3.514844 3.05814,4.175786 0.9556,6.278328 -2.13463,2.134636 -2.95445,1.989632 -5.24991,-0.928571 z M 153,159.89046 c 0,-1.1897 -6.5463,-3.00179 -8.34738,-2.31065 -2.22204,0.85267 -2.08037,2.60668 0.47269,5.85237 l 2.12531,2.70189 2.87469,-2.75413 C 151.70639,161.86517 153,160.29491 153,159.89046 Z M 171.36822,128.1844 C 172.2657,124.98581 173,121.66896 173,120.81361 c 0,-3.18006 -24.32969,-3.48668 -28.60499,-0.3605 -1.50963,1.10387 -1.32122,1.50139 1.86252,3.92975 3.70088,2.82279 19.06075,9.56718 21.86069,9.59884 1.12379,0.0127 2.11681,-1.75863 3.25,-5.7973 z m -3.20137,-36.812755 3.66685,-0.606344 -1.26293,-4.1964 c -2.35469,-7.824036 -2.471,-7.894569 -8.10322,-4.913989 C 155.64653,85.264602 149,89.900316 149,91.048041 c 0,1.052232 13.39302,1.278354 19.16685,0.323604 z"
       style="fill:#000000" />
    <ellipse
       ry="0.44943228"
       rx="0.59924304"
       cy="36.556461"
       cx="37.752312"
       id="path32"
       style="opacity:0.51000001;fill:#ffff00;fill-opacity:1" />
  </g>
  <text
     xml:space="preserve"
     style="font-style:normal;font-variant:normal;font-weight:normal;font-stretch:normal;font-size:40px;line-height:1.25;font-family:Alef;-inkscape-font-specification:Alef;letter-spacing:0px;word-spacing:0px;fill:#ffcc00;fill-opacity:1;stroke:#000000;stroke-opacity:1;"
     x="311.68723"
     y="109.40181"
     id="text816"><tspan
       sodipodi:role="line"
       id="tspan814"
       x="311.68723"
       y="109.40181"
       style="font-style:normal;font-variant:normal;font-weight:normal;font-stretch:normal;font-size:53.33333206px;font-family:'B de bonita';-inkscape-font-specification:'B de bonita';text-align:center;writing-mode:lr-tb;direction:ltr;text-anchor:middle;fill:#ffcc00;stroke:#000000;stroke-opacity:1;fill-opacity:1;">Genie23.fr</tspan></text>
</svg>
