<mxfile host="app.diagrams.net" modified="2022-09-26T15:13:38.926Z" agent="5.0 (X11; Linux x86_64) AppleWebKit/537.36 (KHTML, like Gecko) Chrome/105.0.0.0 Safari/537.36" etag="-oZd56K6FgEBcZW2uho-" version="20.3.6" type="gitlab">
  <diagram id="NeT_CsYOdwxhwDIz67-E" name="Página-1">
    <mxGraphModel dx="2967" dy="1214" grid="1" gridSize="10" guides="1" tooltips="1" connect="1" arrows="1" fold="1" page="1" pageScale="1" pageWidth="827" pageHeight="1169" math="0" shadow="0">
      <root>
        <mxCell id="0" />
        <mxCell id="1" parent="0" />
        <mxCell id="svplEpsdSn52677f2Jb7-33" style="edgeStyle=none;rounded=0;orthogonalLoop=1;jettySize=auto;html=1;" parent="1" source="svplEpsdSn52677f2Jb7-15" target="svplEpsdSn52677f2Jb7-30" edge="1">
          <mxGeometry relative="1" as="geometry" />
        </mxCell>
        <mxCell id="svplEpsdSn52677f2Jb7-34" style="edgeStyle=none;rounded=0;orthogonalLoop=1;jettySize=auto;html=1;" parent="1" source="svplEpsdSn52677f2Jb7-15" target="svplEpsdSn52677f2Jb7-29" edge="1">
          <mxGeometry relative="1" as="geometry" />
        </mxCell>
        <mxCell id="svplEpsdSn52677f2Jb7-35" style="edgeStyle=none;rounded=0;orthogonalLoop=1;jettySize=auto;html=1;" parent="1" source="svplEpsdSn52677f2Jb7-15" target="svplEpsdSn52677f2Jb7-28" edge="1">
          <mxGeometry relative="1" as="geometry" />
        </mxCell>
        <mxCell id="svplEpsdSn52677f2Jb7-39" style="edgeStyle=none;rounded=0;orthogonalLoop=1;jettySize=auto;html=1;" parent="1" source="svplEpsdSn52677f2Jb7-15" target="svplEpsdSn52677f2Jb7-31" edge="1">
          <mxGeometry relative="1" as="geometry" />
        </mxCell>
        <mxCell id="svplEpsdSn52677f2Jb7-70" style="edgeStyle=none;rounded=0;orthogonalLoop=1;jettySize=auto;html=1;" parent="1" source="svplEpsdSn52677f2Jb7-15" target="svplEpsdSn52677f2Jb7-68" edge="1">
          <mxGeometry relative="1" as="geometry" />
        </mxCell>
        <mxCell id="svplEpsdSn52677f2Jb7-111" style="edgeStyle=none;rounded=0;orthogonalLoop=1;jettySize=auto;html=1;entryX=0.75;entryY=0;entryDx=0;entryDy=0;entryPerimeter=0;" parent="1" source="svplEpsdSn52677f2Jb7-15" target="svplEpsdSn52677f2Jb7-110" edge="1">
          <mxGeometry relative="1" as="geometry" />
        </mxCell>
        <mxCell id="svplEpsdSn52677f2Jb7-115" style="edgeStyle=none;rounded=0;orthogonalLoop=1;jettySize=auto;html=1;" parent="1" source="svplEpsdSn52677f2Jb7-15" target="svplEpsdSn52677f2Jb7-113" edge="1">
          <mxGeometry relative="1" as="geometry" />
        </mxCell>
        <mxCell id="SfoQ3ScQT_cwT8VOu1Ar-2" style="rounded=0;orthogonalLoop=1;jettySize=auto;html=1;" edge="1" parent="1" source="svplEpsdSn52677f2Jb7-15" target="SfoQ3ScQT_cwT8VOu1Ar-1">
          <mxGeometry relative="1" as="geometry" />
        </mxCell>
        <mxCell id="svplEpsdSn52677f2Jb7-15" value="BFF" style="sketch=0;points=[[0,0,0],[0.25,0,0],[0.5,0,0],[0.75,0,0],[1,0,0],[0,1,0],[0.25,1,0],[0.5,1,0],[0.75,1,0],[1,1,0],[0,0.25,0],[0,0.5,0],[0,0.75,0],[1,0.25,0],[1,0.5,0],[1,0.75,0]];outlineConnect=0;fontColor=#232F3E;gradientColor=#FF4F8B;gradientDirection=north;fillColor=#BC1356;strokeColor=#ffffff;dashed=0;verticalLabelPosition=bottom;verticalAlign=top;align=center;html=1;fontSize=12;fontStyle=0;aspect=fixed;shape=mxgraph.aws4.resourceIcon;resIcon=mxgraph.aws4.api_gateway;shadow=0;labelBackgroundColor=default;" parent="1" vertex="1">
          <mxGeometry x="462" y="410" width="78" height="78" as="geometry" />
        </mxCell>
        <mxCell id="svplEpsdSn52677f2Jb7-18" style="edgeStyle=none;rounded=0;orthogonalLoop=1;jettySize=auto;html=1;" parent="1" source="svplEpsdSn52677f2Jb7-17" target="svplEpsdSn52677f2Jb7-15" edge="1">
          <mxGeometry relative="1" as="geometry" />
        </mxCell>
        <mxCell id="svplEpsdSn52677f2Jb7-61" style="edgeStyle=none;rounded=0;orthogonalLoop=1;jettySize=auto;html=1;" parent="1" source="svplEpsdSn52677f2Jb7-17" target="svplEpsdSn52677f2Jb7-60" edge="1">
          <mxGeometry relative="1" as="geometry" />
        </mxCell>
        <mxCell id="svplEpsdSn52677f2Jb7-17" value="" style="shape=image;html=1;verticalAlign=top;verticalLabelPosition=bottom;labelBackgroundColor=#ffffff;imageAspect=0;aspect=fixed;image=https://cdn2.iconfinder.com/data/icons/whcompare-servers-web-hosting/50/staging-site-128.png;shadow=0;" parent="1" vertex="1">
          <mxGeometry x="416" y="200" width="170" height="170" as="geometry" />
        </mxCell>
        <mxCell id="svplEpsdSn52677f2Jb7-20" style="edgeStyle=none;rounded=0;orthogonalLoop=1;jettySize=auto;html=1;" parent="1" source="svplEpsdSn52677f2Jb7-19" target="svplEpsdSn52677f2Jb7-17" edge="1">
          <mxGeometry relative="1" as="geometry" />
        </mxCell>
        <mxCell id="svplEpsdSn52677f2Jb7-19" value="Lojista" style="shape=image;html=1;verticalAlign=top;verticalLabelPosition=bottom;labelBackgroundColor=#ffffff;imageAspect=0;aspect=fixed;image=https://cdn1.iconfinder.com/data/icons/user-pictures/100/male3-128.png;shadow=0;" parent="1" vertex="1">
          <mxGeometry x="476" y="80" width="50" height="50" as="geometry" />
        </mxCell>
        <mxCell id="svplEpsdSn52677f2Jb7-51" style="edgeStyle=none;rounded=0;orthogonalLoop=1;jettySize=auto;html=1;" parent="1" source="svplEpsdSn52677f2Jb7-28" target="svplEpsdSn52677f2Jb7-50" edge="1">
          <mxGeometry relative="1" as="geometry" />
        </mxCell>
        <mxCell id="svplEpsdSn52677f2Jb7-117" style="edgeStyle=none;rounded=0;orthogonalLoop=1;jettySize=auto;html=1;" parent="1" source="svplEpsdSn52677f2Jb7-28" target="svplEpsdSn52677f2Jb7-74" edge="1">
          <mxGeometry relative="1" as="geometry" />
        </mxCell>
        <mxCell id="svplEpsdSn52677f2Jb7-184" style="rounded=0;orthogonalLoop=1;jettySize=auto;html=1;" parent="1" source="svplEpsdSn52677f2Jb7-28" target="svplEpsdSn52677f2Jb7-183" edge="1">
          <mxGeometry relative="1" as="geometry" />
        </mxCell>
        <mxCell id="svplEpsdSn52677f2Jb7-188" style="edgeStyle=none;rounded=0;orthogonalLoop=1;jettySize=auto;html=1;" parent="1" source="svplEpsdSn52677f2Jb7-28" target="svplEpsdSn52677f2Jb7-187" edge="1">
          <mxGeometry relative="1" as="geometry" />
        </mxCell>
        <mxCell id="svplEpsdSn52677f2Jb7-28" value="produtos" style="sketch=0;points=[[0,0,0],[0.25,0,0],[0.5,0,0],[0.75,0,0],[1,0,0],[0,1,0],[0.25,1,0],[0.5,1,0],[0.75,1,0],[1,1,0],[0,0.25,0],[0,0.5,0],[0,0.75,0],[1,0.25,0],[1,0.5,0],[1,0.75,0]];outlineConnect=0;fontColor=#232F3E;gradientColor=#945DF2;gradientDirection=north;fillColor=#5A30B5;strokeColor=#ffffff;dashed=0;verticalLabelPosition=bottom;verticalAlign=top;align=center;html=1;fontSize=12;fontStyle=0;aspect=fixed;shape=mxgraph.aws4.resourceIcon;resIcon=mxgraph.aws4.api_gateway;shadow=0;labelBackgroundColor=default;" parent="1" vertex="1">
          <mxGeometry x="476" y="610" width="60" height="60" as="geometry" />
        </mxCell>
        <mxCell id="svplEpsdSn52677f2Jb7-45" style="edgeStyle=none;rounded=0;orthogonalLoop=1;jettySize=auto;html=1;entryX=0;entryY=0.5;entryDx=0;entryDy=0;entryPerimeter=0;" parent="1" source="svplEpsdSn52677f2Jb7-29" target="svplEpsdSn52677f2Jb7-28" edge="1">
          <mxGeometry relative="1" as="geometry" />
        </mxCell>
        <mxCell id="svplEpsdSn52677f2Jb7-49" style="edgeStyle=none;rounded=0;orthogonalLoop=1;jettySize=auto;html=1;" parent="1" source="svplEpsdSn52677f2Jb7-29" target="svplEpsdSn52677f2Jb7-48" edge="1">
          <mxGeometry relative="1" as="geometry" />
        </mxCell>
        <mxCell id="svplEpsdSn52677f2Jb7-44" style="edgeStyle=none;rounded=0;orthogonalLoop=1;jettySize=auto;html=1;" parent="1" source="svplEpsdSn52677f2Jb7-30" target="svplEpsdSn52677f2Jb7-28" edge="1">
          <mxGeometry relative="1" as="geometry" />
        </mxCell>
        <mxCell id="svplEpsdSn52677f2Jb7-47" style="edgeStyle=none;rounded=0;orthogonalLoop=1;jettySize=auto;html=1;" parent="1" source="svplEpsdSn52677f2Jb7-30" target="svplEpsdSn52677f2Jb7-31" edge="1">
          <mxGeometry relative="1" as="geometry" />
        </mxCell>
        <mxCell id="svplEpsdSn52677f2Jb7-55" style="edgeStyle=none;rounded=0;orthogonalLoop=1;jettySize=auto;html=1;" parent="1" source="svplEpsdSn52677f2Jb7-30" target="svplEpsdSn52677f2Jb7-54" edge="1">
          <mxGeometry relative="1" as="geometry" />
        </mxCell>
        <mxCell id="svplEpsdSn52677f2Jb7-30" value="estoque" style="sketch=0;points=[[0,0,0],[0.25,0,0],[0.5,0,0],[0.75,0,0],[1,0,0],[0,1,0],[0.25,1,0],[0.5,1,0],[0.75,1,0],[1,1,0],[0,0.25,0],[0,0.5,0],[0,0.75,0],[1,0.25,0],[1,0.5,0],[1,0.75,0]];outlineConnect=0;fontColor=#232F3E;gradientColor=#945DF2;gradientDirection=north;fillColor=#5A30B5;strokeColor=#ffffff;dashed=0;verticalLabelPosition=bottom;verticalAlign=top;align=center;html=1;fontSize=12;fontStyle=0;aspect=fixed;shape=mxgraph.aws4.resourceIcon;resIcon=mxgraph.aws4.api_gateway;shadow=0;labelBackgroundColor=default;" parent="1" vertex="1">
          <mxGeometry x="586" y="520" width="40" height="40" as="geometry" />
        </mxCell>
        <mxCell id="svplEpsdSn52677f2Jb7-43" style="edgeStyle=none;rounded=0;orthogonalLoop=1;jettySize=auto;html=1;" parent="1" source="svplEpsdSn52677f2Jb7-31" target="svplEpsdSn52677f2Jb7-28" edge="1">
          <mxGeometry relative="1" as="geometry" />
        </mxCell>
        <mxCell id="svplEpsdSn52677f2Jb7-53" style="edgeStyle=none;rounded=0;orthogonalLoop=1;jettySize=auto;html=1;" parent="1" source="svplEpsdSn52677f2Jb7-31" target="svplEpsdSn52677f2Jb7-52" edge="1">
          <mxGeometry relative="1" as="geometry" />
        </mxCell>
        <mxCell id="svplEpsdSn52677f2Jb7-31" value="grade" style="sketch=0;points=[[0,0,0],[0.25,0,0],[0.5,0,0],[0.75,0,0],[1,0,0],[0,1,0],[0.25,1,0],[0.5,1,0],[0.75,1,0],[1,1,0],[0,0.25,0],[0,0.5,0],[0,0.75,0],[1,0.25,0],[1,0.5,0],[1,0.75,0]];outlineConnect=0;fontColor=#232F3E;gradientColor=#945DF2;gradientDirection=north;fillColor=#5A30B5;strokeColor=#ffffff;dashed=0;verticalLabelPosition=bottom;verticalAlign=top;align=center;html=1;fontSize=12;fontStyle=0;aspect=fixed;shape=mxgraph.aws4.resourceIcon;resIcon=mxgraph.aws4.api_gateway;shadow=0;labelBackgroundColor=default;" parent="1" vertex="1">
          <mxGeometry x="586" y="620" width="40" height="40" as="geometry" />
        </mxCell>
        <mxCell id="svplEpsdSn52677f2Jb7-48" value="DB" style="sketch=0;points=[[0,0,0],[0.25,0,0],[0.5,0,0],[0.75,0,0],[1,0,0],[0,1,0],[0.25,1,0],[0.5,1,0],[0.75,1,0],[1,1,0],[0,0.25,0],[0,0.5,0],[0,0.75,0],[1,0.25,0],[1,0.5,0],[1,0.75,0]];outlineConnect=0;fontColor=#232F3E;gradientColor=#4D72F3;gradientDirection=north;fillColor=#3334B9;strokeColor=#ffffff;dashed=0;verticalLabelPosition=bottom;verticalAlign=top;align=center;html=1;fontSize=12;fontStyle=0;aspect=fixed;shape=mxgraph.aws4.resourceIcon;resIcon=mxgraph.aws4.database;shadow=0;labelBackgroundColor=default;" parent="1" vertex="1">
          <mxGeometry x="381" y="710" width="40" height="40" as="geometry" />
        </mxCell>
        <mxCell id="svplEpsdSn52677f2Jb7-50" value="DB" style="sketch=0;points=[[0,0,0],[0.25,0,0],[0.5,0,0],[0.75,0,0],[1,0,0],[0,1,0],[0.25,1,0],[0.5,1,0],[0.75,1,0],[1,1,0],[0,0.25,0],[0,0.5,0],[0,0.75,0],[1,0.25,0],[1,0.5,0],[1,0.75,0]];outlineConnect=0;fontColor=#232F3E;gradientColor=#4D72F3;gradientDirection=north;fillColor=#3334B9;strokeColor=#ffffff;dashed=0;verticalLabelPosition=bottom;verticalAlign=top;align=center;html=1;fontSize=12;fontStyle=0;aspect=fixed;shape=mxgraph.aws4.resourceIcon;resIcon=mxgraph.aws4.database;shadow=0;labelBackgroundColor=default;" parent="1" vertex="1">
          <mxGeometry x="486" y="710" width="40" height="40" as="geometry" />
        </mxCell>
        <mxCell id="svplEpsdSn52677f2Jb7-52" value="DB" style="sketch=0;points=[[0,0,0],[0.25,0,0],[0.5,0,0],[0.75,0,0],[1,0,0],[0,1,0],[0.25,1,0],[0.5,1,0],[0.75,1,0],[1,1,0],[0,0.25,0],[0,0.5,0],[0,0.75,0],[1,0.25,0],[1,0.5,0],[1,0.75,0]];outlineConnect=0;fontColor=#232F3E;gradientColor=#4D72F3;gradientDirection=north;fillColor=#3334B9;strokeColor=#ffffff;dashed=0;verticalLabelPosition=bottom;verticalAlign=top;align=center;html=1;fontSize=12;fontStyle=0;aspect=fixed;shape=mxgraph.aws4.resourceIcon;resIcon=mxgraph.aws4.database;shadow=0;labelBackgroundColor=default;" parent="1" vertex="1">
          <mxGeometry x="665.38" y="620" width="40" height="40" as="geometry" />
        </mxCell>
        <mxCell id="svplEpsdSn52677f2Jb7-54" value="DB" style="sketch=0;points=[[0,0,0],[0.25,0,0],[0.5,0,0],[0.75,0,0],[1,0,0],[0,1,0],[0.25,1,0],[0.5,1,0],[0.75,1,0],[1,1,0],[0,0.25,0],[0,0.5,0],[0,0.75,0],[1,0.25,0],[1,0.5,0],[1,0.75,0]];outlineConnect=0;fontColor=#232F3E;gradientColor=#4D72F3;gradientDirection=north;fillColor=#3334B9;strokeColor=#ffffff;dashed=0;verticalLabelPosition=bottom;verticalAlign=top;align=center;html=1;fontSize=12;fontStyle=0;aspect=fixed;shape=mxgraph.aws4.resourceIcon;resIcon=mxgraph.aws4.database;shadow=0;labelBackgroundColor=default;" parent="1" vertex="1">
          <mxGeometry x="660" y="520" width="40" height="40" as="geometry" />
        </mxCell>
        <mxCell id="svplEpsdSn52677f2Jb7-64" style="edgeStyle=none;rounded=0;orthogonalLoop=1;jettySize=auto;html=1;" parent="1" source="svplEpsdSn52677f2Jb7-60" target="svplEpsdSn52677f2Jb7-63" edge="1">
          <mxGeometry relative="1" as="geometry" />
        </mxCell>
        <mxCell id="svplEpsdSn52677f2Jb7-60" value="Autenticação" style="sketch=0;points=[[0,0,0],[0.25,0,0],[0.5,0,0],[0.75,0,0],[1,0,0],[0,1,0],[0.25,1,0],[0.5,1,0],[0.75,1,0],[1,1,0],[0,0.25,0],[0,0.5,0],[0,0.75,0],[1,0.25,0],[1,0.5,0],[1,0.75,0]];outlineConnect=0;fontColor=#232F3E;gradientColor=#945DF2;gradientDirection=north;fillColor=#5A30B5;strokeColor=#ffffff;dashed=0;verticalLabelPosition=bottom;verticalAlign=top;align=center;html=1;fontSize=12;fontStyle=0;aspect=fixed;shape=mxgraph.aws4.resourceIcon;resIcon=mxgraph.aws4.api_gateway;shadow=0;labelBackgroundColor=default;" parent="1" vertex="1">
          <mxGeometry x="680" y="434" width="40" height="40" as="geometry" />
        </mxCell>
        <mxCell id="svplEpsdSn52677f2Jb7-66" style="edgeStyle=none;rounded=0;orthogonalLoop=1;jettySize=auto;html=1;" parent="1" source="svplEpsdSn52677f2Jb7-63" target="svplEpsdSn52677f2Jb7-65" edge="1">
          <mxGeometry relative="1" as="geometry" />
        </mxCell>
        <mxCell id="svplEpsdSn52677f2Jb7-63" value="Funcionário&lt;br&gt;(lojista)" style="sketch=0;points=[[0,0,0],[0.25,0,0],[0.5,0,0],[0.75,0,0],[1,0,0],[0,1,0],[0.25,1,0],[0.5,1,0],[0.75,1,0],[1,1,0],[0,0.25,0],[0,0.5,0],[0,0.75,0],[1,0.25,0],[1,0.5,0],[1,0.75,0]];outlineConnect=0;fontColor=#232F3E;gradientColor=#945DF2;gradientDirection=north;fillColor=#5A30B5;strokeColor=#ffffff;dashed=0;verticalLabelPosition=bottom;verticalAlign=top;align=center;html=1;fontSize=12;fontStyle=0;aspect=fixed;shape=mxgraph.aws4.resourceIcon;resIcon=mxgraph.aws4.api_gateway;shadow=0;labelBackgroundColor=default;" parent="1" vertex="1">
          <mxGeometry x="760" y="434" width="40" height="40" as="geometry" />
        </mxCell>
        <mxCell id="svplEpsdSn52677f2Jb7-65" value="DB" style="sketch=0;points=[[0,0,0],[0.25,0,0],[0.5,0,0],[0.75,0,0],[1,0,0],[0,1,0],[0.25,1,0],[0.5,1,0],[0.75,1,0],[1,1,0],[0,0.25,0],[0,0.5,0],[0,0.75,0],[1,0.25,0],[1,0.5,0],[1,0.75,0]];outlineConnect=0;fontColor=#232F3E;gradientColor=#4D72F3;gradientDirection=north;fillColor=#3334B9;strokeColor=#ffffff;dashed=0;verticalLabelPosition=bottom;verticalAlign=top;align=center;html=1;fontSize=12;fontStyle=0;aspect=fixed;shape=mxgraph.aws4.resourceIcon;resIcon=mxgraph.aws4.database;shadow=0;labelBackgroundColor=default;" parent="1" vertex="1">
          <mxGeometry x="760" y="520" width="40" height="40" as="geometry" />
        </mxCell>
        <mxCell id="svplEpsdSn52677f2Jb7-68" value="graphql cache" style="sketch=0;points=[[0,0,0],[0.25,0,0],[0.5,0,0],[0.75,0,0],[1,0,0],[0,1,0],[0.25,1,0],[0.5,1,0],[0.75,1,0],[1,1,0],[0,0.25,0],[0,0.5,0],[0,0.75,0],[1,0.25,0],[1,0.5,0],[1,0.75,0]];outlineConnect=0;fontColor=#232F3E;gradientColor=#4D72F3;gradientDirection=north;fillColor=#3334B9;strokeColor=#ffffff;dashed=0;verticalLabelPosition=bottom;verticalAlign=top;align=center;html=1;fontSize=12;fontStyle=0;aspect=fixed;shape=mxgraph.aws4.resourceIcon;resIcon=mxgraph.aws4.documentdb_with_mongodb_compatibility;shadow=0;labelBackgroundColor=default;" parent="1" vertex="1">
          <mxGeometry x="581" y="424" width="50" height="50" as="geometry" />
        </mxCell>
        <mxCell id="svplEpsdSn52677f2Jb7-71" value="ProdutoSync" style="verticalLabelPosition=bottom;html=1;verticalAlign=top;align=center;strokeColor=none;fillColor=#00BEF2;shape=mxgraph.azure.sql_datasync;shadow=0;labelBackgroundColor=default;" parent="1" vertex="1">
          <mxGeometry x="351.19" y="920" width="60.75" height="81" as="geometry" />
        </mxCell>
        <mxCell id="svplEpsdSn52677f2Jb7-77" style="edgeStyle=none;rounded=0;orthogonalLoop=1;jettySize=auto;html=1;" parent="1" source="svplEpsdSn52677f2Jb7-74" target="svplEpsdSn52677f2Jb7-71" edge="1">
          <mxGeometry relative="1" as="geometry" />
        </mxCell>
        <mxCell id="svplEpsdSn52677f2Jb7-74" value="Syncronizador" style="outlineConnect=0;dashed=0;verticalLabelPosition=bottom;verticalAlign=top;align=center;html=1;shape=mxgraph.aws3.mobile_hub;fillColor=#AD688A;gradientColor=#F58435;gradientDirection=west;pointerEvents=1;shadow=0;labelBackgroundColor=default;" parent="1" vertex="1">
          <mxGeometry x="351.19000000000005" y="790" width="64.81" height="70" as="geometry" />
        </mxCell>
        <mxCell id="svplEpsdSn52677f2Jb7-80" style="edgeStyle=none;rounded=0;orthogonalLoop=1;jettySize=auto;html=1;" parent="1" source="svplEpsdSn52677f2Jb7-78" target="svplEpsdSn52677f2Jb7-79" edge="1">
          <mxGeometry relative="1" as="geometry" />
        </mxCell>
        <mxCell id="svplEpsdSn52677f2Jb7-85" style="edgeStyle=none;rounded=0;orthogonalLoop=1;jettySize=auto;html=1;" parent="1" source="svplEpsdSn52677f2Jb7-78" target="svplEpsdSn52677f2Jb7-82" edge="1">
          <mxGeometry relative="1" as="geometry" />
        </mxCell>
        <mxCell id="svplEpsdSn52677f2Jb7-136" style="edgeStyle=none;rounded=0;orthogonalLoop=1;jettySize=auto;html=1;" parent="1" source="svplEpsdSn52677f2Jb7-78" target="svplEpsdSn52677f2Jb7-135" edge="1">
          <mxGeometry relative="1" as="geometry" />
        </mxCell>
        <mxCell id="svplEpsdSn52677f2Jb7-140" style="edgeStyle=none;rounded=0;orthogonalLoop=1;jettySize=auto;html=1;" parent="1" source="svplEpsdSn52677f2Jb7-78" target="svplEpsdSn52677f2Jb7-139" edge="1">
          <mxGeometry relative="1" as="geometry" />
        </mxCell>
        <mxCell id="svplEpsdSn52677f2Jb7-78" value="BFF" style="sketch=0;points=[[0,0,0],[0.25,0,0],[0.5,0,0],[0.75,0,0],[1,0,0],[0,1,0],[0.25,1,0],[0.5,1,0],[0.75,1,0],[1,1,0],[0,0.25,0],[0,0.5,0],[0,0.75,0],[1,0.25,0],[1,0.5,0],[1,0.75,0]];outlineConnect=0;fontColor=#232F3E;gradientColor=#FF4F8B;gradientDirection=north;fillColor=#BC1356;strokeColor=#ffffff;dashed=0;verticalLabelPosition=bottom;verticalAlign=top;align=center;html=1;fontSize=12;fontStyle=0;aspect=fixed;shape=mxgraph.aws4.resourceIcon;resIcon=mxgraph.aws4.api_gateway;shadow=0;labelBackgroundColor=default;" parent="1" vertex="1">
          <mxGeometry x="631" y="921.5" width="78" height="78" as="geometry" />
        </mxCell>
        <mxCell id="svplEpsdSn52677f2Jb7-81" style="edgeStyle=none;rounded=0;orthogonalLoop=1;jettySize=auto;html=1;" parent="1" source="svplEpsdSn52677f2Jb7-79" target="svplEpsdSn52677f2Jb7-71" edge="1">
          <mxGeometry relative="1" as="geometry" />
        </mxCell>
        <mxCell id="svplEpsdSn52677f2Jb7-79" value="ProdutosResumo" style="sketch=0;points=[[0,0,0],[0.25,0,0],[0.5,0,0],[0.75,0,0],[1,0,0],[0,1,0],[0.25,1,0],[0.5,1,0],[0.75,1,0],[1,1,0],[0,0.25,0],[0,0.5,0],[0,0.75,0],[1,0.25,0],[1,0.5,0],[1,0.75,0]];outlineConnect=0;fontColor=#232F3E;gradientColor=#945DF2;gradientDirection=north;fillColor=#5A30B5;strokeColor=#ffffff;dashed=0;verticalLabelPosition=bottom;verticalAlign=top;align=center;html=1;fontSize=12;fontStyle=0;aspect=fixed;shape=mxgraph.aws4.resourceIcon;resIcon=mxgraph.aws4.api_gateway;shadow=0;labelBackgroundColor=default;" parent="1" vertex="1">
          <mxGeometry x="500" y="930.5" width="60" height="60" as="geometry" />
        </mxCell>
        <mxCell id="svplEpsdSn52677f2Jb7-84" style="edgeStyle=none;rounded=0;orthogonalLoop=1;jettySize=auto;html=1;" parent="1" source="svplEpsdSn52677f2Jb7-82" target="svplEpsdSn52677f2Jb7-83" edge="1">
          <mxGeometry relative="1" as="geometry" />
        </mxCell>
        <mxCell id="svplEpsdSn52677f2Jb7-116" style="edgeStyle=none;rounded=0;orthogonalLoop=1;jettySize=auto;html=1;" parent="1" source="svplEpsdSn52677f2Jb7-82" target="svplEpsdSn52677f2Jb7-105" edge="1">
          <mxGeometry relative="1" as="geometry" />
        </mxCell>
        <mxCell id="svplEpsdSn52677f2Jb7-121" style="edgeStyle=none;rounded=0;orthogonalLoop=1;jettySize=auto;html=1;" parent="1" source="svplEpsdSn52677f2Jb7-82" target="svplEpsdSn52677f2Jb7-123" edge="1">
          <mxGeometry relative="1" as="geometry">
            <mxPoint x="642.38" y="1173.64" as="targetPoint" />
          </mxGeometry>
        </mxCell>
        <mxCell id="svplEpsdSn52677f2Jb7-127" style="edgeStyle=none;rounded=0;orthogonalLoop=1;jettySize=auto;html=1;" parent="1" source="svplEpsdSn52677f2Jb7-82" target="svplEpsdSn52677f2Jb7-126" edge="1">
          <mxGeometry relative="1" as="geometry" />
        </mxCell>
        <mxCell id="svplEpsdSn52677f2Jb7-169" style="edgeStyle=none;rounded=0;orthogonalLoop=1;jettySize=auto;html=1;" parent="1" source="svplEpsdSn52677f2Jb7-82" target="svplEpsdSn52677f2Jb7-168" edge="1">
          <mxGeometry relative="1" as="geometry" />
        </mxCell>
        <mxCell id="svplEpsdSn52677f2Jb7-86" value="autenticação" style="shape=image;html=1;verticalAlign=top;verticalLabelPosition=bottom;labelBackgroundColor=#ffffff;imageAspect=0;aspect=fixed;image=https://cdn1.iconfinder.com/data/icons/ionicons-fill-vol-2/512/logo-firebase-128.png;shadow=0;" parent="1" vertex="1">
          <mxGeometry x="626" y="816.75" width="74" height="74" as="geometry" />
        </mxCell>
        <mxCell id="svplEpsdSn52677f2Jb7-89" style="edgeStyle=none;rounded=0;orthogonalLoop=1;jettySize=auto;html=1;" parent="1" source="svplEpsdSn52677f2Jb7-88" target="svplEpsdSn52677f2Jb7-78" edge="1">
          <mxGeometry relative="1" as="geometry" />
        </mxCell>
        <mxCell id="svplEpsdSn52677f2Jb7-92" style="edgeStyle=none;rounded=0;orthogonalLoop=1;jettySize=auto;html=1;" parent="1" source="svplEpsdSn52677f2Jb7-88" target="svplEpsdSn52677f2Jb7-86" edge="1">
          <mxGeometry relative="1" as="geometry" />
        </mxCell>
        <mxCell id="svplEpsdSn52677f2Jb7-167" style="edgeStyle=none;rounded=0;orthogonalLoop=1;jettySize=auto;html=1;" parent="1" source="svplEpsdSn52677f2Jb7-88" target="svplEpsdSn52677f2Jb7-94" edge="1">
          <mxGeometry relative="1" as="geometry" />
        </mxCell>
        <mxCell id="svplEpsdSn52677f2Jb7-88" value="" style="shape=image;html=1;verticalAlign=top;verticalLabelPosition=bottom;labelBackgroundColor=#ffffff;imageAspect=0;aspect=fixed;image=https://cdn4.iconfinder.com/data/icons/essentials-72/24/038_-_Mobile-128.png;shadow=0;" parent="1" vertex="1">
          <mxGeometry x="780" y="890.75" width="139.5" height="139.5" as="geometry" />
        </mxCell>
        <mxCell id="svplEpsdSn52677f2Jb7-91" style="edgeStyle=none;rounded=0;orthogonalLoop=1;jettySize=auto;html=1;" parent="1" source="svplEpsdSn52677f2Jb7-90" target="svplEpsdSn52677f2Jb7-88" edge="1">
          <mxGeometry relative="1" as="geometry" />
        </mxCell>
        <mxCell id="svplEpsdSn52677f2Jb7-90" value="Consumidor" style="shape=image;html=1;verticalAlign=top;verticalLabelPosition=bottom;labelBackgroundColor=#ffffff;imageAspect=0;aspect=fixed;image=https://cdn1.iconfinder.com/data/icons/user-pictures/100/male3-128.png;shadow=0;" parent="1" vertex="1">
          <mxGeometry x="970" y="935.5" width="50" height="50" as="geometry" />
        </mxCell>
        <mxCell id="svplEpsdSn52677f2Jb7-93" style="edgeStyle=none;rounded=0;orthogonalLoop=1;jettySize=auto;html=1;" parent="1" source="svplEpsdSn52677f2Jb7-94" target="svplEpsdSn52677f2Jb7-96" edge="1">
          <mxGeometry relative="1" as="geometry" />
        </mxCell>
        <mxCell id="svplEpsdSn52677f2Jb7-94" value="Autenticação" style="sketch=0;points=[[0,0,0],[0.25,0,0],[0.5,0,0],[0.75,0,0],[1,0,0],[0,1,0],[0.25,1,0],[0.5,1,0],[0.75,1,0],[1,1,0],[0,0.25,0],[0,0.5,0],[0,0.75,0],[1,0.25,0],[1,0.5,0],[1,0.75,0]];outlineConnect=0;fontColor=#232F3E;gradientColor=#945DF2;gradientDirection=north;fillColor=#5A30B5;strokeColor=#ffffff;dashed=0;verticalLabelPosition=bottom;verticalAlign=top;align=center;html=1;fontSize=12;fontStyle=0;aspect=fixed;shape=mxgraph.aws4.resourceIcon;resIcon=mxgraph.aws4.api_gateway;shadow=0;labelBackgroundColor=default;" parent="1" vertex="1">
          <mxGeometry x="660.38" y="1263.64" width="40" height="40" as="geometry" />
        </mxCell>
        <mxCell id="svplEpsdSn52677f2Jb7-95" style="edgeStyle=none;rounded=0;orthogonalLoop=1;jettySize=auto;html=1;" parent="1" source="svplEpsdSn52677f2Jb7-96" target="svplEpsdSn52677f2Jb7-97" edge="1">
          <mxGeometry relative="1" as="geometry" />
        </mxCell>
        <mxCell id="svplEpsdSn52677f2Jb7-96" value="Funcionário(lojista)" style="sketch=0;points=[[0,0,0],[0.25,0,0],[0.5,0,0],[0.75,0,0],[1,0,0],[0,1,0],[0.25,1,0],[0.5,1,0],[0.75,1,0],[1,1,0],[0,0.25,0],[0,0.5,0],[0,0.75,0],[1,0.25,0],[1,0.5,0],[1,0.75,0]];outlineConnect=0;fontColor=#232F3E;gradientColor=#945DF2;gradientDirection=north;fillColor=#5A30B5;strokeColor=#ffffff;dashed=0;verticalLabelPosition=bottom;verticalAlign=top;align=center;html=1;fontSize=12;fontStyle=0;aspect=fixed;shape=mxgraph.aws4.resourceIcon;resIcon=mxgraph.aws4.api_gateway;shadow=0;labelBackgroundColor=default;" parent="1" vertex="1">
          <mxGeometry x="660.38" y="1344.64" width="40" height="40" as="geometry" />
        </mxCell>
        <mxCell id="svplEpsdSn52677f2Jb7-97" value="DB" style="sketch=0;points=[[0,0,0],[0.25,0,0],[0.5,0,0],[0.75,0,0],[1,0,0],[0,1,0],[0.25,1,0],[0.5,1,0],[0.75,1,0],[1,1,0],[0,0.25,0],[0,0.5,0],[0,0.75,0],[1,0.25,0],[1,0.5,0],[1,0.75,0]];outlineConnect=0;fontColor=#232F3E;gradientColor=#4D72F3;gradientDirection=north;fillColor=#3334B9;strokeColor=#ffffff;dashed=0;verticalLabelPosition=bottom;verticalAlign=top;align=center;html=1;fontSize=12;fontStyle=0;aspect=fixed;shape=mxgraph.aws4.resourceIcon;resIcon=mxgraph.aws4.database;shadow=0;labelBackgroundColor=default;" parent="1" vertex="1">
          <mxGeometry x="660.38" y="1433.64" width="40" height="40" as="geometry" />
        </mxCell>
        <mxCell id="svplEpsdSn52677f2Jb7-103" value="PedidoSync" style="verticalLabelPosition=bottom;html=1;verticalAlign=top;align=center;strokeColor=none;fillColor=#00BEF2;shape=mxgraph.azure.sql_datasync;shadow=0;labelBackgroundColor=default;" parent="1" vertex="1">
          <mxGeometry x="270" y="1133.14" width="60.75" height="81" as="geometry" />
        </mxCell>
        <mxCell id="svplEpsdSn52677f2Jb7-108" style="edgeStyle=none;rounded=0;orthogonalLoop=1;jettySize=auto;html=1;" parent="1" source="svplEpsdSn52677f2Jb7-105" target="svplEpsdSn52677f2Jb7-103" edge="1">
          <mxGeometry relative="1" as="geometry" />
        </mxCell>
        <mxCell id="svplEpsdSn52677f2Jb7-105" value="Syncronizador" style="outlineConnect=0;dashed=0;verticalLabelPosition=bottom;verticalAlign=top;align=center;html=1;shape=mxgraph.aws3.mobile_hub;fillColor=#AD688A;gradientColor=#F58435;gradientDirection=west;pointerEvents=1;shadow=0;labelBackgroundColor=default;" parent="1" vertex="1">
          <mxGeometry x="381.38" y="1138.64" width="64.81" height="70" as="geometry" />
        </mxCell>
        <mxCell id="svplEpsdSn52677f2Jb7-112" style="edgeStyle=none;rounded=0;orthogonalLoop=1;jettySize=auto;html=1;" parent="1" source="svplEpsdSn52677f2Jb7-110" target="svplEpsdSn52677f2Jb7-103" edge="1">
          <mxGeometry relative="1" as="geometry" />
        </mxCell>
        <mxCell id="svplEpsdSn52677f2Jb7-110" value="Pedidos" style="sketch=0;points=[[0,0,0],[0.25,0,0],[0.5,0,0],[0.75,0,0],[1,0,0],[0,1,0],[0.25,1,0],[0.5,1,0],[0.75,1,0],[1,1,0],[0,0.25,0],[0,0.5,0],[0,0.75,0],[1,0.25,0],[1,0.5,0],[1,0.75,0]];outlineConnect=0;fontColor=#232F3E;gradientColor=#945DF2;gradientDirection=north;fillColor=#5A30B5;strokeColor=#ffffff;dashed=0;verticalLabelPosition=bottom;verticalAlign=top;align=center;html=1;fontSize=12;fontStyle=0;aspect=fixed;shape=mxgraph.aws4.resourceIcon;resIcon=mxgraph.aws4.api_gateway;shadow=0;labelBackgroundColor=default;" parent="1" vertex="1">
          <mxGeometry x="280" y="620" width="40" height="40" as="geometry" />
        </mxCell>
        <mxCell id="svplEpsdSn52677f2Jb7-155" style="edgeStyle=none;rounded=0;orthogonalLoop=1;jettySize=auto;html=1;" parent="1" source="svplEpsdSn52677f2Jb7-113" target="svplEpsdSn52677f2Jb7-154" edge="1">
          <mxGeometry relative="1" as="geometry" />
        </mxCell>
        <mxCell id="svplEpsdSn52677f2Jb7-113" value="Mideware ApiKey" style="sketch=0;points=[[0,0,0],[0.25,0,0],[0.5,0,0],[0.75,0,0],[1,0,0],[0,1,0],[0.25,1,0],[0.5,1,0],[0.75,1,0],[1,1,0],[0,0.25,0],[0,0.5,0],[0,0.75,0],[1,0.25,0],[1,0.5,0],[1,0.75,0]];outlineConnect=0;fontColor=#232F3E;gradientColor=#F54749;gradientDirection=north;fillColor=#C7131F;strokeColor=#ffffff;dashed=0;verticalLabelPosition=bottom;verticalAlign=top;align=center;html=1;fontSize=12;fontStyle=0;aspect=fixed;shape=mxgraph.aws4.resourceIcon;resIcon=mxgraph.aws4.identity_and_access_management;shadow=0;labelBackgroundColor=default;" parent="1" vertex="1">
          <mxGeometry x="190" y="384" width="130" height="130" as="geometry" />
        </mxCell>
        <mxCell id="svplEpsdSn52677f2Jb7-124" style="edgeStyle=none;rounded=0;orthogonalLoop=1;jettySize=auto;html=1;" parent="1" source="svplEpsdSn52677f2Jb7-123" target="svplEpsdSn52677f2Jb7-88" edge="1">
          <mxGeometry relative="1" as="geometry">
            <mxPoint x="780.38" y="1100.0003851444294" as="targetPoint" />
          </mxGeometry>
        </mxCell>
        <mxCell id="svplEpsdSn52677f2Jb7-123" value="Push" style="shape=image;html=1;verticalAlign=top;verticalLabelPosition=bottom;labelBackgroundColor=#ffffff;imageAspect=0;aspect=fixed;image=https://cdn1.iconfinder.com/data/icons/ionicons-fill-vol-2/512/logo-firebase-128.png;shadow=0;" parent="1" vertex="1">
          <mxGeometry x="631.38" y="1136.64" width="74" height="74" as="geometry" />
        </mxCell>
        <mxCell id="svplEpsdSn52677f2Jb7-128" style="edgeStyle=orthogonalEdgeStyle;rounded=0;orthogonalLoop=1;jettySize=auto;html=1;startArrow=none;" parent="1" source="svplEpsdSn52677f2Jb7-133" target="svplEpsdSn52677f2Jb7-19" edge="1">
          <mxGeometry relative="1" as="geometry">
            <Array as="points">
              <mxPoint x="170" y="105" />
            </Array>
          </mxGeometry>
        </mxCell>
        <mxCell id="svplEpsdSn52677f2Jb7-126" value="Notificador &lt;br&gt;Logista" style="sketch=0;points=[[0,0,0],[0.25,0,0],[0.5,0,0],[0.75,0,0],[1,0,0],[0,1,0],[0.25,1,0],[0.5,1,0],[0.75,1,0],[1,1,0],[0,0.25,0],[0,0.5,0],[0,0.75,0],[1,0.25,0],[1,0.5,0],[1,0.75,0]];outlineConnect=0;fontColor=#232F3E;gradientColor=#945DF2;gradientDirection=north;fillColor=#5A30B5;strokeColor=#ffffff;dashed=0;verticalLabelPosition=bottom;verticalAlign=top;align=center;html=1;fontSize=12;fontStyle=0;aspect=fixed;shape=mxgraph.aws4.resourceIcon;resIcon=mxgraph.aws4.api_gateway;shadow=0;labelBackgroundColor=default;" parent="1" vertex="1">
          <mxGeometry x="270.75" y="1334.64" width="60" height="60" as="geometry" />
        </mxCell>
        <mxCell id="svplEpsdSn52677f2Jb7-132" style="edgeStyle=none;rounded=0;orthogonalLoop=1;jettySize=auto;html=1;" parent="1" source="svplEpsdSn52677f2Jb7-130" target="svplEpsdSn52677f2Jb7-123" edge="1">
          <mxGeometry relative="1" as="geometry" />
        </mxCell>
        <mxCell id="svplEpsdSn52677f2Jb7-177" style="edgeStyle=orthogonalEdgeStyle;rounded=0;orthogonalLoop=1;jettySize=auto;html=1;startArrow=none;" parent="1" source="svplEpsdSn52677f2Jb7-178" target="svplEpsdSn52677f2Jb7-90" edge="1">
          <mxGeometry relative="1" as="geometry">
            <Array as="points" />
          </mxGeometry>
        </mxCell>
        <mxCell id="svplEpsdSn52677f2Jb7-133" value="" style="outlineConnect=0;dashed=0;verticalLabelPosition=bottom;verticalAlign=top;align=center;html=1;shape=mxgraph.aws3.workmail;fillColor=#D16A28;gradientColor=#F58435;gradientDirection=north;shadow=0;labelBackgroundColor=default;" parent="1" vertex="1">
          <mxGeometry x="128.75" y="642.75" width="82.5" height="94.5" as="geometry" />
        </mxCell>
        <mxCell id="svplEpsdSn52677f2Jb7-134" value="" style="edgeStyle=orthogonalEdgeStyle;rounded=0;orthogonalLoop=1;jettySize=auto;html=1;endArrow=none;" parent="1" source="svplEpsdSn52677f2Jb7-126" target="svplEpsdSn52677f2Jb7-133" edge="1">
          <mxGeometry relative="1" as="geometry">
            <mxPoint x="270.3699999999999" y="1271.0588235294117" as="sourcePoint" />
            <mxPoint x="476" y="104.94117647058829" as="targetPoint" />
            <Array as="points">
              <mxPoint x="170" y="1370" />
            </Array>
          </mxGeometry>
        </mxCell>
        <mxCell id="svplEpsdSn52677f2Jb7-138" style="edgeStyle=none;rounded=0;orthogonalLoop=1;jettySize=auto;html=1;" parent="1" source="svplEpsdSn52677f2Jb7-135" target="svplEpsdSn52677f2Jb7-137" edge="1">
          <mxGeometry relative="1" as="geometry" />
        </mxCell>
        <mxCell id="svplEpsdSn52677f2Jb7-135" value="Pagamento" style="sketch=0;points=[[0,0,0],[0.25,0,0],[0.5,0,0],[0.75,0,0],[1,0,0],[0,1,0],[0.25,1,0],[0.5,1,0],[0.75,1,0],[1,1,0],[0,0.25,0],[0,0.5,0],[0,0.75,0],[1,0.25,0],[1,0.5,0],[1,0.75,0]];outlineConnect=0;fontColor=#232F3E;gradientColor=#945DF2;gradientDirection=north;fillColor=#5A30B5;strokeColor=#ffffff;dashed=0;verticalLabelPosition=bottom;verticalAlign=top;align=center;html=1;fontSize=12;fontStyle=0;aspect=fixed;shape=mxgraph.aws4.resourceIcon;resIcon=mxgraph.aws4.api_gateway;shadow=0;labelBackgroundColor=default;" parent="1" vertex="1">
          <mxGeometry x="500" y="823.75" width="60" height="60" as="geometry" />
        </mxCell>
        <mxCell id="svplEpsdSn52677f2Jb7-137" value="Payment API" style="shape=image;html=1;verticalAlign=top;verticalLabelPosition=bottom;labelBackgroundColor=#ffffff;imageAspect=0;aspect=fixed;image=https://cdn3.iconfinder.com/data/icons/finance-152/64/5-128.png;shadow=0;" parent="1" vertex="1">
          <mxGeometry x="785.75" y="642.75" width="128" height="128" as="geometry" />
        </mxCell>
        <mxCell id="svplEpsdSn52677f2Jb7-143" style="edgeStyle=none;rounded=0;orthogonalLoop=1;jettySize=auto;html=1;" parent="1" source="svplEpsdSn52677f2Jb7-139" target="svplEpsdSn52677f2Jb7-141" edge="1">
          <mxGeometry relative="1" as="geometry" />
        </mxCell>
        <mxCell id="svplEpsdSn52677f2Jb7-139" value="Lojas" style="sketch=0;points=[[0,0,0],[0.25,0,0],[0.5,0,0],[0.75,0,0],[1,0,0],[0,1,0],[0.25,1,0],[0.5,1,0],[0.75,1,0],[1,1,0],[0,0.25,0],[0,0.5,0],[0,0.75,0],[1,0.25,0],[1,0.5,0],[1,0.75,0]];outlineConnect=0;fontColor=#232F3E;gradientColor=#945DF2;gradientDirection=north;fillColor=#5A30B5;strokeColor=#ffffff;dashed=0;verticalLabelPosition=bottom;verticalAlign=top;align=center;html=1;fontSize=12;fontStyle=0;aspect=fixed;shape=mxgraph.aws4.resourceIcon;resIcon=mxgraph.aws4.api_gateway;shadow=0;labelBackgroundColor=default;" parent="1" vertex="1">
          <mxGeometry x="502.38" y="1040" width="60" height="60" as="geometry" />
        </mxCell>
        <mxCell id="svplEpsdSn52677f2Jb7-141" value="LojaSync" style="verticalLabelPosition=bottom;html=1;verticalAlign=top;align=center;strokeColor=none;fillColor=#00BEF2;shape=mxgraph.azure.sql_datasync;shadow=0;labelBackgroundColor=default;" parent="1" vertex="1">
          <mxGeometry x="351.19" y="1029.5" width="60.75" height="81" as="geometry" />
        </mxCell>
        <mxCell id="svplEpsdSn52677f2Jb7-145" style="edgeStyle=none;rounded=0;orthogonalLoop=1;jettySize=auto;html=1;" parent="1" source="svplEpsdSn52677f2Jb7-144" target="svplEpsdSn52677f2Jb7-141" edge="1">
          <mxGeometry relative="1" as="geometry" />
        </mxCell>
        <mxCell id="svplEpsdSn52677f2Jb7-144" value="Syncronizador" style="outlineConnect=0;dashed=0;verticalLabelPosition=bottom;verticalAlign=top;align=center;html=1;shape=mxgraph.aws3.mobile_hub;fillColor=#AD688A;gradientColor=#F58435;gradientDirection=west;pointerEvents=1;shadow=0;labelBackgroundColor=default;" parent="1" vertex="1">
          <mxGeometry x="63.94" y="1035" width="64.81" height="70" as="geometry" />
        </mxCell>
        <mxCell id="svplEpsdSn52677f2Jb7-148" style="edgeStyle=none;rounded=0;orthogonalLoop=1;jettySize=auto;html=1;" parent="1" source="svplEpsdSn52677f2Jb7-146" target="svplEpsdSn52677f2Jb7-147" edge="1">
          <mxGeometry relative="1" as="geometry" />
        </mxCell>
        <mxCell id="svplEpsdSn52677f2Jb7-146" value="BFF" style="sketch=0;points=[[0,0,0],[0.25,0,0],[0.5,0,0],[0.75,0,0],[1,0,0],[0,1,0],[0.25,1,0],[0.5,1,0],[0.75,1,0],[1,1,0],[0,0.25,0],[0,0.5,0],[0,0.75,0],[1,0.25,0],[1,0.5,0],[1,0.75,0]];outlineConnect=0;fontColor=#232F3E;gradientColor=#FF4F8B;gradientDirection=north;fillColor=#BC1356;strokeColor=#ffffff;dashed=0;verticalLabelPosition=bottom;verticalAlign=top;align=center;html=1;fontSize=12;fontStyle=0;aspect=fixed;shape=mxgraph.aws4.resourceIcon;resIcon=mxgraph.aws4.api_gateway;shadow=0;labelBackgroundColor=default;" parent="1" vertex="1">
          <mxGeometry x="-239" y="1031" width="78" height="78" as="geometry" />
        </mxCell>
        <mxCell id="svplEpsdSn52677f2Jb7-150" style="edgeStyle=none;rounded=0;orthogonalLoop=1;jettySize=auto;html=1;" parent="1" source="svplEpsdSn52677f2Jb7-147" target="svplEpsdSn52677f2Jb7-149" edge="1">
          <mxGeometry relative="1" as="geometry" />
        </mxCell>
        <mxCell id="svplEpsdSn52677f2Jb7-151" style="edgeStyle=none;rounded=0;orthogonalLoop=1;jettySize=auto;html=1;" parent="1" source="svplEpsdSn52677f2Jb7-147" target="svplEpsdSn52677f2Jb7-144" edge="1">
          <mxGeometry relative="1" as="geometry" />
        </mxCell>
        <mxCell id="svplEpsdSn52677f2Jb7-158" style="edgeStyle=none;rounded=0;orthogonalLoop=1;jettySize=auto;html=1;" parent="1" source="svplEpsdSn52677f2Jb7-147" target="svplEpsdSn52677f2Jb7-154" edge="1">
          <mxGeometry relative="1" as="geometry" />
        </mxCell>
        <mxCell id="svplEpsdSn52677f2Jb7-147" value="Lojas" style="sketch=0;points=[[0,0,0],[0.25,0,0],[0.5,0,0],[0.75,0,0],[1,0,0],[0,1,0],[0.25,1,0],[0.5,1,0],[0.75,1,0],[1,1,0],[0,0.25,0],[0,0.5,0],[0,0.75,0],[1,0.25,0],[1,0.5,0],[1,0.75,0]];outlineConnect=0;fontColor=#232F3E;gradientColor=#945DF2;gradientDirection=north;fillColor=#5A30B5;strokeColor=#ffffff;dashed=0;verticalLabelPosition=bottom;verticalAlign=top;align=center;html=1;fontSize=12;fontStyle=0;aspect=fixed;shape=mxgraph.aws4.resourceIcon;resIcon=mxgraph.aws4.api_gateway;shadow=0;labelBackgroundColor=default;" parent="1" vertex="1">
          <mxGeometry x="-80" y="1040" width="60" height="60" as="geometry" />
        </mxCell>
        <mxCell id="svplEpsdSn52677f2Jb7-149" value="DB" style="sketch=0;points=[[0,0,0],[0.25,0,0],[0.5,0,0],[0.75,0,0],[1,0,0],[0,1,0],[0.25,1,0],[0.5,1,0],[0.75,1,0],[1,1,0],[0,0.25,0],[0,0.5,0],[0,0.75,0],[1,0.25,0],[1,0.5,0],[1,0.75,0]];outlineConnect=0;fontColor=#232F3E;gradientColor=#4D72F3;gradientDirection=north;fillColor=#3334B9;strokeColor=#ffffff;dashed=0;verticalLabelPosition=bottom;verticalAlign=top;align=center;html=1;fontSize=12;fontStyle=0;aspect=fixed;shape=mxgraph.aws4.resourceIcon;resIcon=mxgraph.aws4.database;shadow=0;labelBackgroundColor=default;" parent="1" vertex="1">
          <mxGeometry x="-70" y="1153.64" width="40" height="40" as="geometry" />
        </mxCell>
        <mxCell id="svplEpsdSn52677f2Jb7-157" style="edgeStyle=none;rounded=0;orthogonalLoop=1;jettySize=auto;html=1;" parent="1" source="svplEpsdSn52677f2Jb7-154" target="svplEpsdSn52677f2Jb7-156" edge="1">
          <mxGeometry relative="1" as="geometry" />
        </mxCell>
        <mxCell id="svplEpsdSn52677f2Jb7-154" value="Licenças" style="sketch=0;points=[[0,0,0],[0.25,0,0],[0.5,0,0],[0.75,0,0],[1,0,0],[0,1,0],[0.25,1,0],[0.5,1,0],[0.75,1,0],[1,1,0],[0,0.25,0],[0,0.5,0],[0,0.75,0],[1,0.25,0],[1,0.5,0],[1,0.75,0]];outlineConnect=0;fontColor=#232F3E;gradientColor=#945DF2;gradientDirection=north;fillColor=#5A30B5;strokeColor=#ffffff;dashed=0;verticalLabelPosition=bottom;verticalAlign=top;align=center;html=1;fontSize=12;fontStyle=0;aspect=fixed;shape=mxgraph.aws4.resourceIcon;resIcon=mxgraph.aws4.api_gateway;shadow=0;labelBackgroundColor=default;" parent="1" vertex="1">
          <mxGeometry x="-80" y="419" width="60" height="60" as="geometry" />
        </mxCell>
        <mxCell id="svplEpsdSn52677f2Jb7-156" value="DB" style="sketch=0;points=[[0,0,0],[0.25,0,0],[0.5,0,0],[0.75,0,0],[1,0,0],[0,1,0],[0.25,1,0],[0.5,1,0],[0.75,1,0],[1,1,0],[0,0.25,0],[0,0.5,0],[0,0.75,0],[1,0.25,0],[1,0.5,0],[1,0.75,0]];outlineConnect=0;fontColor=#232F3E;gradientColor=#4D72F3;gradientDirection=north;fillColor=#3334B9;strokeColor=#ffffff;dashed=0;verticalLabelPosition=bottom;verticalAlign=top;align=center;html=1;fontSize=12;fontStyle=0;aspect=fixed;shape=mxgraph.aws4.resourceIcon;resIcon=mxgraph.aws4.database;shadow=0;labelBackgroundColor=default;" parent="1" vertex="1">
          <mxGeometry x="-150" y="429.0000000000001" width="40" height="40" as="geometry" />
        </mxCell>
        <mxCell id="svplEpsdSn52677f2Jb7-160" style="edgeStyle=none;rounded=0;orthogonalLoop=1;jettySize=auto;html=1;" parent="1" source="svplEpsdSn52677f2Jb7-159" target="svplEpsdSn52677f2Jb7-146" edge="1">
          <mxGeometry relative="1" as="geometry" />
        </mxCell>
        <mxCell id="svplEpsdSn52677f2Jb7-166" style="edgeStyle=none;rounded=0;orthogonalLoop=1;jettySize=auto;html=1;" parent="1" source="svplEpsdSn52677f2Jb7-159" target="svplEpsdSn52677f2Jb7-162" edge="1">
          <mxGeometry relative="1" as="geometry" />
        </mxCell>
        <mxCell id="svplEpsdSn52677f2Jb7-159" value="" style="shape=image;html=1;verticalAlign=top;verticalLabelPosition=bottom;labelBackgroundColor=#ffffff;imageAspect=0;aspect=fixed;image=https://cdn2.iconfinder.com/data/icons/whcompare-servers-web-hosting/50/staging-site-128.png;shadow=0;" parent="1" vertex="1">
          <mxGeometry x="-440" y="999.78" width="136.86" height="136.86" as="geometry" />
        </mxCell>
        <mxCell id="svplEpsdSn52677f2Jb7-161" style="edgeStyle=none;rounded=0;orthogonalLoop=1;jettySize=auto;html=1;" parent="1" source="svplEpsdSn52677f2Jb7-162" target="svplEpsdSn52677f2Jb7-164" edge="1">
          <mxGeometry relative="1" as="geometry" />
        </mxCell>
        <mxCell id="svplEpsdSn52677f2Jb7-162" value="Autenticação" style="sketch=0;points=[[0,0,0],[0.25,0,0],[0.5,0,0],[0.75,0,0],[1,0,0],[0,1,0],[0.25,1,0],[0.5,1,0],[0.75,1,0],[1,1,0],[0,0.25,0],[0,0.5,0],[0,0.75,0],[1,0.25,0],[1,0.5,0],[1,0.75,0]];outlineConnect=0;fontColor=#232F3E;gradientColor=#945DF2;gradientDirection=north;fillColor=#5A30B5;strokeColor=#ffffff;dashed=0;verticalLabelPosition=bottom;verticalAlign=top;align=center;html=1;fontSize=12;fontStyle=0;aspect=fixed;shape=mxgraph.aws4.resourceIcon;resIcon=mxgraph.aws4.api_gateway;shadow=0;labelBackgroundColor=default;" parent="1" vertex="1">
          <mxGeometry x="-220" y="1153.6399999999999" width="40" height="40" as="geometry" />
        </mxCell>
        <mxCell id="svplEpsdSn52677f2Jb7-163" style="edgeStyle=none;rounded=0;orthogonalLoop=1;jettySize=auto;html=1;" parent="1" source="svplEpsdSn52677f2Jb7-164" target="svplEpsdSn52677f2Jb7-165" edge="1">
          <mxGeometry relative="1" as="geometry" />
        </mxCell>
        <mxCell id="svplEpsdSn52677f2Jb7-164" value="Funcionário&lt;br&gt;(lukeware)" style="sketch=0;points=[[0,0,0],[0.25,0,0],[0.5,0,0],[0.75,0,0],[1,0,0],[0,1,0],[0.25,1,0],[0.5,1,0],[0.75,1,0],[1,1,0],[0,0.25,0],[0,0.5,0],[0,0.75,0],[1,0.25,0],[1,0.5,0],[1,0.75,0]];outlineConnect=0;fontColor=#232F3E;gradientColor=#945DF2;gradientDirection=north;fillColor=#5A30B5;strokeColor=#ffffff;dashed=0;verticalLabelPosition=bottom;verticalAlign=top;align=center;html=1;fontSize=12;fontStyle=0;aspect=fixed;shape=mxgraph.aws4.resourceIcon;resIcon=mxgraph.aws4.api_gateway;shadow=0;labelBackgroundColor=default;" parent="1" vertex="1">
          <mxGeometry x="-140" y="1153.6399999999999" width="40" height="40" as="geometry" />
        </mxCell>
        <mxCell id="svplEpsdSn52677f2Jb7-165" value="DB" style="sketch=0;points=[[0,0,0],[0.25,0,0],[0.5,0,0],[0.75,0,0],[1,0,0],[0,1,0],[0.25,1,0],[0.5,1,0],[0.75,1,0],[1,1,0],[0,0.25,0],[0,0.5,0],[0,0.75,0],[1,0.25,0],[1,0.5,0],[1,0.75,0]];outlineConnect=0;fontColor=#232F3E;gradientColor=#4D72F3;gradientDirection=north;fillColor=#3334B9;strokeColor=#ffffff;dashed=0;verticalLabelPosition=bottom;verticalAlign=top;align=center;html=1;fontSize=12;fontStyle=0;aspect=fixed;shape=mxgraph.aws4.resourceIcon;resIcon=mxgraph.aws4.database;shadow=0;labelBackgroundColor=default;" parent="1" vertex="1">
          <mxGeometry x="-140" y="1253.6399999999999" width="40" height="40" as="geometry" />
        </mxCell>
        <mxCell id="svplEpsdSn52677f2Jb7-175" style="edgeStyle=none;rounded=0;orthogonalLoop=1;jettySize=auto;html=1;entryX=0.5;entryY=0;entryDx=0;entryDy=0;entryPerimeter=0;" parent="1" source="svplEpsdSn52677f2Jb7-168" target="svplEpsdSn52677f2Jb7-174" edge="1">
          <mxGeometry relative="1" as="geometry" />
        </mxCell>
        <mxCell id="svplEpsdSn52677f2Jb7-176" style="edgeStyle=none;rounded=0;orthogonalLoop=1;jettySize=auto;html=1;entryX=0;entryY=0.5;entryDx=0;entryDy=0;entryPerimeter=0;" parent="1" source="svplEpsdSn52677f2Jb7-168" target="svplEpsdSn52677f2Jb7-130" edge="1">
          <mxGeometry relative="1" as="geometry" />
        </mxCell>
        <mxCell id="svplEpsdSn52677f2Jb7-168" value="GerarNFe" style="sketch=0;points=[[0,0,0],[0.25,0,0],[0.5,0,0],[0.75,0,0],[1,0,0],[0,1,0],[0.25,1,0],[0.5,1,0],[0.75,1,0],[1,1,0],[0,0.25,0],[0,0.5,0],[0,0.75,0],[1,0.25,0],[1,0.5,0],[1,0.75,0]];outlineConnect=0;fontColor=#232F3E;gradientColor=#945DF2;gradientDirection=north;fillColor=#5A30B5;strokeColor=#ffffff;dashed=0;verticalLabelPosition=bottom;verticalAlign=top;align=center;html=1;fontSize=12;fontStyle=0;aspect=fixed;shape=mxgraph.aws4.resourceIcon;resIcon=mxgraph.aws4.api_gateway;shadow=0;labelBackgroundColor=default;" parent="1" vertex="1">
          <mxGeometry x="386.19" y="1334.64" width="60" height="60" as="geometry" />
        </mxCell>
        <mxCell id="svplEpsdSn52677f2Jb7-83" value="DB" style="sketch=0;points=[[0,0,0],[0.25,0,0],[0.5,0,0],[0.75,0,0],[1,0,0],[0,1,0],[0.25,1,0],[0.5,1,0],[0.75,1,0],[1,1,0],[0,0.25,0],[0,0.5,0],[0,0.75,0],[1,0.25,0],[1,0.5,0],[1,0.75,0]];outlineConnect=0;fontColor=#232F3E;gradientColor=#4D72F3;gradientDirection=north;fillColor=#3334B9;strokeColor=#ffffff;dashed=0;verticalLabelPosition=bottom;verticalAlign=top;align=center;html=1;fontSize=12;fontStyle=0;aspect=fixed;shape=mxgraph.aws4.resourceIcon;resIcon=mxgraph.aws4.database;shadow=0;labelBackgroundColor=default;" parent="1" vertex="1">
          <mxGeometry x="510" y="1240" width="40" height="40" as="geometry" />
        </mxCell>
        <mxCell id="svplEpsdSn52677f2Jb7-170" value="" style="rounded=0;orthogonalLoop=1;jettySize=auto;html=1;endArrow=none;" parent="1" source="svplEpsdSn52677f2Jb7-82" target="svplEpsdSn52677f2Jb7-83" edge="1">
          <mxGeometry relative="1" as="geometry">
            <mxPoint x="530.3800000000006" y="1203.64" as="sourcePoint" />
            <mxPoint x="530.3800000000006" y="1334.6400000000003" as="targetPoint" />
          </mxGeometry>
        </mxCell>
        <mxCell id="svplEpsdSn52677f2Jb7-171" style="edgeStyle=none;rounded=0;orthogonalLoop=1;jettySize=auto;html=1;" parent="1" source="svplEpsdSn52677f2Jb7-82" target="svplEpsdSn52677f2Jb7-130" edge="1">
          <mxGeometry relative="1" as="geometry" />
        </mxCell>
        <mxCell id="svplEpsdSn52677f2Jb7-82" value="Pedido" style="sketch=0;points=[[0,0,0],[0.25,0,0],[0.5,0,0],[0.75,0,0],[1,0,0],[0,1,0],[0.25,1,0],[0.5,1,0],[0.75,1,0],[1,1,0],[0,0.25,0],[0,0.5,0],[0,0.75,0],[1,0.25,0],[1,0.5,0],[1,0.75,0]];outlineConnect=0;fontColor=#232F3E;gradientColor=#945DF2;gradientDirection=north;fillColor=#5A30B5;strokeColor=#ffffff;dashed=0;verticalLabelPosition=bottom;verticalAlign=top;align=center;html=1;fontSize=12;fontStyle=0;aspect=fixed;shape=mxgraph.aws4.resourceIcon;resIcon=mxgraph.aws4.api_gateway;shadow=0;labelBackgroundColor=default;" parent="1" vertex="1">
          <mxGeometry x="500.38" y="1143.64" width="60" height="60" as="geometry" />
        </mxCell>
        <mxCell id="svplEpsdSn52677f2Jb7-174" value="S3 notas/pedidos" style="sketch=0;points=[[0,0,0],[0.25,0,0],[0.5,0,0],[0.75,0,0],[1,0,0],[0,1,0],[0.25,1,0],[0.5,1,0],[0.75,1,0],[1,1,0],[0,0.25,0],[0,0.5,0],[0,0.75,0],[1,0.25,0],[1,0.5,0],[1,0.75,0]];outlineConnect=0;fontColor=#232F3E;gradientColor=#60A337;gradientDirection=north;fillColor=#277116;strokeColor=#ffffff;dashed=0;verticalLabelPosition=bottom;verticalAlign=top;align=center;html=1;fontSize=12;fontStyle=0;aspect=fixed;shape=mxgraph.aws4.resourceIcon;resIcon=mxgraph.aws4.s3;shadow=0;labelBackgroundColor=default;" parent="1" vertex="1">
          <mxGeometry x="391.19" y="1450" width="50" height="50" as="geometry" />
        </mxCell>
        <mxCell id="svplEpsdSn52677f2Jb7-178" value="" style="outlineConnect=0;dashed=0;verticalLabelPosition=bottom;verticalAlign=top;align=center;html=1;shape=mxgraph.aws3.workmail;fillColor=#D16A28;gradientColor=#F58435;gradientDirection=north;shadow=0;labelBackgroundColor=default;" parent="1" vertex="1">
          <mxGeometry x="953.75" y="1253.6399999999999" width="82.5" height="94.5" as="geometry" />
        </mxCell>
        <mxCell id="svplEpsdSn52677f2Jb7-181" value="" style="edgeStyle=orthogonalEdgeStyle;rounded=0;orthogonalLoop=1;jettySize=auto;html=1;endArrow=none;" parent="1" source="svplEpsdSn52677f2Jb7-130" target="svplEpsdSn52677f2Jb7-178" edge="1">
          <mxGeometry relative="1" as="geometry">
            <mxPoint x="606" y="1303.64" as="sourcePoint" />
            <mxPoint x="995.0476190476188" y="985.5" as="targetPoint" />
            <Array as="points">
              <mxPoint x="606" y="1510" />
              <mxPoint x="995" y="1510" />
            </Array>
          </mxGeometry>
        </mxCell>
        <mxCell id="svplEpsdSn52677f2Jb7-130" value="Notificador &lt;br&gt;Cosumidor" style="sketch=0;points=[[0,0,0],[0.25,0,0],[0.5,0,0],[0.75,0,0],[1,0,0],[0,1,0],[0.25,1,0],[0.5,1,0],[0.75,1,0],[1,1,0],[0,0.25,0],[0,0.5,0],[0,0.75,0],[1,0.25,0],[1,0.5,0],[1,0.75,0]];outlineConnect=0;fontColor=#232F3E;gradientColor=#945DF2;gradientDirection=north;fillColor=#5A30B5;strokeColor=#ffffff;dashed=0;verticalLabelPosition=bottom;verticalAlign=top;align=center;html=1;fontSize=12;fontStyle=0;aspect=fixed;shape=mxgraph.aws4.resourceIcon;resIcon=mxgraph.aws4.api_gateway;shadow=0;labelBackgroundColor=default;" parent="1" vertex="1">
          <mxGeometry x="587.82" y="1267.28" width="36.36" height="36.36" as="geometry" />
        </mxCell>
        <mxCell id="svplEpsdSn52677f2Jb7-183" value="Gerador&lt;br&gt;Qrcode" style="sketch=0;points=[[0,0,0],[0.25,0,0],[0.5,0,0],[0.75,0,0],[1,0,0],[0,1,0],[0.25,1,0],[0.5,1,0],[0.75,1,0],[1,1,0],[0,0.25,0],[0,0.5,0],[0,0.75,0],[1,0.25,0],[1,0.5,0],[1,0.75,0]];outlineConnect=0;fontColor=#232F3E;gradientColor=#945DF2;gradientDirection=north;fillColor=#5A30B5;strokeColor=#ffffff;dashed=0;verticalLabelPosition=bottom;verticalAlign=top;align=center;html=1;fontSize=12;fontStyle=0;aspect=fixed;shape=mxgraph.aws4.resourceIcon;resIcon=mxgraph.aws4.api_gateway;shadow=0;labelBackgroundColor=default;" parent="1" vertex="1">
          <mxGeometry x="585.9999999999999" y="697.25" width="40" height="40" as="geometry" />
        </mxCell>
        <mxCell id="svplEpsdSn52677f2Jb7-186" style="edgeStyle=none;rounded=0;orthogonalLoop=1;jettySize=auto;html=1;" parent="1" source="svplEpsdSn52677f2Jb7-185" target="svplEpsdSn52677f2Jb7-159" edge="1">
          <mxGeometry relative="1" as="geometry" />
        </mxCell>
        <mxCell id="svplEpsdSn52677f2Jb7-185" value="Administrador" style="shape=image;html=1;verticalAlign=top;verticalLabelPosition=bottom;labelBackgroundColor=#ffffff;imageAspect=0;aspect=fixed;image=https://cdn1.iconfinder.com/data/icons/user-pictures/100/male3-128.png;shadow=0;" parent="1" vertex="1">
          <mxGeometry x="-550" y="1045" width="50" height="50" as="geometry" />
        </mxCell>
        <mxCell id="svplEpsdSn52677f2Jb7-191" style="edgeStyle=none;rounded=0;orthogonalLoop=1;jettySize=auto;html=1;" parent="1" source="svplEpsdSn52677f2Jb7-187" target="svplEpsdSn52677f2Jb7-189" edge="1">
          <mxGeometry relative="1" as="geometry" />
        </mxCell>
        <mxCell id="svplEpsdSn52677f2Jb7-187" value="Politica&lt;br&gt;Desconto" style="sketch=0;points=[[0,0,0],[0.25,0,0],[0.5,0,0],[0.75,0,0],[1,0,0],[0,1,0],[0.25,1,0],[0.5,1,0],[0.75,1,0],[1,1,0],[0,0.25,0],[0,0.5,0],[0,0.75,0],[1,0.25,0],[1,0.5,0],[1,0.75,0]];outlineConnect=0;fontColor=#232F3E;gradientColor=#945DF2;gradientDirection=north;fillColor=#5A30B5;strokeColor=#ffffff;dashed=0;verticalLabelPosition=bottom;verticalAlign=top;align=center;html=1;fontSize=12;fontStyle=0;aspect=fixed;shape=mxgraph.aws4.resourceIcon;resIcon=mxgraph.aws4.api_gateway;shadow=0;labelBackgroundColor=default;" parent="1" vertex="1">
          <mxGeometry x="659.9999999999999" y="697.25" width="40" height="40" as="geometry" />
        </mxCell>
        <mxCell id="svplEpsdSn52677f2Jb7-189" value="DB" style="sketch=0;points=[[0,0,0],[0.25,0,0],[0.5,0,0],[0.75,0,0],[1,0,0],[0,1,0],[0.25,1,0],[0.5,1,0],[0.75,1,0],[1,1,0],[0,0.25,0],[0,0.5,0],[0,0.75,0],[1,0.25,0],[1,0.5,0],[1,0.75,0]];outlineConnect=0;fontColor=#232F3E;gradientColor=#4D72F3;gradientDirection=north;fillColor=#3334B9;strokeColor=#ffffff;dashed=0;verticalLabelPosition=bottom;verticalAlign=top;align=center;html=1;fontSize=12;fontStyle=0;aspect=fixed;shape=mxgraph.aws4.resourceIcon;resIcon=mxgraph.aws4.database;shadow=0;labelBackgroundColor=default;" parent="1" vertex="1">
          <mxGeometry x="720" y="620" width="40" height="40" as="geometry" />
        </mxCell>
        <mxCell id="SfoQ3ScQT_cwT8VOu1Ar-4" style="edgeStyle=none;rounded=0;orthogonalLoop=1;jettySize=auto;html=1;" edge="1" parent="1" source="SfoQ3ScQT_cwT8VOu1Ar-1" target="SfoQ3ScQT_cwT8VOu1Ar-3">
          <mxGeometry relative="1" as="geometry" />
        </mxCell>
        <mxCell id="SfoQ3ScQT_cwT8VOu1Ar-5" style="edgeStyle=none;rounded=0;orthogonalLoop=1;jettySize=auto;html=1;entryX=0;entryY=0.75;entryDx=0;entryDy=0;entryPerimeter=0;" edge="1" parent="1" source="SfoQ3ScQT_cwT8VOu1Ar-1" target="svplEpsdSn52677f2Jb7-28">
          <mxGeometry relative="1" as="geometry" />
        </mxCell>
        <mxCell id="SfoQ3ScQT_cwT8VOu1Ar-1" value="categoria&lt;br&gt;" style="sketch=0;points=[[0,0,0],[0.25,0,0],[0.5,0,0],[0.75,0,0],[1,0,0],[0,1,0],[0.25,1,0],[0.5,1,0],[0.75,1,0],[1,1,0],[0,0.25,0],[0,0.5,0],[0,0.75,0],[1,0.25,0],[1,0.5,0],[1,0.75,0]];outlineConnect=0;fontColor=#232F3E;gradientColor=#945DF2;gradientDirection=north;fillColor=#5A30B5;strokeColor=#ffffff;dashed=0;verticalLabelPosition=bottom;verticalAlign=top;align=center;html=1;fontSize=12;fontStyle=0;aspect=fixed;shape=mxgraph.aws4.resourceIcon;resIcon=mxgraph.aws4.api_gateway;shadow=0;labelBackgroundColor=default;" vertex="1" parent="1">
          <mxGeometry x="330.75" y="620" width="40" height="40" as="geometry" />
        </mxCell>
        <mxCell id="SfoQ3ScQT_cwT8VOu1Ar-3" value="DB" style="sketch=0;points=[[0,0,0],[0.25,0,0],[0.5,0,0],[0.75,0,0],[1,0,0],[0,1,0],[0.25,1,0],[0.5,1,0],[0.75,1,0],[1,1,0],[0,0.25,0],[0,0.5,0],[0,0.75,0],[1,0.25,0],[1,0.5,0],[1,0.75,0]];outlineConnect=0;fontColor=#232F3E;gradientColor=#4D72F3;gradientDirection=north;fillColor=#3334B9;strokeColor=#ffffff;dashed=0;verticalLabelPosition=bottom;verticalAlign=top;align=center;html=1;fontSize=12;fontStyle=0;aspect=fixed;shape=mxgraph.aws4.resourceIcon;resIcon=mxgraph.aws4.database;shadow=0;labelBackgroundColor=default;" vertex="1" parent="1">
          <mxGeometry x="330.75" y="710" width="40" height="40" as="geometry" />
        </mxCell>
        <mxCell id="svplEpsdSn52677f2Jb7-29" value="preço" style="sketch=0;points=[[0,0,0],[0.25,0,0],[0.5,0,0],[0.75,0,0],[1,0,0],[0,1,0],[0.25,1,0],[0.5,1,0],[0.75,1,0],[1,1,0],[0,0.25,0],[0,0.5,0],[0,0.75,0],[1,0.25,0],[1,0.5,0],[1,0.75,0]];outlineConnect=0;fontColor=#232F3E;gradientColor=#945DF2;gradientDirection=north;fillColor=#5A30B5;strokeColor=#ffffff;dashed=0;verticalLabelPosition=bottom;verticalAlign=top;align=center;html=1;fontSize=12;fontStyle=0;aspect=fixed;shape=mxgraph.aws4.resourceIcon;resIcon=mxgraph.aws4.api_gateway;shadow=0;labelBackgroundColor=default;" parent="1" vertex="1">
          <mxGeometry x="380" y="620" width="40" height="40" as="geometry" />
        </mxCell>
      </root>
    </mxGraphModel>
  </diagram>
</mxfile>
