<?xml version="1.0" encoding="UTF-8" standalone="no"?>
<!-- Created with Inkscape (http://www.inkscape.org/) -->

<svg
   xmlns:dc="http://purl.org/dc/elements/1.1/"
   xmlns:cc="http://creativecommons.org/ns#"
   xmlns:rdf="http://www.w3.org/1999/02/22-rdf-syntax-ns#"
   xmlns:svg="http://www.w3.org/2000/svg"
   xmlns="http://www.w3.org/2000/svg"
   xmlns:sodipodi="http://sodipodi.sourceforge.net/DTD/sodipodi-0.dtd"
   xmlns:inkscape="http://www.inkscape.org/namespaces/inkscape"
   width="124.88334mm"
   height="122.78475mm"
   viewBox="0 0 124.88334 122.78475"
   version="1.1"
   id="svg8"
   inkscape:version="0.92.4 (5da689c313, 2019-01-14)"
   sodipodi:docname="koinobori.svg">
  <defs
     id="defs2" />
  <sodipodi:namedview
     id="base"
     pagecolor="#ffffff"
     bordercolor="#666666"
     borderopacity="1.0"
     inkscape:pageopacity="0.0"
     inkscape:pageshadow="2"
     inkscape:zoom="0.35"
     inkscape:cx="-312.57143"
     inkscape:cy="266.31989"
     inkscape:document-units="mm"
     inkscape:current-layer="layer1"
     showgrid="false"
     fit-margin-top="0"
     fit-margin-left="0"
     fit-margin-right="0"
     fit-margin-bottom="0"
     inkscape:window-width="1920"
     inkscape:window-height="983"
     inkscape:window-x="0"
     inkscape:window-y="27"
     inkscape:window-maximized="1" />
  <metadata
     id="metadata5">
    <rdf:RDF>
      <cc:Work
         rdf:about="">
        <dc:format>image/svg+xml</dc:format>
        <dc:type
           rdf:resource="http://purl.org/dc/dcmitype/StillImage" />
        <dc:title></dc:title>
      </cc:Work>
    </rdf:RDF>
  </metadata>
  <g
     inkscape:label="Layer 1"
     inkscape:groupmode="layer"
     id="layer1"
     transform="translate(-41.879762,-99.536196)">
    <g
       id="flat"
       transform="matrix(2.1166667,0,0,2.1166667,35.529762,93.195237)">
      <path
         id="path10"
         style="fill:#38495c"
         d="m 19.932,24.836 -11.1,-1.85 A 1,1 0 0 1 8.55,21.105 l 9.117,-4.546 0.742,1.853 -6.209,3.107 8.092,1.349 z"
         inkscape:connector-curvature="0" />
      <path
         id="path12"
         style="fill:#38495c"
         d="m 19.932,44.836 -11.1,-1.85 A 1,1 0 0 1 8.55,41.105 l 9.558,-4.722 0.892,1.735 -6.8,3.4 8.092,1.349 z"
         inkscape:connector-curvature="0" />
      <polygon
         id="polygon14"
         style="fill:#50b3c9"
         points="53,48 43,50 17,50 17,34 43,34 53,36 " />
      <polygon
         id="polygon16"
         style="fill:#f98c96"
         points="53,22 53,16 61,14 59,22 " />
      <polygon
         id="polygon18"
         style="fill:#ed6b7b"
         points="53,22 53,28 61,30 59,22 " />
      <polygon
         id="polygon20"
         style="fill:#cdeef6"
         points="53,42 53,36 61,34 59,42 " />
      <polygon
         id="polygon22"
         style="fill:#a0e0ea"
         points="53,42 53,48 61,50 59,42 " />
      <path
         id="path24"
         style="fill:#cdeef6"
         d="m 29,34 c 0,0 9,7 0,16 H 17 V 34 Z"
         inkscape:connector-curvature="0" />
      <polygon
         id="polygon26"
         style="fill:#dd3e46"
         points="53,28 43,30 17,30 17,14 43,14 53,16 " />
      <path
         id="path28"
         style="fill:#f98c96"
         d="m 29,14 c 0,0 9,7 0,16 H 17 V 14 Z"
         inkscape:connector-curvature="0" />
      <path
         id="path30"
         style="fill:#9e212e"
         d="m 40.8,26 a 8.245,8.245 0 0 1 0.82,1.905 7.943,7.943 0 0 1 0.3,2.095 H 43 l 4.918,-1 c 0,0 1,-7 -4,-7 0,0 0.282,2.635 -3.118,4 z"
         inkscape:connector-curvature="0" />
      <circle
         id="circle32"
         style="fill:#dd3e46"
         r="2"
         cy="22"
         cx="27" />
      <path
         id="path34"
         style="fill:#dd3e46"
         d="m 17,14 c 0,0 9,7 0,16 z"
         inkscape:connector-curvature="0" />
      <path
         id="path36"
         style="fill:#f98c96"
         d="m 33.918,14 a 11.978,11.978 0 0 1 3,8 c 0,0 5,-3 5,-8 z"
         inkscape:connector-curvature="0" />
      <path
         id="path38"
         style="fill:#f98c96"
         d="m 33.918,30 a 11.978,11.978 0 0 0 3,-8 c 0,0 5,3 5,8 z"
         inkscape:connector-curvature="0" />
      <path
         id="path40"
         style="fill:#ed6b7b"
         d="M 36.918,22 A 13.233,13.233 0 0 0 40.8,18 c 0,0 3.118,1 3.118,4 0,3 -3.118,4 -3.118,4 a 11.726,11.726 0 0 0 -3.882,-4 z"
         inkscape:connector-curvature="0" />
      <path
         id="path42"
         style="fill:#9e212e"
         d="M 40.8,18 A 8.245,8.245 0 0 0 41.62,16.095 7.943,7.943 0 0 0 41.92,14 H 43 l 4.918,1 c 0,0 1,7 -4,7 0,0 0.282,-2.635 -3.118,-4 z"
         inkscape:connector-curvature="0" />
      <circle
         id="circle44"
         style="fill:#3b73a5"
         r="2"
         cy="42"
         cx="27" />
      <path
         id="path46"
         style="fill:#50b3c9"
         d="m 17,34 c 0,0 9,7 0,16 z"
         inkscape:connector-curvature="0" />
      <path
         id="path48"
         style="fill:#cdeef6"
         d="m 33.918,34 a 11.978,11.978 0 0 1 3,8 c 0,0 5,-3 5,-8 z"
         inkscape:connector-curvature="0" />
      <path
         id="path50"
         style="fill:#cdeef6"
         d="m 33.918,50 a 11.978,11.978 0 0 0 3,-8 c 0,0 5,3 5,8 z"
         inkscape:connector-curvature="0" />
      <path
         id="path52"
         style="fill:#a0e0ea"
         d="M 36.918,42 A 13.233,13.233 0 0 0 40.8,38 c 0,0 3.118,1 3.118,4 0,3 -3.118,4 -3.118,4 a 11.726,11.726 0 0 0 -3.882,-4 z"
         inkscape:connector-curvature="0" />
      <path
         id="path54"
         style="fill:#3b73a5"
         d="M 40.8,38 A 8.245,8.245 0 0 0 41.62,36.095 7.943,7.943 0 0 0 41.92,34 H 43 l 4.918,1 c 0,0 1,7 -4,7 0,0 0.282,-2.635 -3.118,-4 z"
         inkscape:connector-curvature="0" />
      <path
         id="path56"
         style="fill:#3b73a5"
         d="m 40.8,46 a 8.245,8.245 0 0 1 0.82,1.905 7.943,7.943 0 0 1 0.3,2.095 H 43 l 4.918,-1 c 0,0 1,-7 -4,-7 0,0 0.282,2.635 -3.118,4 z"
         inkscape:connector-curvature="0" />
      <path
         id="path58"
         style="fill:#cdeef6"
         d="M 55,11 A 9.453,9.453 0 0 1 50.375,9.869 6.8,6.8 0 0 0 47,9 4.83,4.83 0 0 0 44.015,9.857 6.78,6.78 0 0 1 40,11 6.779,6.779 0 0 1 35.986,9.857 4.838,4.838 0 0 0 33,9 V 7 A 6.779,6.779 0 0 1 37.014,8.143 4.838,4.838 0 0 0 40,9 4.83,4.83 0 0 0 42.985,8.143 6.78,6.78 0 0 1 47,7 8.763,8.763 0 0 1 51.241,8.066 7.546,7.546 0 0 0 55,9 Z"
         inkscape:connector-curvature="0" />
      <path
         id="path60"
         style="fill:#cdeef6"
         d="M 55,7 A 9.523,9.523 0 0 1 50.581,5.908 7.529,7.529 0 0 0 47,5 4.838,4.838 0 0 0 44.014,5.857 6.779,6.779 0 0 1 40,7 V 5 A 4.838,4.838 0 0 0 42.986,4.143 6.779,6.779 0 0 1 47,3 9.523,9.523 0 0 1 51.419,4.092 7.529,7.529 0 0 0 55,5 8.323,8.323 0 0 0 58.022,4.563 11.27,11.27 0 0 1 62,4 V 6 A 9.33,9.33 0 0 0 58.625,6.47 10.226,10.226 0 0 1 55,7 Z"
         inkscape:connector-curvature="0" />
      <path
         id="path62"
         style="fill:#cdeef6"
         d="M 47,57 A 6.78,6.78 0 0 1 42.985,55.857 4.83,4.83 0 0 0 40,55 4.838,4.838 0 0 0 37.014,55.857 6.779,6.779 0 0 1 33,57 V 55 A 4.838,4.838 0 0 0 35.986,54.143 6.779,6.779 0 0 1 40,53 6.78,6.78 0 0 1 44.015,54.143 4.83,4.83 0 0 0 47,55 6.8,6.8 0 0 0 50.375,54.131 9.453,9.453 0 0 1 55,53 v 2 A 7.546,7.546 0 0 0 51.241,55.934 8.763,8.763 0 0 1 47,57 Z"
         inkscape:connector-curvature="0" />
      <path
         id="path64"
         style="fill:#cdeef6"
         d="M 47,61 A 6.779,6.779 0 0 1 42.986,59.857 4.838,4.838 0 0 0 40,59 V 57 A 6.779,6.779 0 0 1 44.014,58.143 4.838,4.838 0 0 0 47,59 7.529,7.529 0 0 0 50.581,58.092 9.523,9.523 0 0 1 55,57 10.226,10.226 0 0 1 58.625,57.53 9.33,9.33 0 0 0 62,58 v 2 A 11.27,11.27 0 0 1 58.022,59.437 8.323,8.323 0 0 0 55,59 7.529,7.529 0 0 0 51.419,59.908 9.523,9.523 0 0 1 47,61 Z"
         inkscape:connector-curvature="0" />
      <rect
         id="rect66"
         style="fill:#d3843d"
         height="53"
         width="4"
         y="8"
         x="5" />
      <circle
         id="circle68"
         style="fill:#b5554e"
         r="4"
         cy="7"
         cx="7" />
    </g>
  </g>
</svg>
