<?xml version="1.0" encoding="UTF-8" standalone="no"?>
<svg
   xmlns:dc="http://purl.org/dc/elements/1.1/"
   xmlns:cc="http://creativecommons.org/ns#"
   xmlns:rdf="http://www.w3.org/1999/02/22-rdf-syntax-ns#"
   xmlns:svg="http://www.w3.org/2000/svg"
   xmlns="http://www.w3.org/2000/svg"
   xmlns:sodipodi="http://sodipodi.sourceforge.net/DTD/sodipodi-0.dtd"
   xmlns:inkscape="http://www.inkscape.org/namespaces/inkscape"
   viewBox="0 0 58 40.316944"
   width="464"
   height="322.53555"
   version="1.1"
   id="svg931"
   sodipodi:docname="onigiri.svg"
   inkscape:version="0.92.4 (5da689c313, 2019-01-14)">
  <metadata
     id="metadata937">
    <rdf:RDF>
      <cc:Work
         rdf:about="">
        <dc:format>image/svg+xml</dc:format>
        <dc:type
           rdf:resource="http://purl.org/dc/dcmitype/StillImage" />
        <dc:title></dc:title>
      </cc:Work>
    </rdf:RDF>
  </metadata>
  <defs
     id="defs935" />
  <sodipodi:namedview
     pagecolor="#ffffff"
     bordercolor="#666666"
     borderopacity="1"
     objecttolerance="10"
     gridtolerance="10"
     guidetolerance="10"
     inkscape:pageopacity="0"
     inkscape:pageshadow="2"
     inkscape:window-width="834"
     inkscape:window-height="480"
     id="namedview933"
     showgrid="false"
     fit-margin-top="0"
     fit-margin-left="0"
     fit-margin-right="0"
     fit-margin-bottom="0"
     inkscape:zoom="0.4609375"
     inkscape:cx="232"
     inkscape:cy="152"
     inkscape:window-x="0"
     inkscape:window-y="27"
     inkscape:window-maximized="0"
     inkscape:current-layer="svg931" />
  <g
     id="flat"
     transform="translate(-3,-10.683054)">
    <path
       d="M 49,37 H 35 c -4.46,0 -7,-5.011 -5,-9 l 7,-14 a 5.427,5.427 0 0 1 10,0 l 7,14 c 2,3.989 -0.54,9 -5,9 z"
       style="fill:#e0d4d3"
       id="path896"
       inkscape:connector-curvature="0" />
    <path
       d="M 27,37 H 12 C 7.54,37 5.005,31.989 7,28 l 7,-14 a 5.427,5.427 0 0 1 10,0 l 7,14 c 1.995,3.989 0.46,9 -4,9 z"
       style="fill:#ececec"
       id="path898"
       inkscape:connector-curvature="0" />
    <rect
       x="3"
       y="37"
       width="58"
       height="6"
       style="fill:#d3843d"
       id="rect900" />
    <rect
       x="47"
       y="43"
       width="8"
       height="8"
       transform="rotate(-180,51,47)"
       style="fill:#b5554e"
       id="rect902" />
    <rect
       x="9"
       y="43"
       width="8"
       height="8"
       transform="rotate(-180,13,47)"
       style="fill:#b5554e"
       id="rect904" />
    <rect
       x="35"
       y="28"
       width="14"
       height="9"
       style="fill:#67ac7f"
       id="rect906" />
    <rect
       x="39"
       y="15"
       width="2"
       height="2"
       style="fill:#98a1a1"
       id="rect908" />
    <rect
       x="43"
       y="17"
       width="2"
       height="2"
       style="fill:#98a1a1"
       id="rect910" />
    <rect
       x="40"
       y="20"
       width="2"
       height="2"
       style="fill:#98a1a1"
       id="rect912" />
    <rect
       x="36"
       y="23"
       width="2"
       height="2"
       style="fill:#98a1a1"
       id="rect914" />
    <rect
       x="45"
       y="22"
       width="2"
       height="2"
       style="fill:#98a1a1"
       id="rect916" />
    <rect
       x="12"
       y="28"
       width="14"
       height="9"
       transform="rotate(-180,19,32.5)"
       style="fill:#67ac7f"
       id="rect918" />
    <rect
       x="20"
       y="15"
       width="2"
       height="2"
       style="fill:#98a1a1"
       id="rect920" />
    <rect
       x="16"
       y="17"
       width="2"
       height="2"
       style="fill:#98a1a1"
       id="rect922" />
    <rect
       x="19"
       y="20"
       width="2"
       height="2"
       style="fill:#98a1a1"
       id="rect924" />
    <rect
       x="23"
       y="23"
       width="2"
       height="2"
       style="fill:#98a1a1"
       id="rect926" />
    <rect
       x="14"
       y="22"
       width="2"
       height="2"
       style="fill:#98a1a1"
       id="rect928" />
  </g>
</svg>
