<?xml version="1.0" encoding="UTF-8" standalone="no"?>
<!-- Created with Inkscape (http://www.inkscape.org/) -->

<svg
   xmlns:dc="http://purl.org/dc/elements/1.1/"
   xmlns:cc="http://creativecommons.org/ns#"
   xmlns:rdf="http://www.w3.org/1999/02/22-rdf-syntax-ns#"
   xmlns:svg="http://www.w3.org/2000/svg"
   xmlns="http://www.w3.org/2000/svg"
   xmlns:sodipodi="http://sodipodi.sourceforge.net/DTD/sodipodi-0.dtd"
   xmlns:inkscape="http://www.inkscape.org/namespaces/inkscape"
   width="128.23474mm"
   height="41.130905mm"
   viewBox="0 0 128.23474 41.130905"
   version="1.1"
   id="svg8"
   inkscape:version="0.92.4 (5da689c313, 2019-01-14)"
   sodipodi:docname="foliage-1.svg">
  <defs
     id="defs2" />
  <sodipodi:namedview
     id="base"
     pagecolor="#ffffff"
     bordercolor="#666666"
     borderopacity="1.0"
     inkscape:pageopacity="0.0"
     inkscape:pageshadow="2"
     inkscape:zoom="1.979899"
     inkscape:cx="299.41046"
     inkscape:cy="182.71345"
     inkscape:document-units="mm"
     inkscape:current-layer="layer1"
     showgrid="false"
     fit-margin-top="0"
     fit-margin-left="0"
     fit-margin-right="0"
     fit-margin-bottom="0"
     inkscape:window-width="1920"
     inkscape:window-height="983"
     inkscape:window-x="0"
     inkscape:window-y="27"
     inkscape:window-maximized="1" />
  <metadata
     id="metadata5">
    <rdf:RDF>
      <cc:Work
         rdf:about="">
        <dc:format>image/svg+xml</dc:format>
        <dc:type
           rdf:resource="http://purl.org/dc/dcmitype/StillImage" />
        <dc:title />
      </cc:Work>
    </rdf:RDF>
  </metadata>
  <g
     inkscape:label="Calque 1"
     inkscape:groupmode="layer"
     id="layer1"
     transform="translate(-40.357699,-0.06355465)">
    <g
       id="g867">
      <path
         inkscape:connector-curvature="0"
         id="path862"
         d="M 40.310452,0.07837644 159.99995,0.01630763 c 0,0 0.22813,0.98269036 -0.57368,2.05176847 -0.80181,1.0690781 0.4009,1.3363475 -0.93544,1.8708865 -1.33635,0.5345393 -1.60362,0.5345393 -2.53906,0.5345393 -0.93544,0 -1.06908,0.6681737 -1.06908,0.6681737 L 153.94725,4.874406 153.14544,3.4044236 h -1.06908 c -1.06908,0 -2.6727,0.133635 -2.6727,0.133635 h -0.93544 l -0.93544,-0.668174 h -0.93545 l -0.53453,1.069078 0.26726,0.4009044 -0.8018,0.1336347 h -0.33409 c 0,0 0.26727,-0.334087 -0.46772,0.6681737 -0.73499,1.0022607 -1.93771,1.202713 -1.93771,1.202713 l -1.60361,-0.2672697 -0.86863,0.5345391 -0.20045,1.5367997 c 0,0 -0.26727,-0.534539 0.20045,0.7349913 0.46772,1.2695302 1.5368,2.0713392 1.5368,2.0713392 l 0.46772,0.534539 -0.13363,0.801808 v 0.467722 c 0,0 0.53454,0.200452 1.33635,0.200452 0.8018,0 2.20497,-0.133635 2.20497,-0.133635 l 0.66817,-0.334087 0.0668,-0.868625 0.0668,-0.868626 h 0.73499 l 0.46772,-0.601357 0.4009,-0.4677215 1.60362,0.2672694 1.26953,0.4009041 1.67044,0.06682 h 1.00226 l 1.00226,-0.06682 c 0,0 1.32743,1.841509 1.42192,1.936003 0.0945,0.09449 0.28349,1.606399 0.28349,1.606399 l -0.0945,1.511904 0.28349,0.472471 0.94493,-1.039435 0.66146,-0.661458 1.32292,0.09449 c 0,0 -0.56696,-0.188988 0.66146,0.283482 1.22842,0.47247 2.45684,0.755952 2.45684,0.755952 l 1.98438,0.755953 1.6064,1.606399 1.03943,1.606398 1.22843,1.133929 0.0945,0.850446 c 0,0 0.28348,-0.188988 -1.6064,0.283483 -1.88988,0.47247 -2.92932,0.377976 -2.92932,0.377976 l -1.5119,-0.944941 -1.5119,-0.850446 c 0,0 -1.32292,-0.09449 -1.79539,-0.09449 -0.47247,0 -1.6064,0.566964 -1.6064,0.566964 l -0.66146,0.850446 c 0,0 -0.75595,0.283483 -0.94494,0.661459 -0.18899,0.377976 -0.18899,1.039434 -0.18899,1.039434 l 2.45685,0.09449 0.85044,0.661459 1.03944,1.039434 -1.22842,0.661459 -1.03944,0.283482 -1.13393,0.283482 -0.47247,0.47247 -1.32291,0.188987 -1.51191,-0.09449 -0.66146,0.661458 -1.6064,-0.944941 -1.03943,-0.377975 c 0,0 -1.22842,1.133929 -3.77976,1.039433 -2.55134,-0.09449 -3.49628,0.18899 -3.49628,0.18899 l -0.28348,1.133927 -0.0945,1.795388 -0.66146,0.472469 -0.56696,0.283483 -1.13393,-0.755952 -1.22842,-1.417412 h -1.03944 l -0.47246,0.0945 -1.03944,-0.0945 -0.37798,-0.566963 h -0.56696 l -1.13393,0.188987 -0.75595,0.377976 -0.47247,0.377978 0.18899,1.322917 c 0,0 -0.0945,1.039434 0.75595,1.700892 0.85045,0.661459 1.70089,1.511904 1.70089,1.511904 l 0.37798,0.94494 -0.75596,0.566965 -0.75595,0.47247 -0.75595,0.188989 h -0.66146 l -0.66146,0.755951 -0.85044,0.944941 -0.56697,0.188989 -1.32292,-0.472471 h -1.03943 l -0.94494,1.228423 -0.66146,1.039434 -0.47247,1.133928 -0.28348,0.377978 c 0,0 -0.37798,0.28348 -1.32292,-0.188989 -0.94494,-0.472469 -1.03943,-1.700893 -1.03943,-1.700893 l -0.75595,-0.94494 -1.03944,-0.661459 -1.41741,-0.283482 -1.79538,0.09449 -1.13393,0.472472 -0.75596,1.039434 -2.17336,0.661458 -0.66146,0.944941 c 0,0 0.85045,1.322917 -0.94494,-0.283482 -1.79539,-1.6064 -2.83482,-2.456845 -2.83482,-2.456845 l -0.94494,-0.377978 -0.75595,-0.850445 0.66146,-1.511906 1.79538,-0.755951 1.32292,-1.039435 h 0.66146 l -0.75595,-0.94494 -2.07887,-0.18899 -1.7009,-0.283479 -0.66145,-0.377979 -0.47248,-1.322917 -0.18898,-1.039434 1.22842,-1.41741 1.5119,-0.850447 0.75596,-0.566963 -0.28349,-1.133929 -0.75595,-1.41741 -1.32291,-1.133929 -0.47247,-0.09449 c 0,0 -3.2128,1.133929 -4.44123,1.039435 -1.22842,-0.0945 -2.26785,-0.188989 -3.30729,-0.661459 -1.039431,-0.47247 -1.984372,-0.755952 -2.173359,-1.322916 -0.188989,-0.566965 -0.944941,-0.944941 -0.472471,-1.889881 0.472471,-0.944941 0.94494,-0.944941 0.377975,-3.02381 -0.566962,-2.078869 -1.41741,-3.023809 -1.41741,-3.023809 h -0.755951 c 0,0 -1.039434,-0.283483 -1.700893,0.283482 -0.661458,0.566964 -1.984375,0.94494 -1.984375,0.94494 l -1.889881,-0.188988 -1.41741,-0.09449 h -0.661459 l -1.606399,-0.47247 c 0,0 -3.307291,-3.590774 -4.252232,-4.7247026 -0.944941,-1.1339285 -1.889882,-1.7953868 -1.889882,-1.7953868 0,0 0,-0.7559524 -1.41741,-0.4724701 -1.41741,0.283482 -1.889881,0.5669642 -1.889881,0.5669642 L 75.21726,6.9032733 74.083332,5.9583327 72.665922,5.2023803 71.626488,4.9188983 c 0,0 -0.472471,-0.1889881 -0.755954,0.283482 -0.283482,0.4724704 0.377976,1.1339288 0.377976,1.1339288 l 1.889882,1.5119045 1.984375,1.0394347 0.755951,1.0394344 v 0.8504463 l -0.188986,0.755953 c 0,0 -0.377976,0.09449 -1.039435,0.09449 -0.661458,0 -1.039434,0.283482 -1.13393,0.661458 -0.09449,0.377976 0,1.133928 0,1.133928 l 0.18899,0.661459 -1.700893,-0.09449 c 0,0 -0.566965,0.09449 -0.944941,0.47247 -0.377976,0.377976 -1.795388,1.133929 -1.795388,1.133929 l -2.078868,0.377976 c 0,0 -0.377976,-0.09449 -1.322917,-0.188988 -0.944941,-0.09449 -0.09449,-0.377977 -1.41741,-0.283482 -1.322917,0.09449 -3.96875,-0.850447 -4.819197,-2.07887 C 58.775298,12.19494 57.074405,11.72247 57.074405,11.72247 l -1.417412,-0.377977 -2.173362,-0.47247 c 0,0 -0.944941,-1.7008927 -1.039434,-2.267857 L 51.821878,7.7766478 50.838097,7.3279882 c -0.01097,0.2135434 0.04277,0.4035512 -0.298903,0.7373488 -0.02904,0.1232478 -0.09663,0.2696184 -0.282198,0.4867838 -0.08953,0.1989316 -0.274448,0.3978633 -0.521299,0.596795 C 49.439548,9.1260301 49.249705,8.9614034 49.024426,8.6904709 L 48.44155,8.3086287 C 48.273801,8.2119096 48.101681,8.118104 48.025716,7.9601952 47.942431,7.7716651 47.782513,7.5831351 47.82704,7.394605 47.549262,6.9404293 47.609768,6.8003753 47.528138,6.5283368 47.3545,6.0725373 47.118471,5.6167377 47.028783,5.1609382 46.933925,4.7441155 46.8327,4.3272927 46.629655,3.91047 46.540734,3.5827371 46.389879,3.2550042 46.430978,2.9272713 45.560617,2.950919 44.618971,3.1056088 43.778615,2.6191656 42.300476,2.2524559 42.297445,1.8621227 41.790721,1.495413 L 40.938375,1.0467533 Z"
         style="opacity:0.70499998;fill:#009b75;fill-opacity:1;stroke:none;stroke-width:0.26458332px;stroke-linecap:butt;stroke-linejoin:miter;stroke-opacity:1"
         sodipodi:nodetypes="ccscscccsccccccccsccccsccccscccccccccccccccccccsccccccscccsccsccccccccccccccccccccccccccccccscccccccccccccccscccccccccscccccccccccccccccccccccscccscccccscsccccccccccccscccccccccsccccccccccccccccccccc" />
    </g>
  </g>
</svg>
