<?xml version="1.0" encoding="UTF-8" standalone="no"?>
<!-- Created with Inkscape (http://www.inkscape.org/) -->

<svg
   xmlns:dc="http://purl.org/dc/elements/1.1/"
   xmlns:cc="http://creativecommons.org/ns#"
   xmlns:rdf="http://www.w3.org/1999/02/22-rdf-syntax-ns#"
   xmlns:svg="http://www.w3.org/2000/svg"
   xmlns="http://www.w3.org/2000/svg"
   xmlns:xlink="http://www.w3.org/1999/xlink"
   xmlns:sodipodi="http://sodipodi.sourceforge.net/DTD/sodipodi-0.dtd"
   xmlns:inkscape="http://www.inkscape.org/namespaces/inkscape"
   version="1.1"
   id="svg3713"
   width="274"
   height="268"
   viewBox="0 0 274 268"
   sodipodi:docname="bottom-left-blue-fish-decoupage.svg"
   inkscape:version="0.92.4 (5da689c313, 2019-01-14)">
  <title
     id="title4905">Bottom left blue fish</title>
  <metadata
     id="metadata3719">
    <rdf:RDF>
      <cc:Work
         rdf:about="">
        <dc:format>image/svg+xml</dc:format>
        <dc:type
           rdf:resource="http://purl.org/dc/dcmitype/StillImage" />
        <dc:title>Bottom left blue fish</dc:title>
      </cc:Work>
    </rdf:RDF>
  </metadata>
  <defs
     id="defs3717">
    <linearGradient
       id="linearGradient4903"
       inkscape:collect="always">
      <stop
         style="stop-color:#8af8fb;stop-opacity:1"
         offset="0"
         id="stop4895" />
      <stop
         id="stop4897"
         offset="0.69544375"
         style="stop-color:#0f0088;stop-opacity:1" />
      <stop
         style="stop-color:#010305;stop-opacity:0.99215686"
         offset="0.96990854"
         id="stop4899" />
      <stop
         style="stop-color:#1400b3;stop-opacity:0.99215686"
         offset="1"
         id="stop4901" />
    </linearGradient>
    <linearGradient
       inkscape:collect="always"
       id="linearGradient4740">
      <stop
         id="stop4732"
         offset="0"
         style="stop-color:#8afbf4;stop-opacity:1" />
      <stop
         style="stop-color:#49a8d7;stop-opacity:0.99607843;"
         offset="0.3797676"
         id="stop4734" />
      <stop
         id="stop4736"
         offset="0.60355043"
         style="stop-color:#2e5eca;stop-opacity:0.99215686" />
      <stop
         id="stop4738"
         offset="1"
         style="stop-color:#1400b3;stop-opacity:0.99215686" />
    </linearGradient>
    <inkscape:path-effect
       effect="spiro"
       id="path-effect4703"
       is_visible="true" />
    <inkscape:path-effect
       effect="spiro"
       id="path-effect4697"
       is_visible="true" />
    <linearGradient
       id="linearGradient4689"
       inkscape:collect="always">
      <stop
         style="stop-color:#5feee6;stop-opacity:1"
         offset="0"
         id="stop4685" />
      <stop
         id="stop4691"
         offset="0.29279551"
         style="stop-color:#49a8d7;stop-opacity:0.99607843;" />
      <stop
         style="stop-color:#2e5eca;stop-opacity:0.99215686"
         offset="0.60355043"
         id="stop4693" />
      <stop
         style="stop-color:#1400b3;stop-opacity:0.99215686"
         offset="1"
         id="stop4687" />
    </linearGradient>
    <linearGradient
       inkscape:collect="always"
       id="linearGradient4629">
      <stop
         id="stop4627"
         offset="0"
         style="stop-color:#5feee6;stop-opacity:1" />
      <stop
         id="stop4625"
         offset="1"
         style="stop-color:#100096;stop-opacity:0.99215686" />
    </linearGradient>
    <linearGradient
       id="linearGradient4598"
       inkscape:collect="always">
      <stop
         style="stop-color:#1afeef;stop-opacity:1"
         offset="0"
         id="stop4606" />
      <stop
         id="stop916"
         offset="0.51900274"
         style="stop-color:#367f9d;stop-opacity:0.99607843" />
      <stop
         style="stop-color:#070068;stop-opacity:1"
         offset="1"
         id="stop4604" />
    </linearGradient>
    <linearGradient
       inkscape:collect="always"
       xlink:href="#linearGradient4629"
       id="linearGradient4623"
       x1="78.171547"
       y1="114.32035"
       x2="141.46677"
       y2="114.52381"
       gradientUnits="userSpaceOnUse" />
    <linearGradient
       inkscape:collect="always"
       xlink:href="#linearGradient4689"
       id="linearGradient4683"
       x1="14.681204"
       y1="123.77386"
       x2="33.992329"
       y2="123.24354"
       gradientUnits="userSpaceOnUse" />
    <radialGradient
       inkscape:collect="always"
       xlink:href="#linearGradient4740"
       id="radialGradient4730"
       cx="74.035179"
       cy="156.11861"
       fx="74.035179"
       fy="156.11861"
       r="53.756084"
       gradientTransform="matrix(1,0,0,1.3611939,0,-53.94989)"
       gradientUnits="userSpaceOnUse" />
    <linearGradient
       inkscape:collect="always"
       xlink:href="#linearGradient4689"
       id="linearGradient4885"
       x1="23.485924"
       y1="133.8996"
       x2="267.64322"
       y2="133.8996"
       gradientUnits="userSpaceOnUse" />
    <linearGradient
       inkscape:collect="always"
       xlink:href="#linearGradient4903"
       id="linearGradient4887"
       gradientUnits="userSpaceOnUse"
       x1="23.485924"
       y1="133.8996"
       x2="267.64322"
       y2="133.8996"
       gradientTransform="translate(2.311701e-6)" />
    <radialGradient
       inkscape:collect="always"
       xlink:href="#linearGradient4598"
       id="radialGradient897"
       cx="72.377991"
       cy="20.188587"
       fx="72.377991"
       fy="20.188587"
       r="2.1992927"
       gradientTransform="matrix(1.3928992,0.4220053,-0.343107,3.8836621,-28.50511,-87.158535)"
       gradientUnits="userSpaceOnUse" />
  </defs>
  <sodipodi:namedview
     pagecolor="#ffffff"
     bordercolor="#666666"
     borderopacity="1"
     objecttolerance="10"
     gridtolerance="10"
     guidetolerance="10"
     inkscape:pageopacity="0"
     inkscape:pageshadow="2"
     inkscape:window-width="1920"
     inkscape:window-height="1017"
     id="namedview3715"
     showgrid="false"
     inkscape:snap-bbox="false"
     inkscape:snap-smooth-nodes="true"
     inkscape:zoom="5.6568542"
     inkscape:cx="19.901577"
     inkscape:cy="202.56696"
     inkscape:window-x="-8"
     inkscape:window-y="-8"
     inkscape:window-maximized="1"
     inkscape:current-layer="svg3713" />
  <path
     style="fill:url(#linearGradient4683);fill-opacity:1;stroke:none;stroke-width:1px;stroke-linecap:butt;stroke-linejoin:miter;stroke-opacity:1"
     d="m 24.079154,77.713229 c 0,0 1.843647,21.453353 4.190108,28.381001 2.34646,6.92764 3.650549,8.78549 4.361634,10.99775 0.711085,2.21227 0.834115,5.95487 0.834115,5.95487 0,0 0.279355,6.84715 -0.949743,8.18799 -1.229098,1.34083 -2.402329,1.11736 -2.793405,2.01125 -0.391077,0.89389 -0.446943,0.50281 -0.502813,4.13424 -0.05587,3.63142 -2.178856,10.44733 -3.519691,14.5257 -1.340833,4.07838 -1.508439,2.73754 -1.396703,7.09525 0.111737,4.35772 0.05587,7.03939 -0.111736,7.98914 -0.167604,0.94976 -0.111736,1.78778 -0.726285,1.2291 -0.614549,-0.55868 -4.748789,-3.01688 -7.542195,-13.57595 -2.793405,-10.55907 -4.748789,-22.12377 -4.916393,-25.47585 -0.167606,-3.35209 -0.391077,-21.00641 -0.111736,-21.84443 0.124391,-1.20623 0.335725,-2.72684 0.893889,-4.07838 0.391077,-0.89389 1.731912,-1.50844 4.13424,-4.860522 2.402329,-3.352086 5.475075,-9.944523 5.642679,-10.503204 0.167604,-0.558681 2.011252,-8.268479 2.427598,-9.821465 0.2062,-1.019052 0.497866,-2.383635 0.643199,-3.424802"
     id="path4675"
     inkscape:connector-curvature="0"
     sodipodi:nodetypes="cscccsscscsssccsscc" />
  <path
     style="fill:url(#linearGradient4887);fill-opacity:1;stroke:none;stroke-width:1px;stroke-linecap:butt;stroke-linejoin:miter;stroke-opacity:1"
     d="m 112.12725,192.07528 c 2.6258,0.0559 4.18023,-0.10679 9.15249,1.06644 4.97226,1.17323 18.61399,8.15176 19.89896,8.76631 1.28496,0.61455 3.91076,3.29622 6.31309,5.75441 2.40233,2.4582 7.8774,11.67644 7.8774,11.67644 0,0 7.76567,14.69331 11.89991,20.39186 4.13424,5.69854 9.27411,7.7098 9.88866,8.21261 0.61455,0.50281 6.64829,0.1676 12.57031,-0.27934 5.92202,-0.44695 11.11775,0.67042 16.8163,1.89951 5.69855,1.2291 9.77692,3.57556 17.93366,7.59807 8.15675,4.02247 7.65393,4.07837 7.65393,4.07837 l -0.61455,-1.11736 c 0,0 -1.73191,-1.34084 -8.77129,-6.92765 -7.03938,-5.58681 -13.33163,-8.93728 -13.33163,-8.93728 0,0 -9.24411,-4.38503 -11.93043,-5.88621 -2.68632,-1.50118 -2.29127,-1.34316 -3.16038,-3.91096 -0.8691,-2.56781 -2.13741,-3.10998 -2.13741,-3.10998 0,0 -2.12299,-0.55868 -6.70418,-2.23472 -4.58118,-1.67605 -16.76042,-9.72105 -16.76042,-9.72105 0,0 -10.95015,-9.05064 -13.85529,-12.06751 -2.90514,-3.01688 -2.4582,-4.69292 -2.4582,-4.69292 0,0 0.22348,0.78215 1.34084,1.78777 1.11736,1.00563 18.0454,8.71543 20.61533,9.77692 2.56993,1.0615 7.26284,2.23473 10.6708,3.40796 3.40795,1.17323 4.69292,-0.33521 7.48633,-1.34084 2.7934,-1.00562 5.19573,-0.50281 5.19573,-0.50281 l 1.06149,0.39108 c 1.0615,0.39107 1.89952,2.51406 4.58119,5.30747 2.68167,2.7934 6.25723,3.29622 6.25723,3.29622 0,0 8.15674,0.22347 12.40272,-0.27935 4.24597,-0.50281 3.24035,-1.45257 8.77129,-2.961 5.53094,-1.50844 6.36896,0 13.129,1.78777 6.76004,1.78778 9.06806,-1.60504 14.20367,-4.05433 5.13561,-2.44929 8.9816,-10.58311 8.9816,-10.58311 l -0.33521,-1.00563 c 0,0 -0.94976,0.44695 -5.084,2.68167 -4.13424,2.23473 -4.13424,0.78216 -6.81591,1.2291 -2.68167,0.44695 -8.60369,-1.00562 -14.1905,-3.35208 -5.58681,-2.34646 -35.42038,-15.53134 -35.42038,-15.53134 0,0 -4.25942,-4.96337 -42.49998,1.67342 C 124.51886,201 97.154485,153.23996 97.154485,153.23996 l 3e-5,-4e-5 C 90.324419,145.09496 84.684805,134.60244 80.205319,123.20143 75.725833,111.80042 72.406475,99.490919 70.216892,87.712009 68.027308,75.933098 66.855762,67.366445 67.007108,55.406119 67.124511,46.12812 68.520956,40.494512 69.388215,34.918219 70.170368,22.5155 72.516828,21.174665 66.315468,11.062538 63.61166,6.6536269 64.080744,7.7663194 62.348833,6.8724297 c -1.731911,-0.8938897 -3.854898,0 -8.045006,1.7877794 -4.190108,1.7877799 -9.776918,7.9332709 -10.726676,8.9947649 -0.949758,1.061494 -7.653929,10.056259 -9.274105,12.961401 -1.620175,2.905142 -7.598061,23.464605 -8.21261,25.587593 -0.614549,2.122988 -1.117362,7.486326 -1.396703,10.894281 -0.27934,3.407954 0.02696,7.651167 0.02696,7.651167 l -0.727975,3.310303 2.126039,18.113334 1.635185,8.573667 c 0,0 0.58468,1.94424 1.433468,4.08025 0.424394,1.068 0.879659,2.2152 1.290567,3.25378 0.410908,1.03858 0.777459,1.96854 1.024426,2.60208 0.987867,2.53415 1.578991,4.07864 1.772669,5.91666 l 0.22574,1.99448 c 0.580995,-0.1338 1.125189,0.18628 1.624189,0.37478 0.499,0.1885 0.661239,0.6274 0.638795,0.61057 0,0 1.55613,4.5269 3.399778,8.04659 1.843646,3.51969 8.32093,11.68682 12.501365,17.57604 0,0 -0.414864,-6.54199 -0.856805,-7.69104 -0.441942,-1.14905 -6.057787,-9.60566 -6.057787,-9.60566 0,0 -1.140501,-3.52001 -1.759219,-5.42036 -0.618719,-1.90035 -1.189524,-3.99699 -2.235597,-6.02871 -1.046073,-2.03172 -2.129822,-3.15831 -3.102094,-3.68864 -0.972272,-0.53033 -2.607456,-2.07713 -3.18198,-3.0494 -0.574525,-0.97227 -1.453416,-2.19894 -1.676883,-3.1545 -0.223467,-0.95556 -0.314526,-0.86271 -0.185198,-1.42301 l 0.129328,-0.56031 c 0,0 -0.394284,0.008 -0.558681,-1.1453 -0.164397,-1.15377 -0.164397,-4.43502 -0.164397,-4.49752 0,-0.0625 0.09375,-3.234375 0.09375,-3.234375 0,0 -0.1875,-2.265625 -0.3125,-3.125 C 31.671874,95.71875 30.437499,87.65625 30.437499,87.65625 l -1.386093,-8.322886 c 0,0 -0.192031,-1.411489 -0.160781,-1.630239 0.03125,-0.21875 0.02928,-1.523519 1.539972,-0.299712 0.377674,0.305952 0.823234,0.940591 1.285482,1.729729 0.462247,0.789139 0.941181,1.732776 1.385601,2.656724 0.888841,1.847896 1.573335,3.396064 1.77646,3.692939 0.40625,0.59375 1.278109,1.84532 1.278109,1.84532 l 2.015625,4.09375 2.593749,5.296875 2.59375,5.28125 3.5625,7.3125 4.546874,8.96875 3.640625,6.98438 9.015624,17.60937 c 0,0 7.941624,13.17729 10.656249,15.90625 2.834042,2.84901 4.96875,4.15625 4.96875,4.15625 l 2.124999,1.6875 c 0,0 7.084731,6.53576 8.719915,8.12675 1.635184,1.59099 3.972169,4.37348 4.521669,4.7395 0.5495,0.36602 1.822093,0.24896 2.861898,0.22005 1.203966,-0.0335 1.580159,-0.31795 3.198664,0.26246 1.61851,0.58037 2.23352,0.91356 2.71799,1.69821 0.48447,0.78465 1.75704,3.39223 1.75704,3.39223 l 2.2258,4.98858 1.48384,3.51968 0.49385,0.96603 0.68523,-0.45277 c 0.43757,-0.0417 0.92991,-0.0244 1.58636,-0.0104"
     id="path4712"
     inkscape:connector-curvature="0"
     sodipodi:nodetypes="cscccsscccccscsccccccccsccccccccsccccscsccssscsssssssccccsssccscscscssssscccscsccsssssccccccccsccssscscccccc" />
  <path
     style="fill:url(#radialGradient4730);fill-opacity:1;stroke:none;stroke-width:1px;stroke-linecap:butt;stroke-linejoin:miter;stroke-opacity:1"
     d="m 112.67609,196.15855 c 0.94976,0.67042 5.41921,3.57556 9.60932,8.21262 4.1901,4.63705 7.48632,7.65393 10.27973,12.34685 2.7934,4.69292 3.30613,5.07902 2.52397,5.30249 -0.78215,0.22347 -12.34685,-5.13987 -13.18487,-5.69855 -0.83802,-0.55868 -12.29098,-7.09525 -13.46422,-7.7098 -1.17323,-0.61455 -5.47507,-0.22347 -8.38021,-0.94976 -2.905143,-0.72628 -5.92202,-4.35771 -10.838414,-6.42483 -4.916393,-2.06712 -9.329974,-1.95538 -11.955775,-4.0225 -2.625801,-2.06712 -7.65393,-6.4807 -9.44171,-8.71543 -1.787779,-2.23472 -10.299625,-14.79459 -10.355495,-16.1913 -0.05587,-1.3967 -1.488543,-5.98833 -1.935488,-10.84886 -0.446945,-4.86052 -1.73764,-6.95426 -2.144341,-8.29978 l -1.723648,-3.95775 c -0.02112,-0.65507 -0.245151,-1.51249 -0.294221,-2.12851 -0.139697,-1.44311 -0.391077,-1.95538 -0.642483,-4.30184 -0.251407,-2.34646 -4.748789,-8.79923 -5.977888,-10.86635 -1.229098,-2.06712 -2.793405,-7.57013 -2.961009,-8.12881 -0.167605,-0.55868 -1.284967,-3.29622 -2.486131,-5.19573 -1.201164,-1.89952 -1.731911,-1.53637 -3.296218,-2.93308 -1.564307,-1.3967 -2.82134,-4.1063 -3.212416,-5.08399 -0.671428,-1.24763 -0.947839,-2.57836 -0.957841,-3.15072 -0.307276,-1.3129 0.20362,-5.48091 0.28742,-7.548027 0.0838,-2.06712 -2.514064,-16.900102 -3.072746,-20.531529 -0.558681,-3.631427 0.698352,-2.597867 1.312901,-2.150922 0.614549,0.446945 3.939694,6.359378 3.939694,6.359378 l 14.189507,29.03307 12.402719,23.79981 c 0,0 7.933271,15.08439 10.782545,18.15714 2.849273,3.07274 7.542194,8.32434 9.218237,9.16236 1.676044,0.83803 5.642679,4.69293 8.491953,7.43046 2.849273,2.73754 5.363338,5.97789 6.089623,6.20136 0.726286,0.22348 1.061494,0.39108 2.06712,0.27934 1.005626,-0.11173 2.514075,-0.44694 3.631435,0.0559 1.11736,0.50281 2.34646,0.72629 3.29622,2.51407 0.94976,1.78778 0.83802,1.22909 1.67604,3.46382 0.83802,2.23472 2.34646,5.86615 3.21242,7.93327 0.58661,1.67605 2.36451,3.91572 3.31427,4.58613"
     id="path3725"
     inkscape:connector-curvature="0"
     sodipodi:nodetypes="csccsccsscsscccsscccccssscccccccccsccc" />
  <path
     style="opacity:1;fill:url(#linearGradient4623);fill-opacity:1;stroke:none;stroke-width:1px;stroke-linecap:butt;stroke-linejoin:miter;stroke-opacity:1"
     d="m 69.555793,71.958814 c 1.061494,-0.279341 3.407954,-3.128614 4.637053,-3.016878 1.229098,0.111736 2.34646,-0.111736 9.665182,6.480701 7.318722,6.592436 12.961401,12.402719 12.961401,12.402719 0,0 2.905141,2.569933 4.804661,3.743163 1.89951,1.173231 3.12861,3.184482 6.08962,3.687295 0,0 5.53094,0.391077 6.87178,2.290593 1.34083,1.899515 5.53094,5.642683 7.48632,12.067513 1.95539,6.42483 3.01688,14.63744 3.07275,16.76043 0.0559,2.12299 0.22347,3.68729 0.67042,4.97226 0.44694,1.28497 6.92764,12.34685 7.70979,13.74356 0.78216,1.3967 5.81029,10.95014 5.81029,10.95014 0,0 1.11736,2.62581 1.3967,2.96101 0.27934,0.33521 0.22347,0.83803 0.22347,0.83803 0,0 -1.3967,0.55868 -2.23472,0.0559 -0.83802,-0.50281 -2.17886,-0.61455 -5.084,-3.29621 -2.90514,-2.68167 -5.2516,-4.30185 -8.60369,-9.10651 -3.35208,-4.80465 -4.35771,-6.08962 -11.06188,-11.06188 -6.70418,-4.97226 -10.11213,-6.98351 -10.95015,-9.44171 -0.83802,-2.4582 -4.301846,-9.49758 -10.559074,-10.78255 -6.257228,-1.28496 -10.503204,-2.34646 -12.290983,-4.80465 -1.486002,-2.01792 -1.641476,-2.96617 -3.645602,-3.28955 -1.561099,-0.31951 -2.777376,-3.70465 -3.833464,-8.10217 -1.056087,-4.397521 -1.951984,-9.807432 -2.872324,-14.176495 -0.811595,-3.864218 -1.32101,-8.252514 -1.696172,-10.857586 0,0 0.371128,-2.737785 1.432622,-3.017125 z"
     id="path3727"
     inkscape:connector-curvature="0"
     sodipodi:nodetypes="ssscccccccccccccssscccsccs" />
  <ellipse
     id="path3737"
     cx="67.782837"
     cy="20.642441"
     rx="2.1992927"
     ry="4.8438683"
     style="opacity:0.63800001;fill:url(#radialGradient897);fill-opacity:1;stroke:none;stroke-width:0.8319357;stroke-opacity:1"
     transform="matrix(0.94409184,0.32968257,-0.20138761,0.97951163,0,0)" />
  <path
     style="fill:none;stroke:#000000;stroke-width:1px;stroke-linecap:butt;stroke-linejoin:miter;stroke-opacity:1"
     d="M 50.881203,148.13464 Z"
     id="path4744"
     inkscape:connector-curvature="0" />
</svg>
