id;id_proceso
287178;287178-mantenimiento-reparaciones-dependencias-policiales-1
287490;287490-adquisicion-acondicionadores-aire-facultades-1
287691;287691-adquisicion-software-sbe-1
288078;288078-mantenimiento-cctv-casa-matriz-sucursales-sbe-3
289451;289451-lp1159-15-servicios-despachos-aduaneros-modalidad-contrato-abierto-1
289647;289647-lp01134-15-adquisicion-vehiculos-flota-ande-1
290039;290039-llamado-n-170-2015-lpn-mantenimiento-reparacion-vehiculos-multimarcas-mopc-1
290191;290191-cd-n-35-2015-adquisicion-papeles-varios-institucion-1
290334;290334-almuerzo-escolar-1
291034;291034-adquisicion-utiles-oficina-1
291527;291527-provision-almuerzo-escolar-escuelas-ciudad-san-lorenzo-2
291995;291995-adquisicion-utiles-oficina-e-insumos-1
292254;292254-reparacion-mantenimiento-flota-vehiculos-ministerio-justicia-1
292628;292628-servicio-mantenimiento-ascensores-1
292754;292754-adquisicion-colchones-frasadas-almohadas-sabanas-otros-textiles-1
293312;293312-adquisicion-equipos-informaticos-1
295240;295240-alquiler-impresoras-fotocopiadoras-plurianual-1
296224;296224-adquisicion-almuerzo-escolar-fonacide-3
296754;296754-adquisicion-alimentos-almuerzo-escolar-municipalidad-nueva-alborada-2015-1
296761;296761-servicio-mantenimiento-reparacion-vehiculos-varios-senasa-1
297465;297465-instalacion-provision-puesta-marcha-planta-generadora-oxigeno-hospital-nacional-cent-1
297773;297773-servicios-fumigacion-sede-central-dgrec-1
297885;297885-adquisicion-equipos-informaticos-direccion-vigilancia-sanitaria-planificacion-progra-1
297979;297979-construccion-e-estacionamiento-plaza-acceso-auditorio-cafeteria-plaza-acceso-edif-mu-1
297995;297995-adquisicion-bienes-alimentacion-escolar-ad-referendum-1
298202;298202-construccion-centro-deportivo-mauricio-jose-troche-convenio-secretaria-nacional-depo-1
298642;298642-consultoria-producto-diseno-desarrollo-aplicacion-web-reporte-linea-carpeta-instruct-1
299218;299218-adquisicion-platos-frescos-almuerzo-escolar-ano-2016-ad-referendum-1
299843;299843-provision-e-instalacion-transformador-energia-400-kva-casa-matriz-1
300085;300085-adquisicion-equipos-informaticos-1
300223;300223-firmas-constructoras-obras-mejoramiento-arroyo-paraguari-barrio-obrero-asuncion-segu-1
300468;300468-cd-n-57-2015-adquisicion-equipos-informaticos-direccion-general-marina-mercante-ad-1
300705;300705-adquisicion-tintas-toner-ad-referendum-1
300835;300835-llamado-mopc-n-149-2015-lpn-empresas-constructoras-pavimentacion-asfaltica-empedrado-1
301114;301114-adquisicion-utiles-oficina-ad-referendum-1
301596;301596-servicios-mantenimiento-edificio-escuela-administracion-filial-caacupe-1
301703;301703-entubamiento-av-principal-gral-diaz-tinglado-colonia-fortuna-san-blas-1
301888;301888-adquisicion-almuerzo-escolar-plurianual-1
302025;302025-contratacion-servicios-limpieza-sede-central-regionales-snpp-ad-referendum-plurianua-1
302118;302118-adquisicion-equipos-especializados-terapias-intensivas-msp-bs-1
302129;302129-construccion-explanada-mirador-ad-referendum-1
302137;302137-construccion-edificio-municipal-1
302183;302183-adquisicion-equipos-informaticos-d-r-a-d-g-r-p-ad-referendum-s-b-e-1
302292;302292-lpn-sbe-02-16-adquisicion-medicamentos-biologicos-hemoderivados-inmunosupresores-onc-1
302402;302402-lpi-empresas-constructoras-rehabilitacion-pavimentacion-tramo-desvio-alberdi-pilar-1
302456;302456-montaje-conexion-camaras-circuito-cerrado-1
302476;302476-almuerzo-escolar-1
302646;302646-adquisicion-alimentos-solidos-galletitas-dulces-galletitas-chias-chipitas-sistema-co-1
302647;302647-adquisicion-almuerzo-natural-instituciones-educativas-departamento-alto-parana-zona-3
302658;302658-adquisicion-de-tintas-toner-ad-referendum-1
302723;302723-adquisicion-equipos-informaticos-2016-1
302827;302827-provision-almuerzo-escolar-1
302986;302986-mantenimiento-reparacion-transformadores-1
303049;303049-almuerzo-escolar-distintas-instituciones-educativas-distrito-encarnacion-traves-fond-1
303098;303098-adquisicion-tintas-toner-1
303197;303197-adquisicion-equipos-informatica-ad-referendum-1
303230;303230-adquisicion-retroexcavadora-tractor-agricola-implementos-1
303250;303250-remodelacion-cementerio-estacionamiento-refaccion-vereda-kiosko-venta-flores-1
303289;303289-mantenimiento-vehiculos-1
303315;303315-adquisicion-almuerzo-escolar-complemento-nutricional-1
303353;303353-adquisicion-insumos-cafeteria-1
303368;303368-adquisicion-cubiertas-1
303395;303395-provision-almuerzo-escolar-instituciones-educativas-ano-2016-1
303424;303424-construccion-sanitarios-instituciones-educativa-1
303448;303448-adquisicion-utiles-oficina-e-insumos-fotocopiadoras-e-impresoras-1
303507;303507-adquisicion-fotocopiadoras-multifuncion-1
303703;303703-construccion-restauracion-locales-escolares-3
303798;303798-adquisicion-bolsas-residuos-bioinfecciosos-1
303922;303922-provision-servicio-almuerzo-escolar-escuelas-publicas-distrito-natalio-1
304094;304094-adquisicion-tractor-implemento-agricola-1
304181;304181-provision-almuerzo-escolar-distintas-instituciones-educativas-1
304230;304230-adquisicion-implementos-agricolas-secretaria-pueblos-originarios-1
304397;304397-cd-n-07-16-mantenimiento-edificio-municipal-1
304436;304436-adquisicion-uniformes-funcionarios-junta-muicipal-defensoria-municipal-juzgado-falta-1
304493;304493-reparacion-aulas-3
304495;304495-construccion-aulas-tematicas-col-nacional-ysypo-1
304599;304599-adquisicion-pinturas-thinner-barnices-masillas-plasticas-kerosen-solventes-alcohol-1
304701;304701-adquisicion-equipos-oficina-e-imprenta-1
304838;304838-adquisicion-varilla-acero-1
304953;304953-contratacion-seguro-vida-1
305025;305025-adquisicion-proyectores-pizarras-multimedia-3
305078;305078-lpn-n-02-16-construcciones-ampliaciones-reparaciones-establecimientos-educativos-mar-1
305078;305078-lpn-n-02-16-construcciones-ampliaciones-reparaciones-establecimientos-educativos-mar-3
305462;305462-adquisicion-equipos-computacion-bnf-1
305927;305927-ampliacion-sistema-videovigilancia-servicio-readecuacion-cableado-estructurado-elect-1
306176;306176-servicio-almuerzo-escolar-ano-2016-1
306252;306252-servicio-social-1
306362;306362-provision-almuerzo-escolar-escuelas-publicas-1
306384;306384-refaccion-remodelacion-municpalidad-1
306458;306458-almuerzo-escolar-instituciones-educativas-1
306575;306575-adq-utiles-oficina-tintas-toner-1
306624;306624-adquisicion-almuerzo-escolar-1
306881;306881-adquisicion-utiles-oficina-tintas-toners-facultad-derecho-ciencias-sociales-una-1
306984;306984-llamado-mopc-n-33-2016-licitacion-publica-nacional-servicio-limpieza-edificios-mopc-1
307037;307037-adquisicion-medicamentos-e-insumos-hospital-central-policia-1
307166;307166-cd-n-12-16-adquisicion-desmalezadoras-2-llamado-3
307203;307203-primas-gastos-seguro-vehiculos-1
307259;307259-adquisicion-articulos-oficina-papeleria-tintas-1
307546;307546-adquisicion-usina-asfalto-1
307838;307838-adquisicion-almuerzo-escolar-instituciones-educativas-ciudad-paraguari-1
307964;307964-adquisicion-almuerzo-escolar-ano-lectivo-2016-2
308171;308171-adquisicion-utiles-oficina-toner-direccion-general-registro-estado-civil-1
308266;308266-actualizacion-red-corporativa-1
308507;308507-adquisicion-utiles-oficina-toners-1
308536;308536-contratacion-seguros-parque-automotor-justicia-electoral-1
308538;308538-contratacion-seguros-vida-conductores-personal-ss-gg-1
308603;308603-contratacion-seguro-todo-riesgo-ad-referendum-1
308981;308981-adquisicion-sistema-circuito-cerrado-1
309216;309216-adquisicion-alimentos-almuerzo-escolar-1
309351;309351-seguro-vehiculos-1
309418;309418-adquisicion-toner-cintas-impresoras-1
309640;309640-provision-almuerzo-escolar-instituciones-educativas-distrito-1
309818;309818-lpn-81-16-contratacion-servicios-provision-alimentos-pacientes-internados-funcionari-1
309828;309828-servicio-aseo-limpieza-fumigacion-edificio-1
309889;309889-almuerzo-escolar-beneficiando-ninos-ninas-educacion-inicial-educacion-escolar-basica-1
310068;310068-adquisicion-almuerzo-escolar-3
310101;310101-construccion-empedrado-calle-asuncion-1
310176;310176-adquisicion-uniformes-uso-personal-tecnico-1
310312;310312-lpn-sbe-131-16-contratacion-servicio-implementacion-base-datos-centralizada-personas-1
310530;310530-lpn-sbe-143-16-adquisicion-insumos-servicio-neurocirugia-neuroradiologia-hospital-ce-1
310744;310744-lpn-sbe-144-16-adquisicion-insumos-varios-ips-ad-referendum-2017-1
311529;311529-adquisicion-almuerzo-escolar-distrito-sapucai-1
311752;311752-provision-almuerzo-escolar-elaborado-sitio-plurianual-2016-2017-1
311889;311889-adquisicion-maquinarias-tabajos-pesados-1
311957;311957-provision-almuerzo-escolar-1
312167;312167-provision-almuerzo-escolar-distintas-instituciones-educativas-ciudad-carapegua-1
312240;312240-mantenimiento-reparacion-vehiculos-msp-bs-1
312433;312433-compra-tractor-agricola-implementos-1
312439;312439-adquisicion-ingredientes-almuerzo-escolar-1
312579;312579-lp01212-16-suministro-crucetas-herrajes-1
312631;312631-construccion-pavimento-tipo-empedrado-calles-distrito-1
312744;312744-adquisicion-galletita-dulce-1
312747;312747-adquisicion-almuerzo-escolar-fonacide-1
312750;312750-adquisicion-almuerzo-escolar-escuelas-publicas-distrito-minga-guazu-1
313018;313018-servicio-limpieza-senadis-sede-central-1
313109;313109-contruccion-empedrado-calle-san-damian-1
313119;313119-adquisicion-almuerzo-escolar-instituciones-educativas-distrito-san-jose-arroyos-1
313190;313190-adquisicion-neumaticos-1
313254;313254-provision-almuerzo-escolar-instituciones-educativas-nueva-italia-fonacide-1
313561;313561-provision-almuerzo-escolar-ano-2016-1
313852;313852-adquisicion-maquinas-agricolas-sus-implementos-1
313950;313950-adquisicion-equipos-informaticos-1
314118;314118-adquisicion-almuerzo-escolar-escuelas-basicas-distrito-tebicuarymi-1
314125;314125-adquisicion-trituradora-industrial-0-km-trailer-cargan-adaptable-tractor-1
314172;314172-adquisicion-conjuntos-semaforicos-1
314178;314178-ampliacion-sistema-seguridad-monitoreo-turistico-distintos-puntos-ciudad-1
314328;314328-adquisicion-insumos-varios-distintas-unidades-sanitarias-ministerio-salud-publica-bi-1
314329;314329-adquisicion-insumos-cardiocirugia-hemodinamia-contraste-radiologico-e-insumos-varios-1
314493;314493-adquisicion-d-sueros-glucosados-fisiologicos-diferentes-volumenes-msp-bs-1
314740;314740-seguro-odontologico-1
314842;314842-adquisicion-sistema-multas-electronicas-municipalidad-asuncion-1
314844;314844-adquisicion-reductores-velocidad-senalizacion-1
314866;314866-servicio-provision-almuerzo-escolar-menu-variado-1
314932;314932-construccion-bano-4-40-x-6-15-esc-basica-nro-622-padre-adriano-formoso-1
314933;314933-construccion-bano-4-40-x-6-15-esc-bas-nro-209-vice-presidente-sanchez-1
314934;314934-reparacion-bloque-3-aulas-mas-direccion-bano-esc-basica-nro-3011-san-jorge-1
314982;314982-adquisicion-equipos-informaticos-municipalidad-asuncion-1
314998;314998-construccion-empedrado-1
315070;315070-llamado-mopc-n-75-2016-licitacion-publica-nacional-adquisicion-sistema-integral-cont-1
315200;315200-adquisicion-equipamientos-laboratorios-investigacion-ensenanza-proyectos-investigaci-1
315275;315275-adquisicion-articulos-libreria-e-insumos-oficina-1
315380;315380-adquisicion-textiles-vestuarios-varios-1
315456;315456-adquisicion-almuerzo-escolar-instituciones-educativas-distrito-dr-juan-eulogio-estig-1
315800;315800-adquisicion-medicamentos-e-insumos-programa-nacional-diabetes-1
316013;316013-servicios-seguridad-vigilancia-campus-segundo-llamado-1
316215;316215-obra-construccion-reconstruccion-pavimento-tipo-empedrado-calles-ciudad-san-lorenzo-1
316231;316231-adquisicion-platos-frescos-programa-almuerzo-escolar-ano-2017-ad-referendum-1
316283;316283-adquisicion-reactivos-e-insumos-programas-salud-1
316368;316368-construccion-tres-aulas-ss-hh-alumnos-profesores-1
316648;316648-adquisicion-equipos-oficina-computacion-ad-referendum-1
316675;316675-adquisicion-implementos-agricolas-1
316704;316704-adquisicion-equipos-video-vigilancia-cip-villeta-1
316742;316742-construccion-nuevo-salon-municipalidad-santa-maria-fe-1
316782;316782-adquisicion-equipos-informaticos-1
316864;316864-lp1266-16-adquisicion-reles-e-instrumentos-medicion-1
317217;317217-servicio-guardia-seguridad-sede-central-regionales-ad-referendum-plurianual-1
317699;317699-adquisicion-camioneta-municipalidad-carmelo-peralta-1
317791;317791-adquisicion-insumos-cardiocirugia-hemodinamia-contraste-radiologico-e-insumos-varios-1
317891;317891-contratacion-servicio-organizacion-integral-evento-denominado-51-asamblea-general-ce-3
318056;318056-adquisicion-tractor-agricola-implementos-1
318355;318355-adquisicion-uniformes-1
318509;318509-adquisicion-equipos-medicos-ad-referendum-reprogramacion-presupuestaria-1
318951;318951-consultoria-tecnica-relevamiento-datos-referente-carteleria-publicitaria-corporativa-1
319072;319072-lpn-sbe-05-17-adquisicion-equipos-biomedicos-hospital-regional-ciudad-este-ips-1
319328;319328-construccion-canalizacion-segunda-parte-calle-chile-paraguari-villarrica-1
319329;319329-construccion-empedrado-1
319409;319409-lpn-sbe-164-16-adquisicion-computadoras-ordenadores-portatiles-ips-ad-referendum-201-1
319945;319945-construccion-mejoramiento-acceso-ciudad-loma-grande-muro-contencion-portico-e-ilumin-1
320097;320097-lco-05-17-contratacion-servicios-limpieza-integral-sede-central-dependencias-ministe-3
320126;320126-adquisicion-e-instalacion-infraestructura-sistema-datos-ad-referendum-1
320565;320565-adquisicion-productos-explosivos-accesorios-afines-1
320632;320632-construccion-pavimento-tipo-ripio-1
320676;320676-adquisicion-materia-prima-fabricacion-cartucho-1
320689;320689-adquisicion-equipos-oficina-computacion-maquinarias-varias-1
320691;320691-construccion-centro-atencion-integral-mujer-centro-ciudad-mujer-1
320849;320849-reparaciones-mayores-edificios-locales-dimabel-1
321071;321071-adquisicion-papel-termico-ecografia-mspbs-1
321172;321172-adquisicion-netbooks-proyecto-computadora-nino-1
321182;321182-lpn-sbe-n-05-17-adquisicion-kits-escolar-2017-2018-1
321269;321269-adquisicion-omnibus-transporte-escolar-ad-referendum-1
321295;321295-servicio-provision-arreglos-florales-1
321454;321454-lpn-94-17-construccion-alimentador-exclusivo-hospital-i-p-s-ingavi-centro-distribuci-1
321508;321508-construcciones-1
321691;321691-provision-almuerzo-1
321763;321763-servicios-ceremoniales-1
321821;321821-adquisicion-bienes-alimentacion-escolar-1
321953;321953-adquisicion-insumos-farmacia-hospital-clinicas-ad-referendum-presupuesto-2017-1
321984;321984-adquisicion-mobiliarios-instituciones-educativas-fonacide-1
322080;322080-complemento-nutricional-escuelas-publicas-1
322105;322105-servicio-tercerizado-monitoreo-circuito-cerrado-cctv-cajeros-automaticos-bnf-capital-1
322108;322108-mantenimiento-equipos-electromecanicos-1
322246;322246-adquisicion-software-sbe-1
322270;322270-servicio-limpieza-edificios-1
322300;322300-adquisicion-equipos-informaticos-1
322320;322320-adquisicion-merienda-escolar-ad-referendum-plurianual-1
322364;322364-alquiler-fotocopiadoras-multifuncion-1
322437;322437-adquisicion-almuerzo-escolar-fonacide-1
322471;322471-provision-almuerzo-eescolar-1
322566;322566-mantenimiento-reparacion-vehiculos-mic-1
322570;322570-adquisicion-equipos-computacion-sistema-gestion-comercial-1
322708;322708-adquisicion-mobiliario-instituciones-educativas-ciudad-1
322738;322738-provision-almuerzo-escolar-1
322792;322792-adquisicion-vehiculos-1
322840;322840-lp1303-2017-adquisicion-toner-impresoras-alto-volumen-1
322862;322862-lpn-n-01-17-adquisicion-motoniveladora-1
323101;323101-adquisicion-toner-tintas-1
323139;323139-provision-tintas-1
323349;323349-construcciones-reparaciones-mantenimientos-instituciones-educativas-1
323374;323374-adquisicion-maquinas-colectoras-datos-pdt-1
323402;323402-lpi-1340-2017-restauracion-modernizacion-subestacion-san-lorenzo-3
323910;323910-mantenimiento-reparaciones-menores-vehiculos-1
323926;323926-provision-almuerzo-escolar-instituciones-educativas-2017-1
323927;323927-adquisicion-factores-coagulacion-factor-viii-factor-ix-programa-nacional-sangre-1
323972;323972-provision-almuerzo-escolar-fonacide-ad-referendum-plurianual-1
323999;323999-provision-almuerzo-escolar-escuelas-ciudad-san-lorenzo-1
324008;324008-desarrollo-mantenimiento-pagina-web-1
324086;324086-adquisicion-sistema-informatico-gestion-municipal-3
324157;324157-adquisicion-vehiculos-fiuna-1
324173;324173-provision-almuerzo-escolar-distrito-bella-vista-1
324227;324227-adquisicion-insumos-programa-bucodental-gdc-1
324372;324372-adquisicion-almuerzo-escolar-escuelas-distrito-coronel-bogado-2
324501;324501-adquisicion-camionetas-1
324588;324588-contratacion-seguros-vida-vehiculos-edificios-equipos-informaticos-justicia-electora-1
324593;324593-adquisicion-mobiliarios-fonacide-1
324735;324735-adquisicion-insumos-medicos-1
324822;324822-adquisicion-utiles-oficina-tintas-toner-1
324836;324836-adquisicion-compuestos-quimicos-medicamentos-e-insumos-1
324919;324919-adquisicion-equipos-oficina-computacion-1
324929;324929-provision-almuerzo-escolar-1
325120;325120-servicio-ceremonial-actividades-consejo-magistratura-escuela-judicial-1
325245;325245-adquisicion-alimentos-personas-plurianual-1
325290;325290-adquisicion-tintas-tonner-1
325357;325357-adquisicion-malla-media-sombra-1
325358;325358-adquisicion-bio-fuel-1
325402;325402-adquisicion-equipos-trasporte-1
325428;325428-llamado-mopc-n-26-2017-lpn-adquisicion-tintas-toner-fotoconductor-1
325504;325504-adquisicion-insecticidas-varios-senepa-1
325548;325548-llamado-mopc-n-34-2017-licitacion-concurso-ofertas-adquisicion-narcotest-id-325548-1
325740;325740-cd-n-05-2017-adquisicion-fotocopiadoras-1
325768;325768-lco-42-17-contratacion-servicio-sepelio-1
325790;325790-servicio-sala-maternal-guarderia-infantil-1
325808;325808-contratacion-seguros-municipalidad-asuncion-1
325980;325980-adquisicion-alimentos-elaborados-1
326067;326067-adquisicion-equipos-fortalecimiento-red-nacional-datos-ip-mpls-descentralizacion-con-1
326087;326087-adquisicion-sillas-mesas-pedagogicas-1
326147;326147-construccion-biblioteca-central-unc-planta-alta-pac-pluri-anual-2017-2018-1
326226;326226-construccion-reparacion-aulas-ss-hh-fondos-fonacide-adreferendum-1
326258;326258-adquisicion-equipos-laboratorio-inan-1
326287;326287-contratacion-firma-certificadora-sistema-gestion-calidad-norma-iso-9001-su-version-1
326490;326490-adquisicion-utiles-oficina-1
326614;326614-adquisicion-equipos-informaticos-otros-1
326793;326793-mantenimiento-reparacion-vehiculos-1
326829;326829-adquisicion-equipos-informaticos-1
326857;326857-construccion-muros-piedra-bruta-colocada-gaviones-varios-arroyos-ciudad-asuncion-1
326887;326887-contratacion-seguros-vehiculos-seam-1
326895;326895-adquisicion-equipos-reactivos-conacyt-ia-1
326909;326909-lpn-45-17-proyecto-construccion-provision-equipos-policlinica-hospital-central-1
326910;326910-lpn-sbe-n-09-17-contratacion-servicios-hemodialisis-gran-asuncion-1
327012;327012-lpn-sbe-35-17-contratacion-servicios-limpieza-e-higienizacion-parque-salud-ips-1
327128;327128-lpn-sbe-16-17-contratacion-servicios-tercerizados-provision-alimentos-hospitales-cli-1
327326;327326-mantenimiento-reparacion-fotocopiadoras-acondicionadores-aire-direccion-general-regi-3
327342;327342-adquisicion-equipos-informaticos-accesorios-junta-municipal-defensoria-municipal-juz-1
327439;327439-lco-sicom-n-06-2017-adquisicion-equipos-informaticos-servidores-otros-sicom-1
327513;327513-lpn-sbe-42-18-contratacion-servicios-tercerizados-alimentos-funcionarios-pacientes-1
327546;327546-lpn-sbe-46-17-renovacion-licencias-software-ips-1
327561;327561-mantenimiento-preventivo-correctivo-sistema-electromecanico-electrico-sistema-agua-1
327668;327668-lpn-sbe-n-14-2017-adquisicion-libros-biblioteca-escolar-plurianual-2017-2018-1
327693;327693-adquisicion-equipos-oficina-computacion-1
327718;327718-lpn-54-17-adquisicion-medicamentos-biologicos-oncologicos-desglosados-ips-1
327740;327740-adquisicion-combustibles-lubricantes-1
327800;327800-lpn-sbe-45-18-adquisicion-insumos-e-instrumentales-servicio-oftalmologia-1
327835;327835-lpn-sbe-97-17-adquisicion-medicamentos-biologicos-biotecnologicos-oncologicos-e-inmu-1
327938;327938-adquisicion-equipos-informaticos-oficina-mtess-1
328143;328143-servicio-limpieza-dinac-1
328206;328206-elaboracion-proyectos-1
328265;328265-adquisicion-textiles-vestuarios-otros-1
328312;328312-adquisicion-herramientas-mayores-1
328356;328356-adquisicion-almuerzo-escolar-1
328471;328471-alquiler-fotocopiadoras-provision-insumos-repuestos-mantenimiento-modalidad-contrato-1
328681;328681-adquisicion-tintas-toner-1
328828;328828-adquisicion-elementos-limpieza-plurianual-1
328922;328922-adquisicion-equipos-informaticos-accesorios-1
329099;329099-servicio-limpieza-1
329133;329133-adquisicion-insumos-informaticos-formularios-timbrados-rubricados-sbe-1
329185;329185-aquisicion-baterias-1
329197;329197-contratacion-servicios-impresion-fotocopiado-ministerio-relaciones-exteriores-pluria-1
329279;329279-seguros-general-1
329318;329318-adquisici-on-equipos-informaticos-utgs-1
329349;329349-adquisicion-equipos-informaticos-ad-referendum-1
329397;329397-adquisicion-tiendas-campana-chalecos-antibalas-1
329433;329433-adquisicion-equipos-computacion-relojes-biometricos-camaras-seguridad-1
329445;329445-servicio-alquiler-impresoras-provision-insumos-1
329503;329503-adquisicion-equipos-informaticos-1
329655;329655-adquisicion-software-sistema-informacion-gerencial-1
329776;329776-lpn-05-adquisicion-equipos-seguridad-detectores-metales-scanner-1
329886;329886-adquisicion-impresoras-accesorios-informaticos-rectorado-universidad-nacional-asunci-1
330007;330007-contratacion-servicios-hemodialisis-adultos-asuncion-gran-asuncion-e-interior-pais-1
330016;330016-adquisicion-utiles-oficina-tintas-impresoras-1
330023;330023-adquisicion-tanques-ecologicos-combustibles-liquidos-1
330080;330080-adquisicion-equipos-informaticos-1
330094;330094-servicio-almuerzo-escolar-1
330158;330158-adquisicion-camioneta-1
330177;330177-servicio-limpieza-tanques-retiro-residuos-disposicion-final-1
330202;330202-adquisicion-equipos-laboratorio-1
330263;330263-servicio-impresion-credencial-licencias-conducir-municipalidad-asuncion-1
330297;330297-adquisicion-maquinas-hemodialisis-ad-referendum-1
330307;330307-lpn-n-04-2017-adquisicion-muebles-fonacide-1
330345;330345-colegio-nacional-san-lorenzo-calle-2-construccion-ss-hh-tipo-4-40-x-6-15-1
330409;330409-adquisicion-licencias-1
330442;330442-construccion-aula-administrativa-colegio-nacional-yatytay-1
330444;330444-construccion-aulas-colegio-nacional-yatytay-tipologia-mec-1
330462;330462-provision-almuerzo-escolar-instituciones-educativas-loma-grande-1
330492;330492-adquisicion-motoniveladora-articulada-hidraulica-1
330513;330513-adquisicion-equipos-laboratorio-conacyt-1
330544;330544-adquisicion-equipos-informaticos-uso-institucion-1
330548;330548-adquisicion-excavadora-oruga-transportadora-proceso-pluiranual-3
330620;330620-llamado-mopc-ce-n-21-2017-trabajos-restauracion-puesta-valor-iglesia-san-buenaventur-1
330620;330620-llamado-m-o-p-c-n-21-2017-contratacion-excepcion-trabajos-restauracion-puesta-valor-3
330653;330653-servicio-mantenimiento-reparacion-acondicionadores-aire-1
330659;330659-adquisicion-insumos-hemodinamicos-varios-msp-bs-1
330846;330846-servicio-digitalizacion-archivo-municipalidad-san-lorenzo-1
330848;330848-construccion-aulas-escuela-augusto-roa-basto-escuela-heroes-chaco-1
331000;331000-mantenimiento-reparacion-menor-equipos-informaticos-relojes-biometricos-1
331059;331059-provision-almuerzo-escolar-1
331172;331172-adquisicion-camioneta-doble-cabina-tipo-4x4-uso-institucional-municipalidad-domingo-1
331186;331186-insumos-oficina-1
331188;331188-adquisicion-equipos-e-insumos-sistema-impresion-embolsadora-cip-villeta-1
331261;331261-adquisicion-almuerzo-escolar-1
331346;331346-cursos-capacitacion-laboral-1
331364;331364-adquisicion-motocicletas-motocarros-1
331585;331585-contratacion-servicio-despacho-aduanero-programa-ampliado-inmunizaciones-1
331588;331588-refacciones-base-aerea-concepcion-baco-plurianual-1
331591;331591-contratacion-servicio-centro-copiado-ministerio-hacienda-1
331636;331636-adquisicion-equipos-oficina-computacion-aparato-fax-otros-1
331659;331659-adquisicion-leche-polvo-enriquecida-programa-alimentario-nutricional-integral-pani-1
331871;331871-provision-almuerzo-escolar-1
331880;331880-lpn-06-adquisicion-impresoras-multifuncional-1
331945;331945-ampliacion-modernizacion-camara-frigorifica-aisp-ad-referendum-3
332231;332231-adquisicion-separadora-centrifuga-1
332243;332243-adquisicion-ingredientes-almuerzo-escolar-1
332317;332317-adquisicion-impresoras-otros-1
332388;332388-servicios-despachante-aduana-1
332457;332457-demolicion-bloques-construccion-reparacion-aulas-ss-hh-escuelas-ciudad-san-lorenzo-1
332536;332536-provision-almuerzo-escolar-distintas-instituciones-educativas-ciudad-carapegua-1
332565;332565-servicio-comunicacion-e-imagen-1
332689;332689-adquisicion-actualizacion-licencias-comunicacion-bd-virtualizacion-alta-disponibilid-1
332821;332821-servicio-limpieza-locales-unves-ad-referendum-1
332896;332896-adquisicion-textiles-vestuarios-varios-2
332913;332913-adquisicion-medicamentos-1
332938;332938-cd-n-51-2017-servicio-consultoria-empresa-certificadora-sistema-gestion-calidad-iso-1
332943;332943-servicio-limpieza-juzgados-dpto-central-1
333129;333129-mantenimiento-acondicionadores-aire-mdn-1
333227;333227-servicio-produccion-integral-presentaciones-institucionales-1
333240;333240-adquisicion-equipos-informaticos-facultad-derecho-ciencias-sociales-una-1
333275;333275-adquisicion-sistema-circuito-cerrado-cctv-espacios-publicos-ciudad-municipalidad-yat-3
333299;333299-aquisicion-equipos-oficina-mdi-1
333351;333351-adquisicion-mineral-hierro-1
333492;333492-mejoramiento-sistema-nacional-indentificaciones-emision-cedulas-pasaportes-paraguay-1
333497;333497-adquisicion-insumos-cardiocirugia-hemodinamia-contraste-radiologico-e-insumos-varios-1
333530;333530-lpi-1207-2017-mejoramiento-refuerzo-sistema-distribucion-area-metropolitana-distrito-1
333537;333537-adquisicion-equipo-analizador-raman-1
333548;333548-servicio-consultoria-avaluo-inmueble-1
333584;333584-adquisicion-retroexcavadora-minibus-municipal-1
333586;333586-lp1331-17-adquisicion-equipos-informaticos-1
333664;333664-adquisicion-equipos-informaticos-audiovisual-accesorios-licencias-justicia-electoral-1
333711;333711-lpn-nro-01-2017-adquisicion-medicamentos-materiales-equipos-cardiologicos-osteosinte-1
333774;333774-llamado-mopc-n-75-2017-licitacion-publica-nacionalmejoramiento-transitabilidad-camin-1
333782;333782-obra-reparacion-construccion-bloques-aulas-cocinas-sshh-escuelas-ciudad-san-lorenzo-1
333886;333886-contratacion-bienes-servicios-conectividad-local-instituciones-educativas-conexion-1
333908;333908-construccion-laboratorio-11-10-x-10-15-techo-tejas-escuela-basica-n-759-maria-duris-1
333914;333914-adquisicion-productos-alimenticios-1
333922;333922-provision-almuerzo-escolar-ley-fonacide-1
333928;333928-servicio-monitoreo-mantenimiento-fibra-optica-policia-nacional-plurianual-1
333949;333949-contratacion-directa-n-42-2017-adquisicion-carteles-1
333964;333964-lp1335-17-servicio-despachos-aduaneros-modalidad-contrato-abierto-ad-referendum-1
333980;333980-adquisicion-sillas-ruedas-audifonos-muletas-andadores-otros-servicio-social-contrato-1
334086;334086-construccion-laboratorio-biotecnologia-tipo-ii-1
334382;334382-provision-almuerzo-escolar-fonacide-segunda-etapa-1
334383;334383-adquisicion-equipos-informaticos-stp-1
334394;334394-mantenimiento-reparacion-vehiculos-plurianual-1
334583;334583-adquisicion-uniformes-funcionarios-municipalidad-asuncion-2018-1
334593;334593-adquisicion-camionetas-patrulleras-comar-cinae-1
334640;334640-empresas-constructoras-especializadas-obras-viales-contrato-rehabilitacion-mantenimi-1
334716;334716-adquisicion-equipos-electronicos-e-informaticos-1
334720;334720-adquisicion-asfalto-frio-reparaciones-pista-aeropuertos-dinac-1
334816;334816-adquisicion-camionetas-doble-cabina-uso-institucional-1
334843;334843-servicio-limpieza-edificio-central-turista-roga-oficinas-regionales-senatur-misiones-1
334881;334881-adquisicion-alimentos-pacientes-personal-guardia-servicios-salud-area-interior-1
335011;335011-adquisicion-productos-alimenticios-hospital-clinicas-2017-2018-1
335055;335055-refaccion-1-pabellon-3-aulas-sala-profesores-ss-hh-deposito-escuela-basica-n-209-vic-1
335083;335083-adquisicion-equipos-parque-recreativo-gimnasio-aire-libre-3
335087;335087-adquisicion-mobiliarios-escuelas-distrito-jose-domingo-ocampos-1
335296;335296-compra-parque-infantil-juzgado-paz-san-ignacio-1
335369;335369-adquisicion-textos-historia-paraguay-cada-uno-cursos-bachilleratos-cientifico-tecnic-1
335447;335447-construccion-laboratorio-bioseguridad-nsb2a-1
335478;335478-remodelacion-plaza-municipal-distrito-caapucu-1
335514;335514-servicio-fotocopiado-e-impresion-digital-1
335535;335535-servicio-despacho-aduanero-1
335602;335602-adquisicion-mobiliarios-instituciones-educativas-distrito-quiindy-1
335703;335703-adquisicion-parque-infantil-plaza-municipal-1
335739;335739-adquisicion-textiles-vestuarios-varios-adreferendum-1
335798;335798-adquisicion-equipos-oficina-computacion-justicia-electoral-ad-referendum-ampliacion-1
336093;336093-adquisicion-motor-fuera-borda-90-hp-casco-aluminio-administracion-alto-paraguay-1
336128;336128-adquisicion-equipos-repuestos-accesorios-informaticos-snpp-plurianual-ad-referendum-1
336149;336149-c-d-n-14-reparacion-techo-galeria-1
336154;336154-adquisicion-equipos-varios-computacion-en-marco-proyectos-programas-conacyt-adrefere-1
336273;336273-servicio-instalacion-imagen-corporativa-1
336276;336276-adquisicion-plataforma-centralizada-servicios-avanzados-certificacion-digital-subsec-1
336341;336341-construccion-146-viviendas-interes-social-asentamientos-rurales-paraguay-departament-1
336361;336361-servicio-informacion-confidencial-1
336396;336396-servicio-publicacion-periodicos-1
336398;336398-servicio-limpieza-integral-1
336412;336412-construccion-1-aula-tipo-mec-colegio-nacional-john-f-kennedy-1
336419;336419-reparacion-pabellon-escuela-basica-n-1322-madre-salvador-1
336420;336420-reparacion-pabellon-escuela-basica-n-3480-santa-teresa-andes-1
336623;336623-construccion-reparacion-adecuacion-instituciones-educativas-fonacide-plurianual-2017-1
336758;336758-servicios-seguridad-vigilancia-secretaria-nacional-deportes-centro-acuatico-nacional-1
336988;336988-adquisicion-equipos-laboratorio-1
337069;337069-llamado-mopc-n-124-2017-licitacion-publica-nacional-trabajo-puesta-valor-torreon-jes-1
337136;337136-adquisicion-equipamientos-oficinas-registrales-marco-implementacion-registro-unico-1
337206;337206-adquisicion-rituximab-inyectable-bicalutamida-comprimido-msp-bs-1
337255;337255-adquisicion-vehiculos-ad-referendum-1
337277;337277-adquisicion-impresora-confeccion-carnets-ad-referendum-1
337395;337395-adquisicion-computadoras-ad-referendum-1
337401;337401-contratacion-empresa-construccion-obras-complementarias-montaje-sistema-automatizaci-1
337419;337419-servicio-limpieza-edificio-ad-referendum-2018-1
337437;337437-lpi-contratacion-servicios-fiscalizacion-obras-rehabilitacion-mantenimiento-niveles-1
337444;337444-servicio-mantenimiento-equipos-sistemas-ad-referendum-2018-1
337599;337599-adquisicion-atm-incluido-vcs-2
337602;337602-contratacion-cursos-capacitacion-laboral-1
337624;337624-adquisicion-muebles-llamado-plurianual-2017-2018-direccion-general-registro-estado-1
337772;337772-actualizacion-mantenimiento-sistema-integrado-gestion-emergencias-ad-referendum-plur-1
337843;337843-adquisicion-utiles-oficina-toner-cartuchos-1
337870;337870-lpn-sbe-17-adquisicion-sistema-centralizado-video-vigilancia-sector-maxima-seguridad-1
337897;337897-adquisicion-e-instalacion-sistema-deteccion-prevencion-incendios-1
337928;337928-adquisicion-insumos-endoscopia-cirugia-cardiaca-otros-ad-referendum-ampliacion-presu-1
338183;338183-llamado-mopc-n-173-2017-licitacion-publica-nacional-pavimentacion-asfaltica-tramo-j-1
338185;338185-provision-agua-mineral-facultad-derecho-ciencias-sociales-ad-referendum-2018-1
338302;338302-adquisicion-interferon-beta-1-6-000-000-ui-im-hospital-trauma-mspbs-1
338325;338325-servicio-provision-obsequios-protocolares-1
338439;338439-adquisicion-materiales-osteosintesis-1
338522;338522-adquisicion-utiles-papeles-insumos-repuestos-informaticas-sbe-1
338535;338535-provision-almuerzo-escolar-plurianual-ad-refeerendum-1
338647;338647-contratacion-seguros-vehiculos-3
338775;338775-adquisicion-sillas-mesa-pupitres-individuales-instituciones-educativas-distrito-quii-1
338875;338875-contratacion-servicios-provision-almuerzo-escolar-modalidad-catering-1
338979;338979-lpn-119-17-adquisicion-montaje-dispositivos-deteccion-extincion-incendios-autoconten-1
339040;339040-lpn-122-17-adquisicion-insumos-generales-ips-ad-referendum-2018-1
339063;339063-servicio-guarderia-1
339090;339090-adquisicion-repuestos-accesorios-mantenimientos-semaforos-1
339103;339103-provision-e-instalacion-sistema-circuito-cerrado-tv-sede-pedro-j-caballero-ad-refere-1
339151;339151-contratacion-servicios-seguridad-sedes-ministerio-publico-ad-referendum-1
339230;339230-servicios-publicidad-propaganada-1
339249;339249-adquisicion-cadenas-rud-empalmes-garras-fijacion-elevadores-cangilones-sectores-vall-1
339291;339291-contratacion-seguros-medicos-3
339325;339325-adquisicion-insumos-dpto-hemato-oncologia-ad-referendum-2018-1
339394;339394-seguro-vida-personal-militar-ffaa-1
339415;339415-mantenimiento-reparacion-vehiculo-1
339425;339425-servicio-transporte-materia-prima-cantera-trituradora-principal-fca-vallemi-1
339432;339432-lpn-sbe-50-18adquisicion-alimentos-hospital-central-1
339495;339495-adquisicion-cal-hidratada-3
339621;339621-adquisicion-equipos-informaticos-otros-sbe-3
339628;339628-consultoria-ambito-gestion-administrativa-jurisdiccional-1
339669;339669-provision-almuerzo-escolar-instituciones-educativas-distrito-general-artigas-1
339763;339763-reparaciones-generales-hospital-clinicas-facultad-ciencias-medicas-sede-san-lorenzo-1
339791;339791-mantenimiento-reparaciones-menores-vehiculos-institucion-ad-referendum-1
339813;339813-adquisicion-productos-alimenticios-comunidades-indigenas-ad-referendum-1
339833;339833-almuerzo-escolar-escuelas-1
339868;339868-adquisicion-utiles-oficina-1
339883;339883-lpi-1pm-2018-contratacion-servicio-acunacion-provision-monedas-banco-central-paragua-1
339958;339958-servicio-seguridad-vigilancia-ad-referendum-lpn-01-2018-sbe-1
339978;339978-adquisicion-toner-1
339995;339995-adquisicion-pinturas-asfalto-1
340037;340037-seguro-edificio-contenido-1
340101;340101-mantenimiento-equipos-informaticos-1
340210;340210-provision-impresoras-fotocopiadoras-mdp-1
340258;340258-mantenimiento-areas-verdes-sector-norte-aisp-1
340260;340260-adquisicion-almuerzo-escolar-3
340329;340329-adquisicion-insumos-varios-programa-nacional-atencion-pacientes-ostomizados-1
340447;340447-adquisicion-equipos-oficina-1
340460;340460-servicio-limpieza-sede-central-regionales-snpp-plurianual-ad-referendum-1
340480;340480-provision-almuerzo-escolar-1
340533;340533-construccion-cocina-comedor-entidades-educativas-ciudad-capiata-plurianual-3
340602;340602-servicios-mantenimiento-reparaciones-vehiculos-ad-eferendum-1
340859;340859-adquisicion-sistema-videovigilancia-mantenimiento-correctivo-1
340877;340877-provision-almuerzo-escolar-modalidad-catering-1
340877;340877-provision-almuerzo-escolar-modalidad-catering-segundo-llamado-plurianual-3
340916;340916-iluminacion-avenida-convenio-ande-1
341016;341016-llamado-mopc-n-05-2018-licitacion-publica-nacional-subasta-baja-electronica-adquisic-1
341047;341047-adquisicion-textiles-vestuarios-hospital-clinicas-1
341084;341084-servicio-limpieza-inmueble-1
341140;341140-adquisicion-bienes-alimentacion-escolar-1
341156;341156-servicio-limpieza-senave-1
341183;341183-adquisicion-utiles-oficina-productos-papel-carton-e-impresos-varios-ad-referendum-1
341254;341254-lpn-sbe-n-03-18-adquisicion-desayuno-merienda-escolar-plurianual-2018-2019-1
341318;341318-adquisicion-equipos-herramientas-limpieza-1
341326;341326-adquisiccion-equipos-informaticos-1
341350;341350-mopc-n-09-2018-sbe-contratacion-seguro-institucional-mopc-ad-referendum-aprobacion-1
341360;341360-construccion-puente-hormigon-armado-arroyo-poti-y-barrio-espiritu-santo-cambyreta-ba-1
341391;341391-servicios-limpieza-edificios-plurianual-1
341420;341420-adquisicion-medicamentos-e-insumos-hospital-policia-plurianual-1
341427;341427-adquisicion-materiales-seguridad-3
341487;341487-adquisicion-resmas-papel-1
341501;341501-lp1401-18-adquisicion-escaleras-mt-bt-tipo-tijera-aluminio-1
341502;341502-lco997-adquisicion-scanner-e-impresoras-alto-mediano-volumen-estaciones-trabajos-otr-1
341598;341598-adquisicion-mobiliarios-escuelas-1
341685;341685-lp1370-2018-sustitucion-sistema-iluminacion-publica-convencional-tecnologia-led-avda-1
341718;341718-lco993-servicio-mantenimiento-y-o-reparacion-muebles-oficina-1
341766;341766-lp1442-18-ejecucion-trabajos-inherentes-gestion-comercial-ande-hhp2-todo-territorio-1
341931;341931-adquisicion-micromedidores-asuncion-e-interior-1
341956;341956-mantenimiento-reparacion-vehiculos-plurianual-1
342056;342056-c-d-n-12-adquisicion-montaje-parque-infantil-plazas-centrales-1
342164;342164-adquisicion-insumos-impresion-tarjetas-habilitacion-1
342185;342185-lco-8-18-contratacion-seguro-integral-bancario-banco-central-paraguay-1
342307;342307-adquisicion-lubricantes-maquinarias-institucion-1
342377;342377-lpn-n-02-2018-adquisicion-equipos-informaticos-sbe-1
342384;342384-lco-03-contratacion-seguro-vehiculos-1
342388;342388-lpn-02-contratacion-servicio-seguridad-area-perimetral-centros-reclusion-1
342391;342391-mantenimiento-reparacion-vehiculos-livianos-maquinarias-pesadas-motos-desmalezadora-1
342455;342455-c-d-n-03-consultoria-elaboracion-anteproyecto-refaccion-ampliacion-palacete-municipa-1
342530;342530-servicio-almuerzo-escolar-fonacide-1
342588;342588-mantenimiento-moviles-institucionales-1
342624;342624-servicios-mantenimiento-elevadores-1
342701;342701-contratacion-servicio-seguros-varios-plurianual-1
342717;342717-servicio-guardia-seguridad-instituto-trabajo-social-dependiente-rectorado-una-1
342752;342752-adquisicion-muebles-enseres-1
342831;342831-lpn-sbe-68-18-obras-civiles-reparacion-hospital-central-ips-1
342896;342896-lpn-24-2018-mantenimiento-sistema-cctv-control-accesos-rayos-x-1
342903;342903-adquisicion-equipos-varios-laboratorio-marco-proyectos-programas-conacyt-1
342929;342929-lpn-25-2018-contratacion-servicio-seguridad-vigilancia-bcp-1
343001;343001-llamado-mopc-n-68-2018-licitacion-publica-nacional-mejoramiento-rehabilitacion-tramo-1
343036;343036-construccion-bloque-f-laboratorios-aulas-primera-etapa-1
343037;343037-llamado-mopc-n-07-2019-licitacion-publica-nacional-subas-baja-electronica-servicios-1
343055;343055-alquiler-impresoras-fotocopiadoras-mag-plurianual-1
343089;343089-cd-n-85-2018-contratacion-servicios-informes-comerciales-banco-central-paraguay-1
343132;343132-adquisicion-camiones-vehiculos-motos-1
343228;343228-contratacion-polizas-seguros-vehiculos-motocicletas-1
343411;343411-servicio-limpieza-1
343421;343421-provision-almuerzo-escolar-1
343432;343432-adquisicion-equipos-informaticos-facultad-derecho-ciencias-sociales-una-1
343454;343454-construcciones-aula-curuguaty-1
343514;343514-adquisicion-equipos-medicos-rehabilitacion-1
343536;343536-lpn-sbe-52-18-provision-e-instalacion-compresores-libre-aceite-planta-oxigeno-psa-ip-1
343599;343599-contratacion-seguros-edificios-bienes-muebles-vehiculos-equipos-informaticos-comunic-1
343606;343606-servicio-despacho-aduanero-dependencias-mspybs-1
343710;343710-lpn-sbe-n-05-2018-servicio-embalaje-transporte-kits-escolares-plurianual-2018-2019-3
343759;343759-adquisicion-productos-e-impresiones-artes-graficas-rectorado-universidad-nacional-as-1
343769;343769-adquisicion-equipos-informaticos-renovacion-licencias-1
343872;343872-adquisicion-pala-niveladora-arrastre-acoplado-metalico-1
343914;343914-lpn-sbe-n-08-18-adquisicion-equipos-oficina-computacion-2018-2019-1
343948;343948-provision-almuerzo-escolar-escuelas-departamento-1
343962;343962-adquisicion-utensilios-cocina-comedor-1
344038;344038-adquisicion-rajas-1
344115;344115-lco-03-18-provision-almuerzo-escolar-1
344147;344147-adquisicion-maquinas-fumigadoras-senepa-1
344155;344155-mantenimiento-reparacion-transformadores-generadores-1
344210;344210-seguros-petropar-1
344277;344277-servicio-mantenimiento-reparacion-ups-apc-1
344404;344404-servicio-seguridad-vigilancia-1
344640;344640-lpn-sbe-n-04-18-adquisicion-utiles-kits-escolares-2018-2020-1
344652;344652-adquisicion-almuerzo-escolar-1
344681;344681-servicio-limpieza-fumigacion-oficinas-1
344711;344711-adquisicion-servidor-1
344745;344745-adquision-utiles-oficina-1
344827;344827-adquisicion-de-muebles-enseres-atencion-primaria-salud-1
344848;344848-servicio-monitoreo-mantenimiento-enlaces-fibra-optica-provision-equipamiento-infraes-1
344922;344922-adquisicion-equipos-informaticos-1
344988;344988-servicio-limpieza-sede-central-museo-mades-1
345049;345049-contratacion-seguros-cobertura-responsabilidad-civil-infraestructura-aeroportuaria-1
345187;345187-construccion-plataforma-aisp-1
345334;345334-mantenimientos-reparaciones-acondicionadores-aire-1
345356;345356-adquisicion-equipos-informaticos-1
345371;345371-servicio-limpieza-juzgados-dpto-central-1
345382;345382-adquisicion-equipos-comunicacion-oficina-computacion-varios-1
345395;345395-adquisicion-almuerzo-escolar-instituciones-educativas-municipio-1
345447;345447-adquisicion-equipos-oficina-1
345528;345528-adquisicion-utiles-oficina-e-insumos-remas-papel-e-impresos-gdc-3
345551;345551-provision-almuerzo-escolar-escuelas-departamento-guaira-plurianual-1
345560;345560-adquisicion-leche-fluida-complemento-nutricional-escuelas-departamento-guaira-1
345567;345567-adquisicion-compactador-rodillo-vibratorio-liso-kit-pata-cabra-o-pata-cabra-liso-mun-1
345580;345580-provision-almuerzo-escolar-1
345599;345599-adquisicion-alimentos-solidos-complemento-nutricional-escuelas-departamento-guaira-1
345716;345716-adquisicion-mobiliarios-sillas-instituciones-educativas-1
345802;345802-adquisiscion-equipos-informaticos-1
345997;345997-construccion-aulas-sanitarios-pistas-multiuso-comedores-refacciones-ano-2018-1
346033;346033-provision-pasajes-aereos-nacionales-e-internacionales-1
346098;346098-mantenimiento-data-center-oficinas-tipo-contenedor-equipos-informaticos-cabeceras-de-1
346277;346277-adquisicion-poliza-seguro-vehiculos-institucion-1
346372;346372-mantenimiento-reparacion-vehiculos-1
346421;346421-adquisicion-equipos-computacion-1
346517;346517-servicio-aseo-limpieza-fumigacion-edificio-1
346520;346520-mantenimiento-reparaciones-terminal-portuaria-portuaria-chaco-i-1
346524;346524-mantenimiento-reparaciones-terminal-portuaria-ciudad-este-1
346566;346566-mantenimiento-reparacion-vehiculos-cjc-plurianual-1
346711;346711-servicios-mantenimientos-reparaciones-menores-vehiculos-plurianual-1
346797;346797-adquisicion-medicamentos-varios-desinfectantes-msp-bs-plurianual-1
346876;346876-contratacion-servicios-medicos-sanatoriales-snpp-plurianual-ad-referendum-1
346972;346972-construccion-cerco-perimetral-facultad-ciencias-veterinarias-universidad-nacional-as-1
347158;347158-lpn-03-adquisicion-medicamentos-e-insumos-hospitalarios-odontologicos-1
347334;347334-adquisicion-tintas-toner-1
347448;347448-adquisicion-mezcla-asfaltica-frio-1
347455;347455-servicio-comedor-funcionarios-petropar-1
347587;347587-construccion-pabellon-comlog-ad-referendum-1
347630;347630-adquisicion-mobiliarios-instituciones-educativas-1
347908;347908-provision-almuerzo-escolar-escuelas-municipio-nueva-italia-fonacide-1
347950;347950-ampliacion-aeropuerto-internacional-silvio-pettirossi-espigon-norte-1
348023;348023-adquisicion-toner-tintas-elementos-oficina-plurianual-2018-2019-1
348074;348074-microseguro-social-exclusivo-participantes-programa-tekopora-secretaria-accion-socia-3
348095;348095-servicio-reparacion-asistencia-tecnica-equipos-electricos-electronicos-vallemi-ville-1
348175;348175-adquisicion-almuerzo-escolar-instituciones-educativas-ciudad-1
348203;348203-provision-almuerzo-escolar-fonacide-1
348209;348209-adquisicion-microscopio-electronico-barrido-accesorios-laboratorio-proyectos-financi-1
348281;348281-provision-almuerzo-escolar-modalidad-cocinando-instituciones-educativas-1
348455;348455-adquisicion-filtros-vehiculos-1
348491;348491-c-d-n-20-adquisicion-montaje-parque-infantil-adquisicion-tottem-electronico-3
348492;348492-adquisicion-equipos-informaticos-1
348498;348498-adquisicion-textos-consulta-especialidades-tecnicas-educacion-media-items-declarados-1
348512;348512-servicio-provision-arreglos-florales-1
348529;348529-lpn-sbe-92-18-contratacion-servicios-mantenimiento-reparacion-vehiculos-propiedad-ip-1
348542;348542-lpn-88-18-ampliacion-refaccion-hospital-luque-1
348545;348545-contratacion-servicios-limpieza-sedes-asuncion-contrato-plurianual-1
348559;348559-adquisicion-contenedores-accesorios-1
348565;348565-servicio-seguridad-edificio-misiones-jesuiticas-jesus-tavarangue-oficina-regional-pi-1
348577;348577-licitacion-publica-nacional-trabajos-restauracion-puesta-valor-estacion-ferrocarril-1
348596;348596-adquisicion-uniforme-funcionarios-petropar-1
348731;348731-adquisicion-alimentos-preparacion-almuerzo-cena-escolar-departamento-boqueron-1
348895;348895-adquisicion-almuerzo-escolar-plurianual-2018-2019-1
348926;348926-adquisicion-complemento-nutricional-escuelas-departamento-boqueron-1
348937;348937-contratacion-mano-obra-tercerizada-despacho-cemento-bolsas-tercer-turno-embolsadora-1
349010;349010-construccion-aulas-banos-fonacide-1
349017;349017-adquisicion-mobiliarios-escolares-1
349023;349023-servicio-mantenimiento-reparacion-impresoras-fotocopiadoras-escaner-1
349029;349029-adquisicion-medicamentos-e-insumos-cubrir-necesidades-pnd-1
349042;349042-adquisicion-equipos-electronicos-e-informaticos-1
349106;349106-construccion-aulas-comedores-escolares-instituciones-publicas-itaugua-1
349228;349228-adquisicion-almuerzo-escolar-instituciones-educativas-carlos-antonio-lopez-1
349389;349389-construccion-2-aulas-escuela-basica-n-7985-san-antonio-1
349422;349422-adquisicion-mobiliario-escolar-instituciones-educativas-carmen-parana-1
349566;349566-recapado-calles-microcentro-ciudad-san-lorenzo-ad-referendum-plurianual-1
349610;349610-lpn-08-adquisicion-alimentos-personas-privadas-libertad-1
349685;349685-adquisicion-medicamentos-1
349763;349763-adquisicion-precintos-1
349767;349767-adquisicion-cubiertas-vehiculos-maquinarias-1
349803;349803-adquisicion-impresoras-snpp-1
349828;349828-adquisicion-equipo-lector-analisis-forense-documentos-viaje-billetes-video-espectro-3
349846;349846-provision-almuerzo-escolar-1
349873;349873-adquisicion-almuerzo-escolar-instituciones-educativas-distrito-san-jose-arroyos-1
349874;349874-adquisicion-simuladores-maquinas-pesadas-snpp-ad-referendum-1
349928;349928-lp1414-18-construccion-nuevo-alimentador-media-tension-par-05-subestacion-paraguari-1
350085;350085-servicio-seguridad-vigilancia-1
350142;350142-llamado-n-70-2018-licitacion-publica-nacional-provision-pinturas-microesferas-1
350186;350186-suministro-trasporte-entrega-servicio-desayuno-merienda-escolar-ad-referendum-1
350355;350355-adquisicion-pet-coke-petroleo-1
350370;350370-contratacion-servicio-impresiones-encuadernaciones-otros-aisp-1
350549;350549-servicios-seguridad-privada-bnf-sbe-1
350683;350683-adquisicion-sistema-seguridad-1
350686;350686-adquisicion-cubiertas-camaras-aire-municipalidad-encarnacion-1
350754;350754-llamado-52-2018-licitacion-publica-nacional-servicio-consultoria-desarrollo-proyecto-1
350808;350808-construccion-cercado-perimetral-refaccion-vivienda-ampliacion-taller-gobernacion-dep-1
350851;350851-lp1392-18-ejecucion-trabajos-mejoras-mantenimiento-red-electrica-territorio-nacional-1
350864;350864-construccion-aula-preescolar-5-80x6-80-techo-tejas-escuela-basica-n-7-604-6-junio-1
350890;350890-adquisicion-hojas-seguridad-certificados-repatriacion-1
350943;350943-cd-6330-servicio-reparacion-motores-marca-cummins-vehiculos-especiales-flota-ande-1
350944;350944-lpn-sbe-121-18-adquisicion-medicamento-bevacizumab-asegurados-ips-1
351006;351006-servicio-consultoria-desarrollo-software-soporte-mantenimiento-siare-1
351008;351008-servicio-consultoria-auditoria-gestion-empresas-publicas-1
351065;351065-contratacion-directa-n-56-2018-id-n-351065-adquisicion-toldos-1
351260;351260-adquisicion-equipos-informaticos-congreso-nacional-1
351292;351292-provision-almuerso-escolar-modalidad-cocinando-escuela-1
351389;351389-lco-12-contratacion-servicio-consultoria-elaboracion-estudio-ambiental-proyecto-adec-1
351470;351470-adquisicion-planta-procesadora-oxigeno-hospital-pediatrico-municipal-1
351589;351589-adquisicion-productos-alimenticios-personas-animales-plurianual-1
351652;351652-adquisicion-camionetas-1
351673;351673-adquisicion-parque-infantil-1
351820;351820-contratacion-servicio-limpieza-integral-aisp-1
351861;351861-adquisicion-maquinarias-equipos-1
351958;351958-llamado-mopc-n-80-2018-licitacion-publica-nacional-obras-mejoramiento-rehabilitacion-1
351986;351986-construccion-aula-colegio-nacional-santa-librada-3
352098;352098-lpn-11-mantenimiento-reparacion-flota-vehiculos-ministerio-justicia-1
352177;352177-lpn-sbe-53-18-contratacion-servicios-hemodialisis-hospital-regional-ciudad-este-ips-1
352199;352199-adquisicion-utensilios-cocina-comedor-1
352276;352276-adquisicion-platos-frescos-programa-almuerzo-escolar-anos-2019-2020-ad-referendum-pl-1
352277;352277-adquisicion-bienes-programa-merienda-escolar-gobernacion-misiones-anos-2019-2020-ad-1
352280;352280-construccion-vereda-escuela-bas-n-292-prof-eva-maria-silva-oviedo-tercer-cuarto-tram-1
352281;352281-adquisicion-muebles-enseres-1
352351;352351-adquisicion-fotocopiadoras-1
352401;352401-servicio-limpieza-dependencias-mtess-1
352501;352501-lpn-sbe-12-adquisicion-textiles-vestuarios-1
352537;352537-adquisicion-productos-alimenticios-plurianual-1
352543;352543-servicios-limpieza-oficinas-mag-1
352613;352613-adquisicion-textiles-vestuarios-varios-ad-referendum-1
352718;352718-adquisicion-omnibus-1
352947;352947-lpn-sbe-n-155-18-contratacion-servicios-pet-ct-pacientes-cancer-ips-1
352986;352986-adquisicion-formulas-nutricionales-1
352994;352994-contratacion-servicio-seguro-bienes-1
353040;353040-adquisicion-merienda-escolar-instituciones-educativas-publicas-departamento-central-1
353103;353103-mantenimiento-reparaciones-terminal-portuaria-jose-a-falcon-1
353142;353142-adquisicion-armas-reglamentarias-policia-nacional-1
353169;353169-adquisicion-insumos-hemodinamia-2018-2019-1
353187;353187-servicio-mantenimiento-reparacion-vehiculos-1
353357;353357-provision-montaje-puesto-distribucion-transformador-tipo-pedestal-315-kva-ampliacion-1
353419;353419-adquisicion-e-instalacion-aire-acondicionado-1
353486;353486-construccion-bloque-cocina-comedor-estructura-metalica-escuela-basica-n-7875-maria-1
353490;353490-l-p-n-n-02-2018-provision-almuerzo-escolar-modalidad-alimentos-preparados-escuelas-1
353564;353564-adquisicion-productos-alimenticios-1
353565;353565-adquisicion-textiles-vestuarios-ad-referendum-1
353684;353684-mantenimiento-reparacion-vehiculos-senave-plurianual-1
353709;353709-adquisicion-equipos-informaticos-1
353733;353733-adquisicion-barrera-estacionamiento-aisp-1
353795;353795-adquisicion-muebles-oficina-1
353889;353889-adquisicion-agua-mineral-botellones-1
353983;353983-servicio-auditoria-externa-contable-financiera-gestion-senatur-1
354177;354177-servicios-limpieza-sbe-1
354432;354432-servicio-guardias-seguridad-plurianual-1
354556;354556-servicio-recoleccion-transporte-disposicion-final-residuos-patologicos-ad-referendum-1
354829;354829-construccion-1-un-aula-escuela-basica-2050-virgen-caacupe-compania-fleitas-cue-1
354833;354833-construccion-bano-sexado-techo-tejas-sshh-4-00-x-6-15-escuela-basica-2054-dr-jose-ga-1
354909;354909-servicio-jardineria-1
355164;355164-contratacion-seguro-exceso-gastos-medicos-afiliados-caja-bancaria-1
355420;355420-adquisicion-almuerzo-natural-distintas-instituciones-educativas-departamento-alto-pa-1
355566;355566-seguro-vehiculo-1
356860;356860-seguro-vehiculos-ad-referendum-1
357517;357517-almuerzo-escolar-fonacide-1
