anio;slug;estado;rescision
2014;270223-leongino-mendoza-mino-3;CAN;null
2014;281117-consorcio-ica-asociada-1;CAN;null
2014;266720-laura-maria-arana-riquelme-3;CAN;null
2014;266034-in-desing-s-r-l-10;CAN;null
2014;266034-instrumaq-s-a-11;CAN;null
2014;272732-impresos-sa-1;CAN;null
2014;272033-gestion-empresarial-1;CAN;null
2014;267394-guardian-s-a-1;CAN;null
2014;279624-roldan-lopez-ramona-rosalba-257;ANU;null
2014;279943-pedro-isasi-martinez-81;CAN;null
2014;275785-jose-paul-godoy-rodriguez-1;CAN;null
2014;276678-guido-antero-nunez-fleitas-1;CAN;null
2014;279026-neotek-s-a-1;CAN;null
2014;267537-cerebro-s-a-1;CAN;null
2014;284285-elvio-manuel-valiente-maluf-1;CAN;null
2014;278085-diego-joaquin-rodriguez-barrios-1;CAN;null
2014;277646-pegasus-s-a-empresa-constructora-1;CAN;null
2014;272201-jose-figueredo-falcon-8;CAN;null
2014;276184-s-a-c-i-h-petersen-3;CAN;null
2014;266720-heidecom-sociedad-anonima-2;CAN;null
2014;277683-carlos-alberto-holtzberger-zapattini-1;CAN;null
2014;278465-argon-s-r-l-11;CAN;null
2014;280235-celso-vera-riveros-1;CAN;null
2014;278465-fai-optical-center-s-a-11;CAN;null
2014;283488-comtel-sociedad-anonima-1;CAN;null
2014;273229-office-compu-sa-7;CAN;null
2014;274335-asuncion-comunicaciones-s-a-1;CAN;null
2014;268718-nelson-daniel-maldonado-galeano-6;CAN;null
2014;282919-sonia-beatriz-maidana-martinez-1;CAN;null
2014;270307-consorcio-saad-nunez-1;CAN;null
2014;272749-neumaticos-asuncion-srl-2;CAN;null
2014;269382-haydee-maria-bordon-rodas-3;CAN;null
2014;268984-karenina-victoria-troncoso-1;CAN;null
2014;274173-geminis-industrial-comercial-s-a-2;CAN;null
2014;272774-aldo-javier-godoy-arellano-1;CAN;null
2014;278111-rrg-seguridad-privada-integral-s-a-3;CAN;null
2014;275236-servicio-electromedico-profesional-s-a-sempro-3;CAN;null
2014;272741-docunet-sa-4;CAN;null
2014;269025-martinez-hermanos-s-r-l-18;CAN;null
2014;269025-golden-trade-s-r-l-16;CAN;null
2014;274645-avalon-s-a-5;CAN;null
2014;277961-dental-center-sa-2;CAN;null
2014;274431-telma-celina-villasboa-1;CAN;null
2014;251370-ocho-s-a-10;CAN;null
2014;266005-neotek-s-a-1;CAN;RES
2014;276375-maria-estela-moreno-insaurralde-1;CAN;null
2014;282920-la-comercial-asuncena-s-r-l-6;CAN;null
2014;273563-confortec-srl-1;CAN;null
2014;269117-e-mage-s-a-6;CAN;null
2014;274041-paolo-alexander-allende-jara-1;CAN;null
2014;281386-parasoft-s-r-l-1;CAN;null
2014;270073-juan-carlos-salazar-yaryes-3;CAN;RES
2014;283312-vtg-s-r-l-1;CAN;null
2014;275399-guido-antero-nunez-fleitas-6;CAN;null
2014;275417-euroquimica-s-a-61;CAN;null
2014;275162-hugo-ramon-valdez-garcete-8;CAN;null
2014;273529-diego-orlando-canete-bareiro-1;CAN;null
2014;269382-spare-part-srl-2;CAN;null
2014;270073-ritter-construcciones-srl-4;CAN;RES
2014;270073-consorcio-urbatec-5;CAN;RES
2014;280561-martina-munoz-rodas-2;CAN;null
2014;267389-vendors-sa-1;CAN;null
2014;279624-riveros-lobos-salvadora-206;ANU;null
2015;291418-yeny-elizabeth-yambay-2;CAN;null
2015;287998-blanca-gissell-fernandez-franco-1;CAN;RES
2015;287998-blanca-gissell-fernandez-franco-1;CAN;RES
2015;292569-romero-villalba-francisca-solana-5;CAN;null
2015;288720-dykal-s-a-2;CAN;null
2015;292496-juan-godoy-caballero-1;CAN;RES
2015;286212-docunet-sa-1;CAN;null
2015;292662-logicalis-paraguay-s-a-1;CAN;null
2015;285411-universidad-catolica-nuestra-senora-asuncion-1;CAN;null
2015;292044-p-m-y-a-s-a-6;CAN;null
2015;295385-pinheiro-pinheiro-asociados-srl-1;CAN;null
2015;293566-pole-s-a-3;CAN;null
2015;289895-limpiezas-modernas-paraguayas-s-r-l-1;CAN;null
2015;295361-tecnologia-electronica-e-informatica-sa-t-e-i-s-a-1;CAN;null
2015;290068-crispin-ruffinelli-fernandez-1;CAN;null
2015;292930-ricsofan-s-a-1;CAN;null
2015;293174-automotor-sa-1;CAN;null
2015;301556-heinz-dieter-maassen-1;CAN;null
2015;293597-venser-srl-2;CAN;RES
2015;288039-know-how-s-a-1;CAN;null
2015;298228-ricardo-gonzalez-2-68;CAN;null
2015;287993-jorge-andres-ojeda-riveros-1;CAN;null
2015;290286-rudi-anton-bukaczek-estepa-2;CAN;null
2015;287034-anibal-salvador-centurion-arzamendia-1;CAN;null
2015;291953-inic-s-r-l-8;CAN;null
2015;300939-rena-s-a-1;CAN;null
2015;285176-gertrudis-blasia-snead-alvarez-1;CAN;null
2015;300085-eliseo-hilario-gomez-romero-1;CAN;null
2015;293638-de-sobera-hnos-saic-emisora-capital-abierto-1;CAN;null
2015;301579-cb-construcciones-s-a-3;CAN;null
2015;289391-comtel-sociedad-anonima-1;CAN;null
2015;298247-telef-celular-paraguay-sa-telecel-sa-1;CAN;null
2015;296921-importex-s-a-1;CAN;null
2015;289927-vidal-ambrosio-melgarejo-torales-1;CAN;null
2015;296452-bullers-sociedad-anonima-1;CAN;null
2015;287178-fausto-santiago-encina-cabral-4;CAN;null
2015;299673-maria-nidia-silva-coronel-3;CAN;null
2015;297939-fabiola-s-a-1;CAN;null
2015;297612-carvaz-electronica-e-informatica-2;CAN;null
2015;297612-nelson-daniel-maldonado-galeano-3;CAN;null
2015;295118-oli-service-srl-3;CAN;null
2015;294440-docunet-sa-1;CAN;null
2015;288302-miguel-augusto-amarilla-barrios-1;CAN;null
2015;292283-antonio-ramon-fernandez-alfonso-1;CAN;null
2015;296813-setac-s-r-l-1;CAN;null
2015;295118-carlos-alberto-holtzberger-zapattini-2;CAN;null
2015;293213-pegasus-s-a-empresa-constructora-1;CAN;null
2015;301578-progen-s-a-3;CAN;null
2015;301578-cb-construcciones-s-a-2;CAN;null
2015;299673-constructora-neembucu-s-r-l-2;CAN;null
2015;301189-indufar-c-i-s-a-3;CAN;null
2015;301579-progen-s-a-2;CAN;null
2015;290917-carlos-alberto-holtzberger-zapattini-1;CAN;null
2015;297664-jose-manuel-dominguez-cicorio-1;CAN;null
2015;298829-gerardo-rolando-arevalos-duarte-2;CAN;null
2015;298248-estudio-jariton-sa-1;CAN;null
2015;295275-guardian-s-a-1;CAN;null
2015;288966-anibal-javier-pangrazio-arrigo-1;CAN;null
2015;300925-ricardo-gonzalez-2-1;CAN;null
2015;287009-ferreteria-internacional-s-a-1;CAN;null
2015;297665-mariela-carolina-molas-samudio-5;CAN;null
2015;297665-san-alfredo-s-r-l-4;CAN;null
2015;288650-cafe-corner-s-r-l-1;CAN;null
2015;292009-time-s-r-l-1;CAN;null
2015;297628-estudio-jariton-sa-2;CAN;null
2015;287631-grafica-editorial-intersudamericana-s-a-1;CAN;null
2015;284965-jose-milciades-quintana-1;CAN;RES
2015;286569-mario-ruben-insfran-aquino-1;CAN;null
2015;290033-las-rosas-s-a-inmuebles-1;CAN;null
2016;320775-oli-service-srl-3;CAN;null
2016;304477-derlis-francisco-ramon-mencia-vera-1;CAN;null
2016;319892-gustavo-mariano-garcia-flores-1;CAN;null
2016;310437-emprendimientos-hoteleros-3;CAN;null
2016;319918-grupo-sertec-sociedad-anonima-1;CAN;null
2016;303448-lourdes-elizabeth-gimenez-bareiro-7;CAN;null
2016;319418-almac-generales-depos-columbia-s-a-almac-columbia-s-a-1;CAN;null
2016;313738-carvaz-electronica-e-informatica-1;CAN;null
2016;313190-edson-henrique-dos-santos-1;CAN;null
2016;309900-rodriguez-hnos-s-r-l-1;CAN;null
2016;315104-pedro-esteban-delvalle-servin-1;CAN;null
2016;303466-dan-kar-sa-2;CAN;null
2016;310104-grupo-santa-fe-s-a-1;CAN;null
2016;307775-blanca-teodolina-marin-riquelme-1;CAN;null
2016;306481-prosegur-paraguay-s-a-1;CAN;null
2016;319908-cotebras-s-a-1;CAN;null
2016;310278-office-compu-sa-6;CAN;null
2016;306909-telma-celina-villasboa-3;CAN;null
2016;309373-oscar-tomas-benitez-gonzalez-1;CAN;null
2016;317469-distribuidora-yoyo-gavila-n-s-r-l-1;CAN;null
2016;318971-estudio-jariton-sa-1;CAN;null
2016;301571-parasur-sa-11;CAN;null
2016;302754-grafica-monarca-s-r-l-1;CAN;null
2016;318409-hpti-sistemas-equipamientos-s-a-1;CAN;null
2016;314601-jorge-daniel-guerrero-aranda-2;CAN;null
2016;302118-distribuidora-ypacarai-sa-3;CAN;null
2016;303602-hijos-dona-julia-s-a-1;CAN;null
2016;306920-induclor-srl-3;CAN;null
2016;313530-juan-carlos-sanchez-baez-1;CAN;null
2016;317551-high-med-paraguay-s-a-1;CAN;null
2016;304075-gustavo-adolfo-leiva-5;CAN;null
2016;310384-perez-ramirez-cia-s-a-c-2;CAN;null
2016;314844-lauro-nestor-penayo-cabrera-1;CAN;null
2016;320775-michel-cristiano-gibbert-lenke-2;CAN;null
2016;304475-engracia-zarate-servian-1;CAN;null
2016;318426-hard-soft-s-a-4;CAN;null
2016;316864-compania-comercial-paraguay-sa-6;CAN;null
2016;316720-drei-asociados-s-r-l-8;CAN;null
2016;316720-metalcar-sa-10;CAN;null
2016;313281-juan-carlos-espinola-ayala-1;CAN;null
2016;319755-promec-srl-1;CAN;null
2016;319827-alfa-omega-s-a-1;CAN;null
2016;319893-m-m-ingenieria-arquitectura-srl-1;CAN;null
2016;314298-office-clip-s-r-l-6;CAN;null
2016;306847-victor-esteban-szostak-zayas-1;CAN;null
2016;308059-moises-lezcano-nunez-4;CAN;null
2016;303228-ramon-gonzalez-escurra-1;CAN;null
2016;301733-estudio-jariton-sa-6;CAN;null
2016;294170-fire-master-srl-1;CAN;null
2016;300299-silvia-bordon-pereira-10;CAN;null
2016;302022-jose-luis-carrillo-1;CAN;null
2016;307470-antonio-ruiz-1;CAN;null
2016;312714-miguel-angel-parcerisa-boyer-1;CAN;null
2016;289945-sergio-daniel-licitra-demestri-5;CAN;null
2016;289945-beltrom-sa-4;CAN;null
2016;301567-jose-luis-carrillo-7;CAN;null
2016;303293-rodolfo-ramon-villalba-almada-3;CAN;null
2016;301634-victor-julian-ayala-perdomo-1;CAN;null
2016;319764-blanca-nieves-rodriguez-braun-1;CAN;null
2016;308266-infocenter-s-a-1;CAN;null
2016;310323-consultora-ingenieria-alto-paraguay-sociedad-anonima-1;CAN;null
2016;310278-zunilda-elisa-couchonal-dos-santos-8;CAN;null
2016;289945-manufactura-pilar-sa-3;CAN;null
2016;317498-telef-celular-paraguay-sa-telecel-sa-1;CAN;RES
2017;319068-norberto-araujo-1;CAN;null
2017;332661-francisco-sabino-rotela-lopez-1;CAN;null
2017;326379-parquet-asociados-1;CAN;null
2017;331355-sda-paraguay-sa-7;CAN;null
2017;333933-isabel-petrona-gomez-cabrera-1;CAN;null
2017;329539-mafara-sa-1;CAN;null
2017;333530-sinohydro-corporation-limited-5;CAN;null
2017;332744-don-rey-sociedad-anonima-1;CAN;RES
2017;337839-information-technology-consulting-support-sociedad-anonima-2;CAN;null
2017;324381-geminis-industrial-comercial-s-a-9;CAN;null
2017;329985-copel-s-a-3;CAN;null
2017;331355-sda-paraguay-sa-5;CAN;null
2017;323990-nazareno-comercial-e-industrial-srl-9;CAN;null
2017;322958-nunila-maria-aponte-cardenas-1;CAN;null
2017;324011-habitar-arquitectura-emprendimientos-inmobiliarios-srl-1;CAN;null
2017;328833-medi-plan-s-a-1;CAN;null
2017;320208-almacenamiento-distribucion-asfaltos-s-a-4;CAN;null
2017;324919-compugraf-informatica-5;CAN;null
2017;326067-consorcio-zbc-1;CAN;null
2017;334383-atenas-s-r-l-1;CAN;null
2017;320097-corporacion-agartha-1;CAN;null
2017;336093-naves-s-a-1;CAN;null
2017;337181-samaja-s-a-1;CAN;null
2017;328840-de-sobera-hnos-saic-emisora-capital-abierto-1;CAN;null
2017;335447-tecnoedil-s-a-constructora-1;CAN;null
2017;316756-cdd-construcciones-s-a-1;CAN;null
2017;323002-aseguradora-este-s-a-seguros-4;CAN;null
2017;322554-corporacion-glo-mar-sociedad-anonima-13;CAN;RES
2017;330653-oura-s-r-l-1;CAN;null
2017;319072-dezeta-s-a-44;CAN;null
2017;319072-falcon-com-ind-s-r-l-28;CAN;null
2017;322591-ramon-gonzalez-escurra-1;CAN;null
2017;327566-automotor-sa-3;CAN;null
2017;323402-rieder-cia-saci-2;CAN;null
2017;327473-winner-s-r-l-1;CAN;null
2017;330177-disab-sudamericana-s-a-1;CAN;null
2017;310093-office-clip-s-r-l-9;CAN;RES
2017;330620-caraguatay-s-a-1;CAN;null
2017;322766-alternative-s-a-2;CAN;null
2017;337145-casa-sao-paulo-s-a-1;CAN;null
2017;338115-margarita-s-print-srl-2;CAN;null
2017;316773-lucio-martinez-sotelo-1;CAN;null
2017;322618-dario-velazquez-godoy-1;CAN;null
2017;324848-disal-paraguay-srl-1;CAN;RES
2017;323785-molman-s-a-13;CAN;null
2017;336379-va-ctor-jesa-s-ga-mez-corrales-1;CAN;null
2017;323283-industria-paraguaya-cobre-s-a-inpaco-4;CAN;null
2017;328391-electronica-industrial-especializada-e-i-e-s-r-l-1;CAN;null
2017;329008-nelson-federico-segovia-azucas-1;CAN;null
2017;322766-jose-maria-vanni-3;CAN;null
2017;307830-nestor-antonio-gonzalez-ortiz-3;CAN;null
2017;321242-britam-s-a-1;CAN;null
2017;326573-parasoft-s-r-l-5;CAN;null
2017;329546-francisco-sabino-rotela-lopez-3;CAN;null
2017;323293-montoya-asociados-s-r-l-1;CAN;null
2017;329069-juan-carlos-zuccolillo-galli-1;CAN;null
2017;337144-marcelo-addario-pavon-1;CAN;null
2017;326571-britam-s-a-1;CAN;null
2017;331037-everest-ingenieria-s-r-l-4;CAN;null
2017;321331-ingenieria-tecnica-especializada-sa-1;CAN;RES
2017;330455-hugo-marcelo-tores-saavedra-1;CAN;null
2017;328206-diego-guillermo-franco-vargas-1;CAN;null
2017;323253-master-soft-srl-7;CAN;null
2017;322240-cosmos-tours-srl-1;CAN;null
2017;328356-b-h-services-s-r-l-1;CAN;null
2017;329546-marcos-antonio-lopez-garcia-2;CAN;null
2017;337324-oscar-penayo-bogado-1;CAN;null
2017;336115-victor-pascual-costanzo-scavone-6;CAN;null
2017;325184-office-clip-s-r-l-4;CAN;RES
2017;333602-automotor-sa-1;CAN;null
2017;335323-victor-ariel-bogado-scholler-1;CAN;null
2017;332940-inatec-srl-ind-nacional-aditivos-tec-construccion-1;CAN;null
2017;315200-charpentier-srl-12;CAN;null
2017;336221-everest-ingenieria-s-r-l-2;CAN;RES
2017;330409-data-lab-sa-1;CAN;null
2018;350864-raquel-esmilse-coronel-larrosa-1;CAN;null
2018;355169-ferreteria-agro-verde-s-a-1;CAN;null
2018;322246-h-b-trading-s-a-6;CAN;null
2018;341029-hakim-cia-sociedad-anonima-1;CAN;null
2018;348371-sofia-e-segovia-almiron-1;CAN;null
2018;355441-tape-ruvicha-sa-emisora-capital-abierto-18;CAN;null
2018;355441-automotores-maquinaria-25;CAN;null
2018;355441-irigoitia-representaciones-e-importaciones-maquinarias-sociedad-anonima-irimaq-s-19;CAN;null
2018;355441-ferreteria-industrial-srl-20;CAN;null
2018;355441-hidraulica-brasil-s-a-23;CAN;null
2018;355441-proyec-sa-22;CAN;null
2018;355441-cathay-s-a-21;CAN;null
2018;355441-de-sobera-hnos-saic-emisora-capital-abierto-24;CAN;null
2018;355441-s-a-c-i-h-petersen-26;CAN;null
2018;349730-distribuidora-policlinica-s-a-8;CAN;null
2018;348366-nelly-concepcion-mussi-becker-1;CAN;null
2018;348184-orbis-servicios-utilidades-1;CAN;RES
2018;348184-orbis-servicios-utilidades-1;CAN;RES
2018;348959-carlos-gabriel-sanchez-sartorio-1;CAN;null
2018;342046-nicolas-chase-rodriguez-1;CAN;null
2018;346220-ing-roberto-rodriguez-arias-1;CAN;null
2018;339743-falcon-com-ind-s-r-l-1;CAN;null
2018;340877-dijkstra-servicios-sociedad-anonima-1;CAN;RES
2018;345313-sergio-daniel-calonga-nunez-1;CAN;null
2018;350877-maria-nidia-silva-coronel-1;CAN;null
2018;338014-ytalo-rafael-centurion-1;CAN;null
2018;342333-nelida-aidee-mendoza-ruffinelli-5;CAN;null
2018;347185-juan-carlos-zuccolillo-galli-1;CAN;null
2018;346589-jet-trade-electrodomesticos-s-a-2;CAN;null
2018;350683-diego-joaquin-rodriguez-barrios-1;CAN;null
2018;347279-nelson-daniel-maldonado-galeano-1;CAN;null
2018;345643-gustavo-adolfo-leiva-1;CAN;null
2018;346251-evelyn-marlene-kisser-pioch-1;CAN;null
2018;348944-hector-martin-molinas-1;CAN;null
2018;348242-sixto-javier-vargas-romero-1;CAN;null
2018;329133-megga-imp-exp-sociedad-anonima-2;CAN;null
2018;340319-jorge-daniel-arguello-aquino-1;CAN;RES
2018;339403-cristino-luis-garcia-ocampos-1;CAN;null
2018;336872-telma-celina-villasboa-1;CAN;null
2018;344525-faxcomtel-srl-1;CAN;null
2018;344652-keops-group-s-a-1;CAN;null
2018;339791-virginia-defrancesco-acosta-2;CAN;null
2018;339868-brigida-antonia-fernandez-mayeregger-1;CAN;null
