<svg width="177" height="74" viewBox="0 0 177 74" fill="none" xmlns="http://www.w3.org/2000/svg">
<path d="M62.2011 17.909C66.602 11.0521 69 3 69 3C69 3 48.6016 7.84532 36.6006 9.05311C24.5996 10.2609 6.19881 11.0521 6.19881 11.0521L3 19.5195H10.2001L13.4002 30.3896H5.40004L10.2001 40.8571H15.4002L19.8003 58.5714L43.4008 63L31.8005 39.6493H39.4007L45.0008 31.1948H28.2005L24.2004 19.5195H37.0006L33.8014 23.144C35.2681 24.7544 39.4015 29.0476 40.2015 29.1818C41.0015 29.316 55.801 21.8008 62.2011 17.909Z" fill="white" stroke="black" stroke-width="4" stroke-miterlimit="4.13357"/>
<path d="M48.1143 18.0817L43.4665 33.2012C69.5 21.5 122.963 18.6812 88.5504 35.0912C85 37 32.5 55 27.6639 56.8255L22.0865 71C24.5 70.5 108.207 62.4558 142 69.5826L136.888 58.2429L123.874 46.9033H102.959L106.212 52.1006L88.5504 52.1006C91.5 48.5 151.296 16.6646 122.944 10.5223C94.5926 4.38002 73.8635 10.4514 48.1143 18.0817Z" fill="#58A4B0" stroke="black" stroke-width="4" stroke-miterlimit="4.13357"/>
<path d="M167.201 21.909C171.602 15.0521 174 7 174 7C174 7 153.602 11.8453 141.601 13.0531C129.6 14.2609 111.199 15.0521 111.199 15.0521L108 23.5195H115.2L118.4 34.3896H110.4L115.2 44.8571H120.4L124.8 62.5714L148.401 67L136.801 43.6493H144.401L150.001 35.1948H133.2L129.2 23.5195H142.001L138.801 27.144C140.268 28.7544 144.401 33.0476 145.201 33.1818C146.001 33.316 160.801 25.8008 167.201 21.909Z" fill="white" stroke="black" stroke-width="4" stroke-miterlimit="4.13357"/>
</svg>
