N;X;Y;Date;Actif
1;0;0;2022-01-01-02;1
2;1;0;2022-01-01-02;1
3;2;0;2022-01-01-02;1
4;0;1;2022-01-01-02;0
5;1;1;2022-01-01-02;0
6;2;1;2022-01-01-02;0
7;0;2;2022-01-01-02;0
8;1;2;2022-01-01-02;0
9;2;2;2022-01-01-02;0
1;0;0;2022-01-01-10;1
2;1;0;2022-01-01-10;1
3;2;0;2022-01-01-10;1
4;0;1;2022-01-01-10;0
5;1;1;2022-01-01-10;1
6;2;1;2022-01-01-10;1
7;0;2;2022-01-01-10;0
8;1;2;2022-01-01-10;0
9;2;2;2022-01-01-10;0
1;0;0;2022-01-01-18;1
2;1;0;2022-01-01-18;1
3;2;0;2022-01-01-18;1
4;0;1;2022-01-01-18;0
5;1;1;2022-01-01-18;1
6;2;1;2022-01-01-18;0
7;0;2;2022-01-01-18;0
8;1;2;2022-01-01-18;0
9;2;2;2022-01-01-18;0
1;0;0;2022-01-02-04;1
2;1;0;2022-01-02-04;1
3;2;0;2022-01-02-04;0
4;0;1;2022-01-02-04;0
5;1;1;2022-01-02-04;0
6;2;1;2022-01-02-04;0
7;0;2;2022-01-02-04;0
8;1;2;2022-01-02-04;0
9;2;2;2022-01-02-04;0
1;0;0;2022-01-02-12;1
2;1;0;2022-01-02-12;1
3;2;0;2022-01-02-12;1
4;0;1;2022-01-02-12;1
5;1;1;2022-01-02-12;1
6;2;1;2022-01-02-12;1
7;0;2;2022-01-02-12;0
8;1;2;2022-01-02-12;0
9;2;2;2022-01-02-12;1
