<mxfile host="app.diagrams.net" modified="2023-11-28T16:27:48.072Z" agent="Mozilla/5.0 (Windows NT 10.0; Win64; x64) AppleWebKit/537.36 (KHTML, like Gecko) Chrome/119.0.0.0 Safari/537.36 Edg/119.0.0.0" etag="LPJx4bQeKT9rAmtqaPsM" version="22.1.4" type="gitlab" pages="6">
  <diagram name="Login page 1" id="swAFN_58-HV2sHIqquHt">
    <mxGraphModel dx="998" dy="636" grid="1" gridSize="10" guides="1" tooltips="1" connect="1" arrows="1" fold="1" page="1" pageScale="1" pageWidth="827" pageHeight="1169" math="0" shadow="0">
      <root>
        <mxCell id="TMCjiTZfVtmyr6rWz0FS-0" />
        <mxCell id="TMCjiTZfVtmyr6rWz0FS-1" parent="TMCjiTZfVtmyr6rWz0FS-0" />
        <mxCell id="TMCjiTZfVtmyr6rWz0FS-2" value="" style="html=1;verticalLabelPosition=bottom;labelBackgroundColor=#ffffff;verticalAlign=top;shadow=0;dashed=0;strokeWidth=1;shape=mxgraph.ios7.misc.ipad7inch;strokeColor=#c0c0c0;direction=east;" parent="TMCjiTZfVtmyr6rWz0FS-1" vertex="1">
          <mxGeometry x="230" y="10" width="366" height="549" as="geometry" />
        </mxCell>
        <mxCell id="TMCjiTZfVtmyr6rWz0FS-3" value="Ecran de connexion 1" style="text;html=1;align=center;verticalAlign=middle;resizable=0;points=[];autosize=1;strokeColor=none;fillColor=none;" parent="TMCjiTZfVtmyr6rWz0FS-1" vertex="1">
          <mxGeometry y="55" width="140" height="30" as="geometry" />
        </mxCell>
        <UserObject label="Accéder à la proposition 2" link="data:page/id,A1y44I37xvyf3jzMcEWx" id="TMCjiTZfVtmyr6rWz0FS-4">
          <mxCell style="whiteSpace=wrap;html=1;" parent="TMCjiTZfVtmyr6rWz0FS-1" vertex="1">
            <mxGeometry x="20" y="110" width="100" height="30" as="geometry" />
          </mxCell>
        </UserObject>
        <mxCell id="TMCjiTZfVtmyr6rWz0FS-5" value="Email address" style="fillColor=none;strokeColor=none;align=left;fontSize=14;" parent="TMCjiTZfVtmyr6rWz0FS-1" vertex="1">
          <mxGeometry width="260" height="40" relative="1" as="geometry">
            <mxPoint x="270" y="130" as="offset" />
          </mxGeometry>
        </mxCell>
        <mxCell id="TMCjiTZfVtmyr6rWz0FS-6" value="" style="html=1;shadow=0;dashed=0;shape=mxgraph.bootstrap.rrect;rSize=5;fillColor=none;strokeColor=#999999;align=left;spacing=15;fontSize=14;fontColor=#6C767D;" parent="TMCjiTZfVtmyr6rWz0FS-1" vertex="1">
          <mxGeometry width="240" height="30" relative="1" as="geometry">
            <mxPoint x="270" y="170" as="offset" />
          </mxGeometry>
        </mxCell>
        <mxCell id="TMCjiTZfVtmyr6rWz0FS-7" value="We&#39;ll never share your email with anyone else." style="fillColor=none;strokeColor=none;align=left;spacing=2;fontSize=12;fontColor=#999999;" parent="TMCjiTZfVtmyr6rWz0FS-1" vertex="1">
          <mxGeometry width="260" height="30" relative="1" as="geometry">
            <mxPoint x="270" y="200" as="offset" />
          </mxGeometry>
        </mxCell>
        <mxCell id="TMCjiTZfVtmyr6rWz0FS-8" value="Password" style="fillColor=none;strokeColor=none;align=left;fontSize=14;" parent="TMCjiTZfVtmyr6rWz0FS-1" vertex="1">
          <mxGeometry width="260" height="40" relative="1" as="geometry">
            <mxPoint x="270" y="230" as="offset" />
          </mxGeometry>
        </mxCell>
        <mxCell id="TMCjiTZfVtmyr6rWz0FS-9" value="" style="html=1;shadow=0;dashed=0;shape=mxgraph.bootstrap.rrect;rSize=5;fillColor=none;strokeColor=#999999;align=left;spacing=15;fontSize=14;fontColor=#6C767D;" parent="TMCjiTZfVtmyr6rWz0FS-1" vertex="1">
          <mxGeometry width="240" height="30" relative="1" as="geometry">
            <mxPoint x="270" y="270" as="offset" />
          </mxGeometry>
        </mxCell>
        <mxCell id="TMCjiTZfVtmyr6rWz0FS-10" value="Check me out" style="html=1;shadow=0;dashed=0;shape=mxgraph.bootstrap.rrect;rSize=2;fillColor=#EDEDED;strokeColor=#999999;align=left;fontSize=14;fontColor=#000000;labelPosition=right;verticalLabelPosition=middle;verticalAlign=middle;spacingLeft=5;spacingTop=-2;gradientColor=#DEDEDE;" parent="TMCjiTZfVtmyr6rWz0FS-1" vertex="1">
          <mxGeometry width="10" height="10" relative="1" as="geometry">
            <mxPoint x="270" y="320" as="offset" />
          </mxGeometry>
        </mxCell>
        <mxCell id="TMCjiTZfVtmyr6rWz0FS-11" value="Connexion" style="html=1;shadow=0;dashed=0;shape=mxgraph.bootstrap.rrect;rSize=5;fillColor=#0085FC;strokeColor=none;align=center;fontSize=14;fontColor=#FFFFFF;" parent="TMCjiTZfVtmyr6rWz0FS-1" vertex="1">
          <mxGeometry width="80" height="40" relative="1" as="geometry">
            <mxPoint x="270" y="350" as="offset" />
          </mxGeometry>
        </mxCell>
        <UserObject label="Pas encore inscrit ? Clique ici" link="data:page/id,YKqgcYzSuwgG-87z5GqR" id="dQcRw_BOi659zzUPPNlc-0">
          <mxCell style="text;html=1;align=center;verticalAlign=middle;resizable=0;points=[];autosize=1;strokeColor=none;fillColor=none;" parent="TMCjiTZfVtmyr6rWz0FS-1" vertex="1">
            <mxGeometry x="260" y="400" width="180" height="30" as="geometry" />
          </mxCell>
        </UserObject>
      </root>
    </mxGraphModel>
  </diagram>
  <diagram name="Login page 2" id="A1y44I37xvyf3jzMcEWx">
    <mxGraphModel dx="998" dy="636" grid="1" gridSize="10" guides="1" tooltips="1" connect="1" arrows="1" fold="1" page="1" pageScale="1" pageWidth="827" pageHeight="1169" math="0" shadow="0">
      <root>
        <mxCell id="OQYEdHpl_e740wWq8hUN-0" />
        <mxCell id="OQYEdHpl_e740wWq8hUN-1" parent="OQYEdHpl_e740wWq8hUN-0" />
        <mxCell id="OQYEdHpl_e740wWq8hUN-2" value="" style="html=1;verticalLabelPosition=bottom;labelBackgroundColor=#ffffff;verticalAlign=top;shadow=0;dashed=0;strokeWidth=1;shape=mxgraph.ios7.misc.ipad7inch;strokeColor=#c0c0c0;direction=east;" parent="OQYEdHpl_e740wWq8hUN-1" vertex="1">
          <mxGeometry x="230" y="10" width="366" height="549" as="geometry" />
        </mxCell>
        <mxCell id="OQYEdHpl_e740wWq8hUN-3" value="Ecran de connexion 2" style="text;html=1;align=center;verticalAlign=middle;resizable=0;points=[];autosize=1;strokeColor=none;fillColor=none;" parent="OQYEdHpl_e740wWq8hUN-1" vertex="1">
          <mxGeometry y="55" width="140" height="30" as="geometry" />
        </mxCell>
        <UserObject label="Accéder à la proposition 1" link="data:page/id,swAFN_58-HV2sHIqquHt" id="OQYEdHpl_e740wWq8hUN-4">
          <mxCell style="whiteSpace=wrap;html=1;" parent="OQYEdHpl_e740wWq8hUN-1" vertex="1">
            <mxGeometry x="20" y="110" width="100" height="30" as="geometry" />
          </mxCell>
        </UserObject>
        <mxCell id="OQYEdHpl_e740wWq8hUN-5" value="Email address" style="fillColor=none;strokeColor=none;align=left;fontSize=14;" parent="OQYEdHpl_e740wWq8hUN-1" vertex="1">
          <mxGeometry width="260" height="40" relative="1" as="geometry">
            <mxPoint x="270" y="130" as="offset" />
          </mxGeometry>
        </mxCell>
        <mxCell id="OQYEdHpl_e740wWq8hUN-6" value="" style="html=1;shadow=0;dashed=0;shape=mxgraph.bootstrap.rrect;rSize=5;fillColor=none;strokeColor=#999999;align=left;spacing=15;fontSize=14;fontColor=#6C767D;" parent="OQYEdHpl_e740wWq8hUN-1" vertex="1">
          <mxGeometry width="240" height="30" relative="1" as="geometry">
            <mxPoint x="270" y="170" as="offset" />
          </mxGeometry>
        </mxCell>
        <mxCell id="OQYEdHpl_e740wWq8hUN-7" value="We&#39;ll never share your email with anyone else." style="fillColor=none;strokeColor=none;align=left;spacing=2;fontSize=12;fontColor=#999999;" parent="OQYEdHpl_e740wWq8hUN-1" vertex="1">
          <mxGeometry width="260" height="30" relative="1" as="geometry">
            <mxPoint x="270" y="200" as="offset" />
          </mxGeometry>
        </mxCell>
        <mxCell id="OQYEdHpl_e740wWq8hUN-8" value="Password" style="fillColor=none;strokeColor=none;align=left;fontSize=14;" parent="OQYEdHpl_e740wWq8hUN-1" vertex="1">
          <mxGeometry width="260" height="40" relative="1" as="geometry">
            <mxPoint x="270" y="230" as="offset" />
          </mxGeometry>
        </mxCell>
        <mxCell id="OQYEdHpl_e740wWq8hUN-9" value="" style="html=1;shadow=0;dashed=0;shape=mxgraph.bootstrap.rrect;rSize=5;fillColor=none;strokeColor=#999999;align=left;spacing=15;fontSize=14;fontColor=#6C767D;" parent="OQYEdHpl_e740wWq8hUN-1" vertex="1">
          <mxGeometry width="240" height="30" relative="1" as="geometry">
            <mxPoint x="270" y="270" as="offset" />
          </mxGeometry>
        </mxCell>
        <mxCell id="OQYEdHpl_e740wWq8hUN-10" value="Check me out" style="html=1;shadow=0;dashed=0;shape=mxgraph.bootstrap.rrect;rSize=2;fillColor=#EDEDED;strokeColor=#999999;align=left;fontSize=14;fontColor=#000000;labelPosition=right;verticalLabelPosition=middle;verticalAlign=middle;spacingLeft=5;spacingTop=-2;gradientColor=#DEDEDE;" parent="OQYEdHpl_e740wWq8hUN-1" vertex="1">
          <mxGeometry width="10" height="10" relative="1" as="geometry">
            <mxPoint x="270" y="320" as="offset" />
          </mxGeometry>
        </mxCell>
        <mxCell id="OQYEdHpl_e740wWq8hUN-11" value="Connexion" style="html=1;shadow=0;dashed=0;shape=mxgraph.bootstrap.rrect;rSize=5;fillColor=#0085FC;strokeColor=none;align=center;fontSize=14;fontColor=#FFFFFF;" parent="OQYEdHpl_e740wWq8hUN-1" vertex="1">
          <mxGeometry width="70" height="40" relative="1" as="geometry">
            <mxPoint x="270" y="350" as="offset" />
          </mxGeometry>
        </mxCell>
        <UserObject label="Inscription client" link="data:page/id,-qo7UYOXdgCtZK2PTS6E" id="_anpuWTNrrGdME1ANITR-0">
          <mxCell style="text;html=1;align=center;verticalAlign=middle;resizable=0;points=[];autosize=1;strokeColor=none;fillColor=none;" parent="OQYEdHpl_e740wWq8hUN-1" vertex="1">
            <mxGeometry x="260" y="405" width="110" height="30" as="geometry" />
          </mxCell>
        </UserObject>
        <UserObject label="Inscription restaurateur" link="data:page/id,a2-S7EcsXjjZbX8uusDa" id="_anpuWTNrrGdME1ANITR-2">
          <mxCell style="text;html=1;align=center;verticalAlign=middle;resizable=0;points=[];autosize=1;strokeColor=none;fillColor=none;" parent="OQYEdHpl_e740wWq8hUN-1" vertex="1">
            <mxGeometry x="260" y="435" width="150" height="30" as="geometry" />
          </mxCell>
        </UserObject>
      </root>
    </mxGraphModel>
  </diagram>
  <diagram name="Inscription 1 - Client" id="YKqgcYzSuwgG-87z5GqR">
    <mxGraphModel dx="1426" dy="909" grid="1" gridSize="10" guides="1" tooltips="1" connect="1" arrows="1" fold="1" page="1" pageScale="1" pageWidth="827" pageHeight="1169" math="0" shadow="0">
      <root>
        <mxCell id="0" />
        <mxCell id="1" parent="0" />
        <mxCell id="9_raIy2xE1G4JtnYHXIy-22" value="" style="html=1;verticalLabelPosition=bottom;labelBackgroundColor=#ffffff;verticalAlign=top;shadow=0;dashed=0;strokeWidth=1;shape=mxgraph.ios7.misc.ipad7inch;strokeColor=#c0c0c0;direction=east;" parent="1" vertex="1">
          <mxGeometry x="230" y="10" width="366" height="549" as="geometry" />
        </mxCell>
        <mxCell id="9_raIy2xE1G4JtnYHXIy-25" value="Email address" style="fillColor=none;strokeColor=none;align=left;fontSize=14;" parent="1" vertex="1">
          <mxGeometry width="260" height="20" relative="1" as="geometry">
            <mxPoint x="280" y="140" as="offset" />
          </mxGeometry>
        </mxCell>
        <mxCell id="9_raIy2xE1G4JtnYHXIy-26" value="" style="html=1;shadow=0;dashed=0;shape=mxgraph.bootstrap.rrect;rSize=5;fillColor=none;strokeColor=#999999;align=left;spacing=15;fontSize=14;fontColor=#6C767D;" parent="1" vertex="1">
          <mxGeometry width="240" height="30" relative="1" as="geometry">
            <mxPoint x="270" y="130" as="offset" />
          </mxGeometry>
        </mxCell>
        <mxCell id="9_raIy2xE1G4JtnYHXIy-27" value="We&#39;ll never share your email with anyone else." style="fillColor=none;strokeColor=none;align=left;spacing=2;fontSize=12;fontColor=#999999;" parent="1" vertex="1">
          <mxGeometry width="260" height="30" relative="1" as="geometry">
            <mxPoint x="270" y="160" as="offset" />
          </mxGeometry>
        </mxCell>
        <mxCell id="9_raIy2xE1G4JtnYHXIy-28" value="Password " style="fillColor=none;strokeColor=none;align=left;fontSize=14;" parent="1" vertex="1">
          <mxGeometry width="260" height="20" relative="1" as="geometry">
            <mxPoint x="280" y="200" as="offset" />
          </mxGeometry>
        </mxCell>
        <mxCell id="9_raIy2xE1G4JtnYHXIy-29" value="" style="html=1;shadow=0;dashed=0;shape=mxgraph.bootstrap.rrect;rSize=5;fillColor=none;strokeColor=#999999;align=left;spacing=15;fontSize=14;fontColor=#6C767D;" parent="1" vertex="1">
          <mxGeometry width="240" height="30" relative="1" as="geometry">
            <mxPoint x="270" y="190" as="offset" />
          </mxGeometry>
        </mxCell>
        <mxCell id="9_raIy2xE1G4JtnYHXIy-30" value="Accept Cgu" style="html=1;shadow=0;dashed=0;shape=mxgraph.bootstrap.rrect;rSize=2;fillColor=#EDEDED;strokeColor=#999999;align=left;fontSize=14;fontColor=#000000;labelPosition=right;verticalLabelPosition=middle;verticalAlign=middle;spacingLeft=5;spacingTop=-2;gradientColor=#DEDEDE;" parent="1" vertex="1">
          <mxGeometry width="10" height="10" relative="1" as="geometry">
            <mxPoint x="270" y="430" as="offset" />
          </mxGeometry>
        </mxCell>
        <mxCell id="9_raIy2xE1G4JtnYHXIy-31" value="Inscription" style="html=1;shadow=0;dashed=0;shape=mxgraph.bootstrap.rrect;rSize=5;fillColor=#0085FC;strokeColor=none;align=center;fontSize=14;fontColor=#FFFFFF;" parent="1" vertex="1">
          <mxGeometry width="100" height="40" relative="1" as="geometry">
            <mxPoint x="348" y="450" as="offset" />
          </mxGeometry>
        </mxCell>
        <UserObject label="&amp;nbsp;Client / Restaurateur" link="data:page/id,ND8tVA4mEqOfg7m6UTr4" id="9_raIy2xE1G4JtnYHXIy-33">
          <mxCell style="html=1;shadow=0;dashed=0;shape=mxgraph.bootstrap.switch;strokeColor=#00CC00;strokeWidth=1;fillColor=#ffffff;fontColor=#212529;onStrokeColor=#ffffff;onFillColor=#0085FC;align=left;verticalAlign=middle;spacingLeft=10;labelPosition=right;verticalLabelPosition=middle;buttonState=0;sketch=0;noLabel=0;fixDash=0;" parent="1" vertex="1">
            <mxGeometry x="270" y="80" width="30" height="20" as="geometry" />
          </mxCell>
        </UserObject>
        <mxCell id="xKlBTfEjAchHelyWK6Xn-1" value="Prénom" style="fillColor=none;strokeColor=none;align=left;fontSize=14;" vertex="1" parent="1">
          <mxGeometry x="282" y="230" width="263" height="40" as="geometry" />
        </mxCell>
        <mxCell id="xKlBTfEjAchHelyWK6Xn-2" value="" style="html=1;shadow=0;dashed=0;shape=mxgraph.bootstrap.rrect;rSize=5;fillColor=none;strokeColor=#999999;align=left;spacing=15;fontSize=14;fontColor=#6C767D;" vertex="1" parent="1">
          <mxGeometry x="270" y="230" width="240" height="30" as="geometry" />
        </mxCell>
        <mxCell id="xKlBTfEjAchHelyWK6Xn-3" value="Nom" style="fillColor=none;strokeColor=none;align=left;fontSize=14;" vertex="1" parent="1">
          <mxGeometry x="282" y="275" width="260" height="20" as="geometry" />
        </mxCell>
        <mxCell id="xKlBTfEjAchHelyWK6Xn-4" value="" style="html=1;shadow=0;dashed=0;shape=mxgraph.bootstrap.rrect;rSize=5;fillColor=none;strokeColor=#999999;align=left;spacing=15;fontSize=14;fontColor=#6C767D;" vertex="1" parent="1">
          <mxGeometry x="270" y="270" width="240" height="30" as="geometry" />
        </mxCell>
        <mxCell id="xKlBTfEjAchHelyWK6Xn-5" value="Date de Naissance" style="fillColor=none;strokeColor=none;align=left;fontSize=14;" vertex="1" parent="1">
          <mxGeometry x="282" y="310" width="260" height="40" as="geometry" />
        </mxCell>
        <mxCell id="xKlBTfEjAchHelyWK6Xn-6" value="" style="html=1;shadow=0;dashed=0;shape=mxgraph.bootstrap.rrect;rSize=5;fillColor=none;strokeColor=#999999;align=left;spacing=15;fontSize=14;fontColor=#6C767D;" vertex="1" parent="1">
          <mxGeometry x="270" y="310" width="240" height="30" as="geometry" />
        </mxCell>
        <mxCell id="xKlBTfEjAchHelyWK6Xn-7" value="" style="html=1;shadow=0;dashed=0;shape=mxgraph.bootstrap.rrect;rSize=5;fillColor=none;strokeColor=#999999;align=left;spacing=15;fontSize=14;fontColor=#6C767D;" vertex="1" parent="1">
          <mxGeometry x="270" y="350" width="240" height="30" as="geometry" />
        </mxCell>
        <mxCell id="xKlBTfEjAchHelyWK6Xn-9" value="Genre" style="fillColor=none;strokeColor=none;align=left;fontSize=14;" vertex="1" parent="1">
          <mxGeometry x="282" y="345" width="260" height="40" as="geometry" />
        </mxCell>
      </root>
    </mxGraphModel>
  </diagram>
  <diagram name="Inscription 1 - Restaurateur" id="ND8tVA4mEqOfg7m6UTr4">
    <mxGraphModel dx="998" dy="636" grid="1" gridSize="10" guides="1" tooltips="1" connect="1" arrows="1" fold="1" page="1" pageScale="1" pageWidth="827" pageHeight="1169" math="0" shadow="0">
      <root>
        <mxCell id="No9jIOLQ-Peb4LI9F6qB-0" />
        <mxCell id="No9jIOLQ-Peb4LI9F6qB-1" parent="No9jIOLQ-Peb4LI9F6qB-0" />
        <mxCell id="No9jIOLQ-Peb4LI9F6qB-2" value="" style="html=1;verticalLabelPosition=bottom;labelBackgroundColor=#ffffff;verticalAlign=top;shadow=0;dashed=0;strokeWidth=1;shape=mxgraph.ios7.misc.ipad7inch;strokeColor=#c0c0c0;direction=east;" parent="No9jIOLQ-Peb4LI9F6qB-1" vertex="1">
          <mxGeometry x="240" y="36" width="366" height="549" as="geometry" />
        </mxCell>
        <mxCell id="No9jIOLQ-Peb4LI9F6qB-5" value="Email address" style="fillColor=none;strokeColor=none;align=left;fontSize=14;" parent="No9jIOLQ-Peb4LI9F6qB-1" vertex="1">
          <mxGeometry width="260" height="40" relative="1" as="geometry">
            <mxPoint x="280" y="120" as="offset" />
          </mxGeometry>
        </mxCell>
        <mxCell id="No9jIOLQ-Peb4LI9F6qB-6" value="" style="html=1;shadow=0;dashed=0;shape=mxgraph.bootstrap.rrect;rSize=5;fillColor=none;strokeColor=#999999;align=left;spacing=15;fontSize=14;fontColor=#6C767D;" parent="No9jIOLQ-Peb4LI9F6qB-1" vertex="1">
          <mxGeometry width="240" height="20" relative="1" as="geometry">
            <mxPoint x="270" y="130" as="offset" />
          </mxGeometry>
        </mxCell>
        <mxCell id="No9jIOLQ-Peb4LI9F6qB-7" value="We&#39;ll never share your email with anyone else." style="fillColor=none;strokeColor=none;align=left;spacing=2;fontSize=12;fontColor=#999999;" parent="No9jIOLQ-Peb4LI9F6qB-1" vertex="1">
          <mxGeometry width="260" height="30" relative="1" as="geometry">
            <mxPoint x="630" y="60" as="offset" />
          </mxGeometry>
        </mxCell>
        <mxCell id="No9jIOLQ-Peb4LI9F6qB-8" value="Password" style="fillColor=none;strokeColor=none;align=left;fontSize=14;" parent="No9jIOLQ-Peb4LI9F6qB-1" vertex="1">
          <mxGeometry width="260" height="40" relative="1" as="geometry">
            <mxPoint x="280" y="160" as="offset" />
          </mxGeometry>
        </mxCell>
        <mxCell id="No9jIOLQ-Peb4LI9F6qB-9" value="" style="html=1;shadow=0;dashed=0;shape=mxgraph.bootstrap.rrect;rSize=5;fillColor=none;strokeColor=#999999;align=left;spacing=15;fontSize=14;fontColor=#6C767D;" parent="No9jIOLQ-Peb4LI9F6qB-1" vertex="1">
          <mxGeometry width="240" height="20" relative="1" as="geometry">
            <mxPoint x="270" y="170" as="offset" />
          </mxGeometry>
        </mxCell>
        <mxCell id="No9jIOLQ-Peb4LI9F6qB-10" value="&amp;nbsp; Accept Cgu" style="html=1;shadow=0;dashed=0;shape=mxgraph.bootstrap.rrect;rSize=2;fillColor=#EDEDED;strokeColor=#999999;align=left;fontSize=14;fontColor=#000000;labelPosition=right;verticalLabelPosition=middle;verticalAlign=middle;spacingLeft=5;spacingTop=-2;gradientColor=#DEDEDE;" parent="No9jIOLQ-Peb4LI9F6qB-1" vertex="1">
          <mxGeometry width="20" height="20" relative="1" as="geometry">
            <mxPoint x="280" y="490" as="offset" />
          </mxGeometry>
        </mxCell>
        <mxCell id="No9jIOLQ-Peb4LI9F6qB-11" value="Inscription" style="html=1;shadow=0;dashed=0;shape=mxgraph.bootstrap.rrect;rSize=5;fillColor=#0085FC;strokeColor=none;align=center;fontSize=14;fontColor=#FFFFFF;" parent="No9jIOLQ-Peb4LI9F6qB-1" vertex="1">
          <mxGeometry width="110" height="40" relative="1" as="geometry">
            <mxPoint x="460" y="480" as="offset" />
          </mxGeometry>
        </mxCell>
        <UserObject label="&amp;nbsp;Client / Restaurateur" link="data:page/id,YKqgcYzSuwgG-87z5GqR" id="No9jIOLQ-Peb4LI9F6qB-12">
          <mxCell style="html=1;shadow=0;dashed=0;shape=mxgraph.bootstrap.switch;strokeColor=#ADB6BD;strokeWidth=1;fillColor=#ffffff;fontColor=#212529;onStrokeColor=#ffffff;onFillColor=#0085FC;align=left;verticalAlign=middle;spacingLeft=10;labelPosition=right;verticalLabelPosition=middle;buttonState=1;sketch=0;dropTarget=0;" parent="No9jIOLQ-Peb4LI9F6qB-1" vertex="1">
            <mxGeometry x="270" y="100" width="30" height="20" as="geometry" />
          </mxCell>
        </UserObject>
        <mxCell id="cZvH4-doEa9zFWD0CmAf-0" value="" style="html=1;shadow=0;dashed=0;shape=mxgraph.bootstrap.rrect;rSize=5;fillColor=none;strokeColor=#999999;align=left;spacing=15;fontSize=14;fontColor=#6C767D;" parent="No9jIOLQ-Peb4LI9F6qB-1" vertex="1">
          <mxGeometry x="270" y="200" width="240" height="20" as="geometry" />
        </mxCell>
        <mxCell id="cZvH4-doEa9zFWD0CmAf-1" value="SIRET établissement principal" style="fillColor=none;strokeColor=none;align=left;fontSize=14;" parent="No9jIOLQ-Peb4LI9F6qB-1" vertex="1">
          <mxGeometry x="280" y="319" width="260" height="20" as="geometry" />
        </mxCell>
        <mxCell id="lTVuEIF0ETQleJFdqAy9-0" value="" style="html=1;shadow=0;dashed=0;shape=mxgraph.bootstrap.rrect;rSize=5;fillColor=none;strokeColor=#999999;align=left;spacing=15;fontSize=14;fontColor=#6C767D;" vertex="1" parent="No9jIOLQ-Peb4LI9F6qB-1">
          <mxGeometry x="270" y="230" width="240" height="20" as="geometry" />
        </mxCell>
        <mxCell id="lTVuEIF0ETQleJFdqAy9-1" value="" style="html=1;shadow=0;dashed=0;shape=mxgraph.bootstrap.rrect;rSize=5;fillColor=none;strokeColor=#999999;align=left;spacing=15;fontSize=14;fontColor=#6C767D;" vertex="1" parent="No9jIOLQ-Peb4LI9F6qB-1">
          <mxGeometry x="270" y="260" width="240" height="19" as="geometry" />
        </mxCell>
        <mxCell id="lTVuEIF0ETQleJFdqAy9-2" value="" style="html=1;shadow=0;dashed=0;shape=mxgraph.bootstrap.rrect;rSize=5;fillColor=none;strokeColor=#999999;align=left;spacing=15;fontSize=14;fontColor=#6C767D;" vertex="1" parent="No9jIOLQ-Peb4LI9F6qB-1">
          <mxGeometry x="270" y="289" width="240" height="19" as="geometry" />
        </mxCell>
        <mxCell id="lTVuEIF0ETQleJFdqAy9-3" value="" style="html=1;shadow=0;dashed=0;shape=mxgraph.bootstrap.rrect;rSize=5;fillColor=none;strokeColor=#999999;align=left;spacing=15;fontSize=14;fontColor=#6C767D;" vertex="1" parent="No9jIOLQ-Peb4LI9F6qB-1">
          <mxGeometry x="270" y="319" width="240" height="20" as="geometry" />
        </mxCell>
        <mxCell id="lTVuEIF0ETQleJFdqAy9-5" value="Prenom" style="fillColor=none;strokeColor=none;align=left;fontSize=14;" vertex="1" parent="No9jIOLQ-Peb4LI9F6qB-1">
          <mxGeometry x="280" y="200" width="260" height="20" as="geometry" />
        </mxCell>
        <mxCell id="lTVuEIF0ETQleJFdqAy9-6" value="Nom" style="fillColor=none;strokeColor=none;align=left;fontSize=14;" vertex="1" parent="No9jIOLQ-Peb4LI9F6qB-1">
          <mxGeometry x="280" y="230" width="260" height="20" as="geometry" />
        </mxCell>
        <mxCell id="lTVuEIF0ETQleJFdqAy9-7" value="Date de naissance" style="fillColor=none;strokeColor=none;align=left;fontSize=14;" vertex="1" parent="No9jIOLQ-Peb4LI9F6qB-1">
          <mxGeometry x="280" y="260" width="260" height="19" as="geometry" />
        </mxCell>
        <mxCell id="lTVuEIF0ETQleJFdqAy9-8" value="Genre" style="fillColor=none;strokeColor=none;align=left;fontSize=14;" vertex="1" parent="No9jIOLQ-Peb4LI9F6qB-1">
          <mxGeometry x="280" y="289" width="260" height="19" as="geometry" />
        </mxCell>
        <mxCell id="lTVuEIF0ETQleJFdqAy9-9" value="" style="html=1;shadow=0;dashed=0;shape=mxgraph.bootstrap.rrect;rSize=5;fillColor=none;strokeColor=#999999;align=left;spacing=15;fontSize=14;fontColor=#6C767D;" vertex="1" parent="No9jIOLQ-Peb4LI9F6qB-1">
          <mxGeometry x="270" y="355" width="240" height="20" as="geometry" />
        </mxCell>
        <mxCell id="lTVuEIF0ETQleJFdqAy9-14" value="Adresse Postale" style="fillColor=none;strokeColor=none;align=left;fontSize=14;" vertex="1" parent="No9jIOLQ-Peb4LI9F6qB-1">
          <mxGeometry x="280" y="390" width="260" height="20" as="geometry" />
        </mxCell>
        <mxCell id="lTVuEIF0ETQleJFdqAy9-15" value="Numero de telephone" style="fillColor=none;strokeColor=none;align=left;fontSize=14;" vertex="1" parent="No9jIOLQ-Peb4LI9F6qB-1">
          <mxGeometry x="280" y="355" width="260" height="20" as="geometry" />
        </mxCell>
        <mxCell id="lTVuEIF0ETQleJFdqAy9-16" value="" style="html=1;shadow=0;dashed=0;shape=mxgraph.bootstrap.rrect;rSize=5;fillColor=none;strokeColor=#999999;align=left;spacing=15;fontSize=14;fontColor=#6C767D;" vertex="1" parent="No9jIOLQ-Peb4LI9F6qB-1">
          <mxGeometry x="270" y="430" width="240" height="20" as="geometry" />
        </mxCell>
        <mxCell id="lTVuEIF0ETQleJFdqAy9-17" value="" style="html=1;shadow=0;dashed=0;shape=mxgraph.bootstrap.rrect;rSize=5;fillColor=none;strokeColor=#999999;align=left;spacing=15;fontSize=14;fontColor=#6C767D;" vertex="1" parent="No9jIOLQ-Peb4LI9F6qB-1">
          <mxGeometry x="270" y="390" width="240" height="20" as="geometry" />
        </mxCell>
        <mxCell id="lTVuEIF0ETQleJFdqAy9-19" value="Adresse e-Mail Contact" style="fillColor=none;strokeColor=none;align=left;fontSize=14;" vertex="1" parent="No9jIOLQ-Peb4LI9F6qB-1">
          <mxGeometry x="280" y="430" width="260" height="20" as="geometry" />
        </mxCell>
      </root>
    </mxGraphModel>
  </diagram>
  <diagram name="Inscription 2 - Client" id="-qo7UYOXdgCtZK2PTS6E">
    <mxGraphModel dx="998" dy="636" grid="1" gridSize="10" guides="1" tooltips="1" connect="1" arrows="1" fold="1" page="1" pageScale="1" pageWidth="827" pageHeight="1169" math="0" shadow="0">
      <root>
        <mxCell id="OypO6_VPVSQJhQVAF46H-0" />
        <mxCell id="OypO6_VPVSQJhQVAF46H-1" parent="OypO6_VPVSQJhQVAF46H-0" />
        <mxCell id="OypO6_VPVSQJhQVAF46H-2" value="" style="html=1;verticalLabelPosition=bottom;labelBackgroundColor=#ffffff;verticalAlign=top;shadow=0;dashed=0;strokeWidth=1;shape=mxgraph.ios7.misc.ipad7inch;strokeColor=#c0c0c0;direction=east;" parent="OypO6_VPVSQJhQVAF46H-1" vertex="1">
          <mxGeometry x="230" y="10" width="366" height="549" as="geometry" />
        </mxCell>
        <mxCell id="OypO6_VPVSQJhQVAF46H-5" value="Email address" style="fillColor=none;strokeColor=none;align=left;fontSize=14;" parent="OypO6_VPVSQJhQVAF46H-1" vertex="1">
          <mxGeometry width="260" height="40" relative="1" as="geometry">
            <mxPoint x="270" y="130" as="offset" />
          </mxGeometry>
        </mxCell>
        <mxCell id="OypO6_VPVSQJhQVAF46H-6" value="" style="html=1;shadow=0;dashed=0;shape=mxgraph.bootstrap.rrect;rSize=5;fillColor=none;strokeColor=#999999;align=left;spacing=15;fontSize=14;fontColor=#6C767D;" parent="OypO6_VPVSQJhQVAF46H-1" vertex="1">
          <mxGeometry width="240" height="30" relative="1" as="geometry">
            <mxPoint x="270" y="170" as="offset" />
          </mxGeometry>
        </mxCell>
        <mxCell id="OypO6_VPVSQJhQVAF46H-7" value="We&#39;ll never share your email with anyone else." style="fillColor=none;strokeColor=none;align=left;spacing=2;fontSize=12;fontColor=#999999;" parent="OypO6_VPVSQJhQVAF46H-1" vertex="1">
          <mxGeometry width="260" height="30" relative="1" as="geometry">
            <mxPoint x="270" y="200" as="offset" />
          </mxGeometry>
        </mxCell>
        <mxCell id="OypO6_VPVSQJhQVAF46H-8" value="Password" style="fillColor=none;strokeColor=none;align=left;fontSize=14;" parent="OypO6_VPVSQJhQVAF46H-1" vertex="1">
          <mxGeometry width="260" height="40" relative="1" as="geometry">
            <mxPoint x="270" y="230" as="offset" />
          </mxGeometry>
        </mxCell>
        <mxCell id="OypO6_VPVSQJhQVAF46H-9" value="" style="html=1;shadow=0;dashed=0;shape=mxgraph.bootstrap.rrect;rSize=5;fillColor=none;strokeColor=#999999;align=left;spacing=15;fontSize=14;fontColor=#6C767D;" parent="OypO6_VPVSQJhQVAF46H-1" vertex="1">
          <mxGeometry width="240" height="30" relative="1" as="geometry">
            <mxPoint x="270" y="270" as="offset" />
          </mxGeometry>
        </mxCell>
        <mxCell id="OypO6_VPVSQJhQVAF46H-10" value="Accept Cgu" style="html=1;shadow=0;dashed=0;shape=mxgraph.bootstrap.rrect;rSize=2;fillColor=#EDEDED;strokeColor=#999999;align=left;fontSize=14;fontColor=#000000;labelPosition=right;verticalLabelPosition=middle;verticalAlign=middle;spacingLeft=5;spacingTop=-2;gradientColor=#DEDEDE;" parent="OypO6_VPVSQJhQVAF46H-1" vertex="1">
          <mxGeometry width="10" height="10" relative="1" as="geometry">
            <mxPoint x="270" y="320" as="offset" />
          </mxGeometry>
        </mxCell>
        <mxCell id="OypO6_VPVSQJhQVAF46H-11" value="Inscription" style="html=1;shadow=0;dashed=0;shape=mxgraph.bootstrap.rrect;rSize=5;fillColor=#0085FC;strokeColor=none;align=center;fontSize=14;fontColor=#FFFFFF;" parent="OypO6_VPVSQJhQVAF46H-1" vertex="1">
          <mxGeometry width="70" height="40" relative="1" as="geometry">
            <mxPoint x="270" y="350" as="offset" />
          </mxGeometry>
        </mxCell>
      </root>
    </mxGraphModel>
  </diagram>
  <diagram name="Inscription 2 - Restaurateur" id="a2-S7EcsXjjZbX8uusDa">
    <mxGraphModel dx="998" dy="636" grid="1" gridSize="10" guides="1" tooltips="1" connect="1" arrows="1" fold="1" page="1" pageScale="1" pageWidth="827" pageHeight="1169" math="0" shadow="0">
      <root>
        <mxCell id="ftaV-rBu76u40yxC2Vtu-0" />
        <mxCell id="ftaV-rBu76u40yxC2Vtu-1" parent="ftaV-rBu76u40yxC2Vtu-0" />
        <mxCell id="ftaV-rBu76u40yxC2Vtu-2" value="" style="html=1;verticalLabelPosition=bottom;labelBackgroundColor=#ffffff;verticalAlign=top;shadow=0;dashed=0;strokeWidth=1;shape=mxgraph.ios7.misc.ipad7inch;strokeColor=#c0c0c0;direction=east;" parent="ftaV-rBu76u40yxC2Vtu-1" vertex="1">
          <mxGeometry x="230" y="10" width="366" height="549" as="geometry" />
        </mxCell>
        <mxCell id="ftaV-rBu76u40yxC2Vtu-5" value="Email address" style="fillColor=none;strokeColor=none;align=left;fontSize=14;" parent="ftaV-rBu76u40yxC2Vtu-1" vertex="1">
          <mxGeometry width="260" height="40" relative="1" as="geometry">
            <mxPoint x="270" y="130" as="offset" />
          </mxGeometry>
        </mxCell>
        <mxCell id="ftaV-rBu76u40yxC2Vtu-6" value="" style="html=1;shadow=0;dashed=0;shape=mxgraph.bootstrap.rrect;rSize=5;fillColor=none;strokeColor=#999999;align=left;spacing=15;fontSize=14;fontColor=#6C767D;" parent="ftaV-rBu76u40yxC2Vtu-1" vertex="1">
          <mxGeometry width="240" height="30" relative="1" as="geometry">
            <mxPoint x="270" y="170" as="offset" />
          </mxGeometry>
        </mxCell>
        <mxCell id="ftaV-rBu76u40yxC2Vtu-7" value="We&#39;ll never share your email with anyone else." style="fillColor=none;strokeColor=none;align=left;spacing=2;fontSize=12;fontColor=#999999;" parent="ftaV-rBu76u40yxC2Vtu-1" vertex="1">
          <mxGeometry width="260" height="30" relative="1" as="geometry">
            <mxPoint x="270" y="200" as="offset" />
          </mxGeometry>
        </mxCell>
        <mxCell id="ftaV-rBu76u40yxC2Vtu-8" value="Password" style="fillColor=none;strokeColor=none;align=left;fontSize=14;" parent="ftaV-rBu76u40yxC2Vtu-1" vertex="1">
          <mxGeometry width="260" height="40" relative="1" as="geometry">
            <mxPoint x="270" y="230" as="offset" />
          </mxGeometry>
        </mxCell>
        <mxCell id="ftaV-rBu76u40yxC2Vtu-9" value="" style="html=1;shadow=0;dashed=0;shape=mxgraph.bootstrap.rrect;rSize=5;fillColor=none;strokeColor=#999999;align=left;spacing=15;fontSize=14;fontColor=#6C767D;" parent="ftaV-rBu76u40yxC2Vtu-1" vertex="1">
          <mxGeometry width="240" height="30" relative="1" as="geometry">
            <mxPoint x="270" y="270" as="offset" />
          </mxGeometry>
        </mxCell>
        <mxCell id="ftaV-rBu76u40yxC2Vtu-10" value="Accept Cgu" style="html=1;shadow=0;dashed=0;shape=mxgraph.bootstrap.rrect;rSize=2;fillColor=#EDEDED;strokeColor=#999999;align=left;fontSize=14;fontColor=#000000;labelPosition=right;verticalLabelPosition=middle;verticalAlign=middle;spacingLeft=5;spacingTop=-2;gradientColor=#DEDEDE;" parent="ftaV-rBu76u40yxC2Vtu-1" vertex="1">
          <mxGeometry width="10" height="10" relative="1" as="geometry">
            <mxPoint x="270" y="420" as="offset" />
          </mxGeometry>
        </mxCell>
        <mxCell id="ftaV-rBu76u40yxC2Vtu-11" value="Inscription" style="html=1;shadow=0;dashed=0;shape=mxgraph.bootstrap.rrect;rSize=5;fillColor=#0085FC;strokeColor=none;align=center;fontSize=14;fontColor=#FFFFFF;" parent="ftaV-rBu76u40yxC2Vtu-1" vertex="1">
          <mxGeometry width="170" height="40" relative="1" as="geometry">
            <mxPoint x="320" y="440" as="offset" />
          </mxGeometry>
        </mxCell>
        <mxCell id="ftaV-rBu76u40yxC2Vtu-13" value="" style="html=1;shadow=0;dashed=0;shape=mxgraph.bootstrap.rrect;rSize=5;fillColor=none;strokeColor=#999999;align=left;spacing=15;fontSize=14;fontColor=#6C767D;" parent="ftaV-rBu76u40yxC2Vtu-1" vertex="1">
          <mxGeometry x="270" y="360" width="240" height="30" as="geometry" />
        </mxCell>
        <mxCell id="ftaV-rBu76u40yxC2Vtu-14" value="SIRET établissement principal" style="fillColor=none;strokeColor=none;align=left;fontSize=14;" parent="ftaV-rBu76u40yxC2Vtu-1" vertex="1">
          <mxGeometry x="270" y="310" width="260" height="40" as="geometry" />
        </mxCell>
      </root>
    </mxGraphModel>
  </diagram>
</mxfile>
