Liste des Scores Le Jeuste Prix : 
================================= 
lala: Nombre d'essai = 8, Temps (s) = 26
jely: Nombre d'essai = 11, Temps (s) = 27
jeti: Nombre d'essai = 10, Temps (s) = 25
coucou: Nombre d'essai = 6, Temps (s) = 21
g: Nombre d'essai = 11, Temps (s) = 22
