{
	"info": {
		"_postman_id": "90096010-5c9f-490b-b7f9-e717d6916b09",
		"name": "RefuelandGoAPI",
		"schema": "https://schema.getpostman.com/json/collection/v2.1.0/collection.json"
	},
	"item": [
		{
			"name": "get users",
			"request": {
				"method": "GET",
				"header": [],
				"url": {
					"raw": "0.0.0.0:3000/users",
					"host": [
						"0",
						"0",
						"0",
						"0"
					],
					"port": "3000",
					"path": [
						"users"
					]
				}
			},
			"response": []
		},
		{
			"name": "post new user",
			"request": {
				"method": "POST",
				"header": [],
				"body": {
					"mode": "raw",
					"raw": "{\n        \"id\": 2,\n        \"username\": \"Jean\",\n        \"email\": \"michel@mail.com\",\n        \"password\": \"michel\"\n}",
					"options": {
						"raw": {
							"language": "json"
						}
					}
				},
				"url": {
					"raw": "0.0.0.0:3000/user",
					"host": [
						"0",
						"0",
						"0",
						"0"
					],
					"port": "3000",
					"path": [
						"user"
					]
				}
			},
			"response": []
		},
		{
			"name": "get user by mail",
			"request": {
				"method": "GET",
				"header": [],
				"url": {
					"raw": "0.0.0.0:3000/user/test@mail.com",
					"host": [
						"0",
						"0",
						"0",
						"0"
					],
					"port": "3000",
					"path": [
						"user",
						"test@mail.com"
					]
				}
			},
			"response": []
		},
		{
			"name": "ports",
			"request": {
				"method": "GET",
				"header": [],
				"url": {
					"raw": "0.0.0.0:3000/ports",
					"host": [
						"0",
						"0",
						"0",
						"0"
					],
					"port": "3000",
					"path": [
						"ports"
					]
				}
			},
			"response": []
		},
		{
			"name": "request ofr near ports",
			"protocolProfileBehavior": {
				"disableBodyPruning": true
			},
			"request": {
				"method": "GET",
				"header": [],
				"body": {
					"mode": "raw",
					"raw": "",
					"options": {
						"raw": {
							"language": "json"
						}
					}
				},
				"url": {
					"raw": "0.0.0.0:3000/ports-in-radius/89.6016171/22.4942196",
					"host": [
						"0",
						"0",
						"0",
						"0"
					],
					"port": "3000",
					"path": [
						"ports-in-radius",
						"89.6016171",
						"22.4942196"
					]
				}
			},
			"response": []
		}
	]
}