<?xml version="1.0" encoding="UTF-8"?>
<svg version="1.1" viewBox="0 0 128 128" xmlns="http://www.w3.org/2000/svg">
	<path d="m128 64a64 64 0 0 1-64 64 64 64 0 0 1-64-64 64 64 0 0 1 64-64 64 64 0 0 1 64 64z" fill="#fff"/>
	<path d="m24.28 73.168c2.208 1.872 5.616 3.456 9.168 3.744v6.96h2.88v-7.008c5.04-0.528 8.448-3.504 8.448-7.632 0-8.784-15.264-7.776-15.264-13.056 0-2.448 2.064-3.984 5.28-3.984s4.896 1.056 7.056 2.736l2.112-2.304c-1.92-1.872-4.128-3.36-7.632-3.648v-6.288h-2.88v6.336c-4.656 0.48-7.776 3.216-7.776 7.248 0 8.352 15.216 7.296 15.216 13.248 0 2.448-2.016 4.176-5.808 4.176-3.6 0-6.528-1.536-8.928-3.264z"/>
	<path d="m80.68 85.312h23.04v-3.408h-23.04z"/>
</svg>
