{
	"name": "(UNMAINTAINED) Force Show OSK",
	"uuid": "force-show-osk@bruh.ltd",
	
	"url": "https://gitlab.com/warningnonpotablewater/force-show-osk",
	"description": "Show the on-screen keyboard regardless of whether the touch mode is enabled",
	
	"shell-version": [
		"40",
		"41",
		"42",
		"43"
	]
}
