<?xml version="1.0" encoding="UTF-8" standalone="no"?>
<!-- Created with Inkscape (http://www.inkscape.org/) -->

<svg
   xmlns:dc="http://purl.org/dc/elements/1.1/"
   xmlns:cc="http://creativecommons.org/ns#"
   xmlns:rdf="http://www.w3.org/1999/02/22-rdf-syntax-ns#"
   xmlns:svg="http://www.w3.org/2000/svg"
   xmlns="http://www.w3.org/2000/svg"
   xmlns:sodipodi="http://sodipodi.sourceforge.net/DTD/sodipodi-0.dtd"
   xmlns:inkscape="http://www.inkscape.org/namespaces/inkscape"
   version="1.1"
   id="svg2"
   xml:space="preserve"
   width="1104.4493"
   height="443.98776"
   viewBox="0 0 1104.4493 443.98776"
   sodipodi:docname="workflow2.svg"
   inkscape:version="0.92.4 (5da689c313, 2019-01-14)"
   inkscape:export-filename="/home/melissawen/Mestrado/msc-melissawen/tese/quali/figure/workflow2.png"
   inkscape:export-xdpi="90"
   inkscape:export-ydpi="90"><metadata
     id="metadata8"><rdf:RDF><cc:Work
         rdf:about=""><dc:format>image/svg+xml</dc:format><dc:type
           rdf:resource="http://purl.org/dc/dcmitype/StillImage" /><dc:title></dc:title></cc:Work></rdf:RDF></metadata><defs
     id="defs6" /><sodipodi:namedview
     pagecolor="#ffffff"
     bordercolor="#666666"
     borderopacity="1"
     objecttolerance="10"
     gridtolerance="10"
     guidetolerance="10"
     inkscape:pageopacity="0"
     inkscape:pageshadow="2"
     inkscape:window-width="1920"
     inkscape:window-height="1009"
     id="namedview4"
     showgrid="false"
     inkscape:zoom="1.0630924"
     inkscape:cx="832.87574"
     inkscape:cy="121.29545"
     inkscape:window-x="0"
     inkscape:window-y="34"
     inkscape:window-maximized="1"
     inkscape:current-layer="g10"
     showguides="false" /><g
     id="g10"
     inkscape:groupmode="layer"
     inkscape:label="workflow2"
     transform="matrix(1.3333333,0,0,1.3333333,0,9.0996938e-6)"><g
   id="g14"
   transform="translate(0,1.5)"><path
     inkscape:connector-curvature="0"
     id="path16"
     style="fill:none;stroke:#4d4d4d;stroke-width:2.33453703;stroke-linecap:round;stroke-linejoin:round;stroke-miterlimit:4;stroke-dasharray:none;stroke-opacity:1"
     d="m 79.125,64.992 v 42.953" /></g><g
   transform="rotate(-90,0.74999998,0.74999998)"
   id="g18"><path
     inkscape:connector-curvature="0"
     id="path20"
     style="fill:#4d4d4d;fill-opacity:1;fill-rule:evenodd;stroke:#4d4d4d;stroke-width:0.43772599;stroke-linecap:butt;stroke-linejoin:round;stroke-miterlimit:4;stroke-dasharray:none;stroke-opacity:1"
     d="m -103.449,81.949 -7.653,-2.812 7.653,-2.813 c -1.223,1.66 -1.215,3.934 0,5.625 z" /></g><g
   transform="rotate(-90,0.74999998,0.74999998)"
   id="g22"><path
     inkscape:connector-curvature="0"
     id="path24"
     style="fill:#a7b3cd;fill-opacity:1;fill-rule:nonzero;stroke:#a7b3cd;stroke-width:2.44854593;stroke-linecap:square;stroke-linejoin:bevel;stroke-miterlimit:4;stroke-dasharray:none;stroke-opacity:1"
     d="m -73.145,15.723 h 56.211 c 0.024,0 0.043,0.015 0.043,0.039 v 130.039 c 0,0.023 -0.019,0.043 -0.043,0.043 h -56.211 c -0.023,0 -0.039,-0.02 -0.039,-0.043 V 15.762 c 0,-0.024 0.016,-0.039 0.039,-0.039 z" /></g><g
   id="g26"
   transform="translate(0,1.5)"><path
     inkscape:connector-curvature="0"
     id="path28"
     style="fill:none;stroke:#4d4d4d;stroke-width:2.33453703;stroke-linecap:round;stroke-linejoin:round;stroke-miterlimit:4;stroke-dasharray:none;stroke-opacity:1"
     d="m 81.016,162.035 v 42.949" /></g><g
   transform="rotate(-90,0.74999998,0.74999998)"
   id="g30"><path
     inkscape:connector-curvature="0"
     id="path32"
     style="fill:#4d4d4d;fill-opacity:1;fill-rule:evenodd;stroke:#4d4d4d;stroke-width:0.43772599;stroke-linecap:butt;stroke-linejoin:round;stroke-miterlimit:4;stroke-dasharray:none;stroke-opacity:1"
     d="m -200.488,83.84 -7.653,-2.813 7.653,-2.812 c -1.223,1.66 -1.219,3.933 0,5.625 z" /></g><g
   transform="rotate(-90,0.74999998,0.74999998)"
   id="g34"><path
     inkscape:connector-curvature="0"
     id="path36"
     style="fill:#dbdee3;fill-opacity:1;fill-rule:nonzero;stroke:#a7b3cd;stroke-width:2.44854593;stroke-linecap:square;stroke-linejoin:bevel;stroke-miterlimit:4;stroke-dasharray:none;stroke-opacity:1"
     d="m -168.793,15.723 h 56.215 c 0.019,0 0.039,0.015 0.039,0.039 v 130.039 c 0,0.023 -0.02,0.043 -0.039,0.043 h -56.215 c -0.019,0 -0.039,-0.02 -0.039,-0.043 V 15.762 c 0,-0.024 0.02,-0.039 0.039,-0.039 z" /></g><g
   transform="matrix(0,-1.2822387,1,0,0,-57.459109)"
   id="g198"
   style="stroke-width:0.88311154"><path
     inkscape:connector-curvature="0"
     id="path200"
     style="fill:#dbdee3;fill-opacity:1;fill-rule:nonzero;stroke:#dbdee3;stroke-width:2.16233921;stroke-linecap:square;stroke-linejoin:bevel;stroke-miterlimit:4;stroke-dasharray:none;stroke-opacity:1"
     d="m -265.152,15.723 h 56.214 c 0.02,0 0.04,0.015 0.04,0.039 v 130.039 c 0,0.023 -0.02,0.043 -0.04,0.043 h -56.214 c -0.02,0 -0.039,-0.02 -0.039,-0.043 V 15.762 c 0,-0.024 0.019,-0.039 0.039,-0.039 z" /></g><g
   transform="rotate(-90,-39.75,-9.7500001)"
   id="g458"><path
     inkscape:connector-curvature="0"
     id="path460"
     style="fill:#dbdee3;fill-opacity:1;fill-rule:nonzero;stroke:#dbdee3;stroke-width:2.44854593;stroke-linecap:square;stroke-linejoin:bevel;stroke-miterlimit:4;stroke-dasharray:none;stroke-opacity:1"
     d="m -117.828,525.812 h 46.242 c 0.02,0 0.035,0.016 0.035,0.032 v 127.898 c 0,0.02 -0.015,0.035 -0.035,0.035 h -46.242 c -0.02,0 -0.035,-0.015 -0.035,-0.035 V 525.844 c 0,-0.016 0.015,-0.032 0.035,-0.032 z" /></g><g
   transform="rotate(-90,-35.25,-5.2500001)"
   id="g470"><path
     inkscape:connector-curvature="0"
     id="path472"
     style="fill:#dbdee3;fill-opacity:1;fill-rule:nonzero;stroke:#a7b3cd;stroke-width:2.44854593;stroke-linecap:square;stroke-linejoin:bevel;stroke-miterlimit:4;stroke-dasharray:none;stroke-opacity:1"
     d="m -225.566,526.191 h 46.242 c 0.019,0 0.035,0.016 0.035,0.036 v 127.898 c 0,0.02 -0.016,0.031 -0.035,0.031 h -46.242 c -0.016,0 -0.032,-0.011 -0.032,-0.031 V 526.227 c 0,-0.02 0.016,-0.036 0.032,-0.036 z" /></g><g
   id="g474"
   transform="matrix(1,0,0,1.2089302,-30,-69.137103)"><path
     inkscape:connector-curvature="0"
     id="path476"
     style="fill:none;stroke:#6f6f91;stroke-width:1.37785697;stroke-linecap:butt;stroke-linejoin:miter;stroke-miterlimit:4;stroke-dasharray:1.377857, 2.755714;stroke-dashoffset:0;stroke-opacity:1"
     d="M 472.938,64.84 H 655.5 c 4.266,0 7.703,3.305 7.703,7.41 V 323.5 c 0,4.105 -3.437,7.41 -7.703,7.41 H 472.938 c -4.27,0 -7.704,-3.305 -7.704,-7.41 V 72.25 c 0,-4.105 3.434,-7.41 7.704,-7.41 z" /></g><g
   transform="rotate(-90,-33.75,-3.7500001)"
   id="g706"><path
     inkscape:connector-curvature="0"
     id="path708"
     style="fill:#dbdee3;fill-opacity:1;fill-rule:nonzero;stroke:#a7b3cd;stroke-width:2.44854593;stroke-linecap:square;stroke-linejoin:bevel;stroke-miterlimit:4;stroke-dasharray:none;stroke-opacity:1"
     d="m -285.562,526.191 h 46.242 c 0.015,0 0.031,0.016 0.031,0.036 v 127.898 c 0,0.02 -0.016,0.031 -0.031,0.031 h -46.242 c -0.02,0 -0.036,-0.011 -0.036,-0.031 V 526.227 c 0,-0.02 0.016,-0.036 0.036,-0.036 z" /></g><g
   id="g289"
   transform="translate(-0.13582093,-2.8219557)"><g
     id="g716"
     transform="rotate(-90,-6.75,6.75)"><path
       d="m -268.984,705.422 h 12.843 c 0.004,0 0.008,0.004 0.008,0.008 v 29.715 c 0,0.003 -0.004,0.007 -0.008,0.007 h -12.843 c -0.008,0 -0.012,-0.004 -0.012,-0.007 V 705.43 c 0,-0.004 0.004,-0.008 0.012,-0.008 z"
       style="fill:#a7b3cd;fill-opacity:1;fill-rule:nonzero;stroke:#a7b3cd;stroke-width:0.559484;stroke-linecap:square;stroke-linejoin:bevel;stroke-miterlimit:4;stroke-dasharray:none;stroke-opacity:1"
       id="path718"
       inkscape:connector-curvature="0" /></g><g
     id="g720"
     transform="rotate(-90,-6.75,6.75)"><path
       d="m -294.918,705.422 h 12.844 c 0.008,0 0.012,0.004 0.012,0.008 v 29.715 c 0,0.003 -0.004,0.007 -0.012,0.007 h -12.844 c -0.004,0 -0.008,-0.004 -0.008,-0.007 V 705.43 c 0,-0.004 0.004,-0.008 0.008,-0.008 z"
       style="fill:#dbdee3;fill-opacity:1;fill-rule:nonzero;stroke:#a7b3cd;stroke-width:2.83464599;stroke-linecap:square;stroke-linejoin:bevel;stroke-miterlimit:4;stroke-dasharray:none;stroke-opacity:1"
       id="path722"
       inkscape:connector-curvature="0" /></g><g
     id="g724"
     transform="rotate(-90,-6.75,6.75)"><path
       d="m -320.848,705.422 h 12.844 c 0.004,0 0.008,0.004 0.008,0.008 v 29.715 c 0,0.003 -0.004,0.007 -0.008,0.007 h -12.844 c -0.007,0 -0.011,-0.004 -0.011,-0.007 V 705.43 c 0,-0.004 0.004,-0.008 0.011,-0.008 z"
       style="fill:#dbdee3;fill-opacity:1;fill-rule:nonzero;stroke:#dbdee3;stroke-width:0.559484;stroke-linecap:square;stroke-linejoin:bevel;stroke-miterlimit:4;stroke-dasharray:none;stroke-opacity:1"
       id="path726"
       inkscape:connector-curvature="0" /></g><text
     y="265.97794"
     x="736.26788"
     style="font-variant:normal;font-weight:normal;font-size:13.99999905px;font-family:'Latin Modern Math';-inkscape-font-specification:LatinModernMath-Regular;writing-mode:lr-tb;fill:#000000;fill-opacity:1;fill-rule:nonzero;stroke:none"
     id="text734"><tspan
       x="736.26788 745.40991 749.30188 757.08594 760.97791 766.4939 774.27789 780.4939"
       y="265.97794"
       sodipodi:role="line"
       id="tspan728">Finished</tspan><tspan
       x="736.26788 741.3219 749.1059 753.75391 763.2879 768.77588 775.77588 782.77588 788.30591 794.52191 800.0379"
       y="292.80316"
       sodipodi:role="line"
       id="tspan730">In Progress</tspan><tspan
       x="736.26788 745.40991 753.19391 758.63989 766.42389 771.91193 778.12793 782.77588 790.55988 796.00592 802.22192"
       y="319.62836"
       sodipodi:role="line"
       id="tspan732">Future Step</tspan></text>
</g>


<text
   id="text740"
   style="font-variant:normal;font-weight:normal;font-size:16.00000191px;font-family:'Latin Modern Math';-inkscape-font-specification:'Latin Modern Math';writing-mode:lr-tb;fill:#000000;fill-opacity:1;fill-rule:nonzero;stroke:none;font-style:normal;font-stretch:normal;"
   x="43.200069"
   y="39.685429"><tspan
     id="tspan738"
     sodipodi:role="line"
     style="font-size:14px;-inkscape-font-specification:'Latin Modern Math';font-family:'Latin Modern Math';font-weight:normal;font-style:normal;font-stretch:normal;font-variant:normal;"
     x="43.200069"
     y="53.841679" /></text>



<g
   transform="rotate(-90,-28.5,-18)"
   id="g752"><path
     inkscape:connector-curvature="0"
     id="path754"
     style="fill:#d7eef4;fill-opacity:1;fill-rule:nonzero;stroke:#5fbcd3;stroke-width:2.36764598;stroke-linecap:square;stroke-linejoin:bevel;stroke-miterlimit:4;stroke-dasharray:none;stroke-opacity:1"
     d="m -220.633,284.73 h 78.125 c 0.024,0 0.043,0.012 0.043,0.024 v 119.898 c 0,0.012 -0.019,0.024 -0.043,0.024 h -78.125 c -0.027,0 -0.047,-0.012 -0.047,-0.024 V 284.754 c 0,-0.012 0.02,-0.024 0.047,-0.024 z" /></g><text
   id="text770"
   style="font-variant:normal;font-weight:normal;font-size:14px;font-family:'Latin Modern Math';-inkscape-font-specification:LatinModernMath-Regular;writing-mode:lr-tb;fill:#000000;fill-opacity:1;fill-rule:nonzero;stroke:none"
   x="284.19452"
   y="125.55701"><tspan
     id="tspan760"
     sodipodi:role="line"
     x="284.19452"
     y="137.94373" /><tspan
     id="tspan762"
     sodipodi:role="line"
     x="284.19452"
     y="155.44373" /><tspan
     id="tspan764"
     sodipodi:role="line"
     x="284.19452"
     y="172.94373" /><tspan
     id="tspan766"
     sodipodi:role="line"
     y="155.28329"
     x="525.19489 534.72888 541.72888 547.21686 552.66284 556.55487 562.77087 566.66284 574.44684 581.44684 589.23083">Participant</tspan><tspan
     id="tspan768"
     sodipodi:role="line"
     y="175.28329"
     x="522.73395 533.62592 541.40991 546.9259 553.14191 558.62994 566.02191 573.02191 578.4679 582.35992 589.35992">Observation</tspan></text>



<g
   transform="matrix(0,-1.0523558,1,0,-30,-52.580862)"
   id="g772"><path
     inkscape:connector-curvature="0"
     id="path774"
     style="fill:#dbdee3;fill-opacity:1;fill-rule:nonzero;stroke:#dbdee3;stroke-width:2.77068591;stroke-linecap:square;stroke-linejoin:bevel;stroke-miterlimit:4;stroke-dasharray:none;stroke-opacity:1"
     d="m -285.453,473.805 h 213.91 c 0.086,0 0.156,0.004 0.156,0.007 v 42.891 c 0,0.004 -0.07,0.012 -0.156,0.012 h -213.91 c -0.086,0 -0.156,-0.008 -0.156,-0.012 v -42.891 c 0,-0.003 0.07,-0.007 0.156,-0.007 z" /></g><text
   id="text780"
   style="font-variant:normal;font-weight:normal;font-size:14px;font-family:'Latin Modern Math';-inkscape-font-specification:LatinModernMath-Regular;writing-mode:lr-tb;fill:#000000;fill-opacity:1;fill-rule:nonzero;stroke:none"
   transform="rotate(-90.037165)"
   x="-181.13766"
   y="458.79529"><tspan
     id="tspan776"
     sodipodi:role="line"
     y="458.79529"
     x="-181.13766 -170.44168 -163.44168 -157.99567 -150.99568 -146.34769 -136.23969 -129.23969 -125.34769 -121.45569 -115.23969 -109.06569 -103.61969 -99.727692 -92.727692">Data Collection</tspan><tspan
     id="tspan778"
     sodipodi:role="line"
     x="-181.13766 -174.13766 -166.35367 -158.56967 -153.92168 -143.81367 -136.81366 -125.10968 -117.32568 -110.32568 -104.83768 -100.94568 -95.429688 -88.429688"
     y="478.79529">and Comparison</tspan></text>



<g
   id="g277"
   transform="translate(0,-39)"><g
     transform="translate(-30)"
     id="g782"><path
       d="m 587.902,227.344 v 9.922"
       style="fill:none;stroke:#4d4d4d;stroke-width:1.24051797;stroke-linecap:round;stroke-linejoin:round;stroke-miterlimit:4;stroke-dasharray:none;stroke-opacity:1"
       id="path784"
       inkscape:connector-curvature="0" /></g><g
     id="g786"
     transform="rotate(90,-15,-15)"><path
       d="m 229.773,-587.902 c 0,1.367 -1.109,2.48 -2.48,2.48 -1.367,0 -2.48,-1.113 -2.48,-2.48 0,-1.371 1.113,-2.481 2.48,-2.481 1.371,0 2.48,1.11 2.48,2.481 z"
       style="fill:#4d4d4d;fill-opacity:1;fill-rule:evenodd;stroke:#4d4d4d;stroke-width:0.66161001;stroke-linecap:butt;stroke-linejoin:miter;stroke-miterlimit:4;stroke-dasharray:none;stroke-opacity:1"
       id="path788"
       inkscape:connector-curvature="0" /></g><g
     id="g790"
     transform="rotate(90,-15,-15)"><path
       d="m 239.695,-587.902 c 0,1.367 -1.109,2.48 -2.48,2.48 -1.371,0 -2.481,-1.113 -2.481,-2.48 0,-1.371 1.11,-2.481 2.481,-2.481 1.371,0 2.48,1.11 2.48,2.481 z"
       style="fill:#4d4d4d;fill-opacity:1;fill-rule:evenodd;stroke:#4d4d4d;stroke-width:0.66161001;stroke-linecap:butt;stroke-linejoin:miter;stroke-miterlimit:4;stroke-dasharray:none;stroke-opacity:1"
       id="path792"
       inkscape:connector-curvature="0" /></g></g><path
   inkscape:connector-curvature="0"
   id="path794"
   style="fill:#dbdee3;fill-opacity:1;fill-rule:nonzero;stroke:none"
   d="M 496.191,126.566 V 80.324 c 0,-0.019 0.016,-0.035 0.036,-0.035 h 127.898 c 0.02,0 0.031,0.016 0.031,0.035 v 46.242 c 0,0.016 -0.011,0.032 -0.031,0.032 H 496.227 c -0.02,0 -0.036,-0.016 -0.036,-0.032 z" /><text
   id="text800"
   style="font-variant:normal;font-weight:normal;font-size:14px;font-family:'Latin Modern Math';-inkscape-font-specification:LatinModernMath-Regular;writing-mode:lr-tb;fill:#000000;fill-opacity:1;fill-rule:nonzero;stroke:none"
   x="539.71442"
   y="96.783203"><tspan
     id="tspan796"
     sodipodi:role="line"
     x="539.71442"
     y="96.783203">Virtual</tspan><tspan
     id="tspan798"
     sodipodi:role="line"
     y="116.78322"
     x="522.73395 533.62592 541.40991 546.9259 553.14191 558.62994 566.02191 573.02191 578.4679 582.35992 589.35992">Observation</tspan></text>



<text
   id="text806"
   style="font-variant:normal;font-weight:normal;font-size:16.00000191px;font-family:'Latin Modern Math';-inkscape-font-specification:LatinModernMath-Regular;writing-mode:lr-tb;fill:#000000;fill-opacity:1;fill-rule:nonzero;stroke:none"
   x="464.82181"
   y="25.218042"><tspan
     id="tspan804"
     sodipodi:role="line"
     style="font-size:14px"
     x="464.82181"
     y="39.374294" /></text>



<g
   id="g812"
   transform="translate(0,1.5)"><path
     inkscape:connector-curvature="0"
     id="path814"
     style="fill:none;stroke:#4d4d4d;stroke-width:2.26348805;stroke-linecap:round;stroke-linejoin:round;stroke-miterlimit:4;stroke-dasharray:none;stroke-opacity:1"
     d="m 148.152,139.695 h 32.536" /></g><path
   inkscape:connector-curvature="0"
   id="path742"
   style="fill:#dbdee3;fill-opacity:1;fill-rule:nonzero;stroke:none"
   d="m 258.328,140.195 c 0,14.832 -19.699,26.852 -44.004,26.852 -24.304,0 -44.004,-12.02 -44.004,-26.852 0,-14.828 19.7,-26.851 44.004,-26.851 24.305,0 44.004,12.023 44.004,26.851 z" /><g
   id="g820"
   transform="translate(0,4.5)"><path
     inkscape:connector-curvature="0"
     id="path822"
     style="fill:none;stroke:#4d4d4d;stroke-width:2.26348805;stroke-linecap:round;stroke-linejoin:round;stroke-miterlimit:4;stroke-dasharray:none;stroke-opacity:1"
     d="m 148.152,237.195 h 32.536" /></g><g
   id="g808"
   transform="matrix(0.97783737,0,0,1,0.07185125,0)"
   style="stroke-width:1.01126897"><path
     inkscape:connector-curvature="0"
     id="path810"
     style="fill:none;stroke:#6f6f91;stroke-width:1.39338398;stroke-linecap:butt;stroke-linejoin:miter;stroke-miterlimit:4;stroke-dasharray:1.39338404, 2.78676808;stroke-dashoffset:0;stroke-opacity:1"
     d="m 19.312,5.59 h 380.993 c 8.902,0 16.07,4.031 16.07,9.039 v 306.535 c 0,5.008 -7.168,9.039 -16.07,9.039 H 19.312 c -8.902,0 -16.07,-4.031 -16.07,-9.039 V 14.629 c 0,-5.008 7.168,-9.039 16.07,-9.039 z" /></g><path
   inkscape:connector-curvature="0"
   id="path744"
   style="fill:#dbdee3;fill-opacity:1;fill-rule:nonzero;stroke:none"
   d="m 258.328,240.695 c 0,14.832 -19.699,26.852 -44.004,26.852 -24.304,0 -44.004,-12.02 -44.004,-26.852 0,-14.828 19.7,-26.851 44.004,-26.851 24.305,0 44.004,12.023 44.004,26.851 z" /><g
   transform="rotate(180,-6.75,0.74999998)"
   id="g816"><path
     inkscape:connector-curvature="0"
     id="path818"
     style="fill:#4d4d4d;fill-opacity:1;fill-rule:evenodd;stroke:#4d4d4d;stroke-width:0.424404;stroke-linecap:butt;stroke-linejoin:round;stroke-miterlimit:4;stroke-dasharray:none;stroke-opacity:1"
     d="m -176.328,-136.953 -7.422,-2.731 7.422,-2.726 c -1.188,1.609 -1.18,3.812 0,5.457 z" /></g><g
   id="g340"
   transform="matrix(1.0886291,-0.78082316,0.61781787,1.3758534,-149.52903,106.76682)"
   style="stroke-width:0.7106331"><g
     transform="translate(0,3)"
     id="g828"
     style="stroke-width:0.7106331"><path
       d="m 228.957,185.445 h 48.504"
       style="fill:none;stroke:#4d4d4d;stroke-width:1.60850942;stroke-linecap:round;stroke-linejoin:round;stroke-miterlimit:4;stroke-dasharray:none;stroke-opacity:1"
       id="path830"
       inkscape:connector-curvature="0" /></g><g
     id="g832"
     transform="rotate(180,0,1.5)"
     style="stroke-width:0.7106331"><path
       d="m -273.102,-182.707 -7.418,-2.727 7.418,-2.73 c -1.187,1.613 -1.179,3.816 0,5.457 z"
       style="fill:#4d4d4d;fill-opacity:1;fill-rule:evenodd;stroke:#4d4d4d;stroke-width:0.30159551;stroke-linecap:butt;stroke-linejoin:round;stroke-miterlimit:4;stroke-dasharray:none;stroke-opacity:1"
       id="path834"
       inkscape:connector-curvature="0" /></g></g><g
   transform="rotate(180,-6.75,2.25)"
   id="g824"><path
     inkscape:connector-curvature="0"
     id="path826"
     style="fill:#4d4d4d;fill-opacity:1;fill-rule:evenodd;stroke:#4d4d4d;stroke-width:0.424404;stroke-linecap:butt;stroke-linejoin:round;stroke-miterlimit:4;stroke-dasharray:none;stroke-opacity:1"
     d="m -176.328,-234.453 -7.422,-2.731 7.422,-2.726 c -1.188,1.609 -1.18,3.812 0,5.457 z" /></g><path
   inkscape:connector-curvature="0"
   id="path836"
   style="fill:#4d4d4d;fill-opacity:1;fill-rule:nonzero;stroke:none"
   d="m 212.961,169.496 h 2.25 v 41.625 h -2.25 z" /><g
   transform="matrix(0,-0.99572085,1.3095992,0,289.78248,-31.383144)"
   id="g267"><path
     inkscape:connector-curvature="0"
     id="path265"
     style="fill:#d7eef4;fill-opacity:1;fill-rule:nonzero;stroke:#5fbcd3;stroke-width:2.36764598;stroke-linecap:square;stroke-linejoin:bevel;stroke-miterlimit:4;stroke-dasharray:none;stroke-opacity:1"
     d="m -220.633,284.73 h 78.125 c 0.024,0 0.043,0.012 0.043,0.024 v 119.898 c 0,0.012 -0.019,0.024 -0.043,0.024 h -78.125 c -0.027,0 -0.047,-0.012 -0.047,-0.024 V 284.754 c 0,-0.012 0.02,-0.024 0.047,-0.024 z" /></g><text
   id="text848"
   style="font-variant:normal;font-weight:normal;font-size:14px;font-family:'Latin Modern Math';-inkscape-font-specification:LatinModernMath-Regular;writing-mode:lr-tb;fill:#000000;fill-opacity:1;fill-rule:nonzero;stroke:none"
   x="743.93042"
   y="132.89902"><tspan
     id="tspan846"
     sodipodi:role="line"
     x="743.93042"
     y="132.89902"
     style="line-height:1.5;text-align:center;text-anchor:middle">Sociotechnical Data</tspan><tspan
     sodipodi:role="line"
     x="743.93042"
     y="153.89902"
     id="tspan185"
     style="line-height:1.5;text-align:center;text-anchor:middle">Analysis of the Linux</tspan><tspan
     sodipodi:role="line"
     x="743.93042"
     y="174.89902"
     id="tspan189"
     style="line-height:1.5;text-align:center;text-anchor:middle">Development Model</tspan></text>



<g
   id="g850"
   transform="matrix(0.5420654,0,0,0.5420654,274.6546,58.01334)"
   style="stroke-width:1.84479582"><path
     inkscape:connector-curvature="0"
     id="path852"
     style="fill:none;stroke:#4d4d4d;stroke-width:4.17567348;stroke-linecap:round;stroke-linejoin:round;stroke-miterlimit:4;stroke-dasharray:none;stroke-opacity:1"
     d="m 663.152,179.094 h 36.219" /></g><g
   transform="rotate(180,-21,-12)"
   id="g854"><path
     inkscape:connector-curvature="0"
     id="path856"
     style="fill:#4d4d4d;fill-opacity:1;fill-rule:evenodd;stroke:#4d4d4d;stroke-width:0.424404;stroke-linecap:butt;stroke-linejoin:round;stroke-miterlimit:4;stroke-dasharray:none;stroke-opacity:1"
     d="m -695.012,-176.355 -7.418,-2.727 7.418,-2.73 c -1.187,1.613 -1.179,3.816 0,5.457 z" /></g><text
   y="137.83743"
   x="80.775131"
   style="font-variant:normal;font-weight:normal;font-size:16.00000191px;font-family:'Latin Modern Math';-inkscape-font-specification:LatinModernMath-Regular;text-align:center;writing-mode:lr-tb;text-anchor:middle;fill:#000000;fill-opacity:1;fill-rule:nonzero;stroke:none"
   id="text1284"><tspan
     sodipodi:role="line"
     id="tspan1282"
     x="80.775131"
     y="137.83743"
     style="font-size:14px">Grey Literature</tspan><tspan
     sodipodi:role="line"
     x="80.775131"
     y="157.83743"
     id="tspan1294"
     style="font-size:14px">Review</tspan></text>



<text
   id="text1300"
   style="font-variant:normal;font-weight:normal;font-size:16.00000191px;font-family:'Latin Modern Math';-inkscape-font-specification:LatinModernMath-Regular;text-align:center;writing-mode:lr-tb;text-anchor:middle;fill:#000000;fill-opacity:1;fill-rule:nonzero;stroke:none"
   x="80.775131"
   y="233.83743"><tspan
     y="233.83743"
     x="80.775131"
     id="tspan1296"
     sodipodi:role="line"
     style="font-size:14px">Systematic</tspan><tspan
     y="253.83743"
     x="80.775131"
     sodipodi:role="line"
     id="tspan1302"
     style="font-size:14px">Literature</tspan><tspan
     id="tspan1298"
     y="273.83743"
     x="80.775131"
     sodipodi:role="line"
     style="font-size:14px">Review</tspan></text>



<flowRoot
   xml:space="preserve"
   id="flowRoot1304"
   style="font-style:normal;font-variant:normal;font-weight:normal;font-stretch:normal;font-size:21.33333397px;line-height:1.25;font-family:'Latin Modern Math';-inkscape-font-specification:'Latin Modern Math, Normal';font-variant-ligatures:normal;font-variant-caps:normal;font-variant-numeric:normal;font-feature-settings:normal;text-align:start;letter-spacing:0px;word-spacing:0px;writing-mode:lr-tb;text-anchor:start;fill:#000000;fill-opacity:1;stroke:none"
   transform="matrix(0.75000002,0,0,0.75000002,38.334552,13.949293)"><flowRegion
     id="flowRegion1306"><rect
       id="rect1308"
       width="386.608"
       height="45.151299"
       x="108.17499"
       y="393.19257" /></flowRegion><flowPara
     id="flowPara1310"
     style="font-size:18.66666603px">Multivocal Literature Review</flowPara></flowRoot><flowRoot
   xml:space="preserve"
   id="flowRoot1312"
   style="font-style:normal;font-variant:normal;font-weight:normal;font-stretch:normal;font-size:21.33333397px;line-height:1.25;font-family:'Latin Modern Math';-inkscape-font-specification:'Latin Modern Math, Normal';font-variant-ligatures:normal;font-variant-caps:normal;font-variant-numeric:normal;font-feature-settings:normal;text-align:start;letter-spacing:0px;word-spacing:0px;writing-mode:lr-tb;text-anchor:start;fill:#000000;fill-opacity:1;stroke:none"
   transform="matrix(0.75000002,0,0,0.75000002,78.64531,-155.31668)"><flowRegion
     id="flowRegion1314"><rect
       id="rect1316"
       width="554.04407"
       height="154.26694"
       x="364.97299"
       y="481.61383" /></flowRegion><flowPara
     id="flowPara1318"
     style="font-size:18.66666603px;text-align:center;text-anchor:middle">Journal of</flowPara><flowPara
     id="flowPara1320"
     style="font-size:18.66666603px;text-align:center;text-anchor:middle">Contributions</flowPara></flowRoot><g
   id="g309"
   transform="translate(0.26706594,-133.34411)"><g
     transform="matrix(0,-0.99572085,1.3095992,0,289.78248,0.11685604)"
     id="g245"><path
       inkscape:connector-curvature="0"
       id="path243"
       style="fill:#d7eef4;fill-opacity:1;fill-rule:nonzero;stroke:#5fbcd3;stroke-width:2.36764598;stroke-linecap:square;stroke-linejoin:bevel;stroke-miterlimit:4;stroke-dasharray:none;stroke-opacity:1"
       d="m -220.633,284.73 h 78.125 c 0.024,0 0.043,0.012 0.043,0.024 v 119.898 c 0,0.012 -0.019,0.024 -0.043,0.024 h -78.125 c -0.027,0 -0.047,-0.012 -0.047,-0.024 V 284.754 c 0,-0.012 0.02,-0.024 0.047,-0.024 z" /></g><flowRoot
     transform="matrix(0.75000002,0,0,0.75000002,286.84023,-233.82617)"
     style="font-style:normal;font-variant:normal;font-weight:normal;font-stretch:normal;font-size:21.33333397px;line-height:1.25;font-family:'Latin Modern Math';-inkscape-font-specification:'Latin Modern Math, Normal';font-variant-ligatures:normal;font-variant-caps:normal;font-variant-numeric:normal;font-feature-settings:normal;text-align:center;letter-spacing:0px;word-spacing:0px;writing-mode:lr-tb;text-anchor:middle;fill:#000000;fill-opacity:1;stroke:none"
     id="flowRoot1324"
     xml:space="preserve"><flowRegion
       style="text-align:center;text-anchor:middle"
       id="flowRegion1326"><rect
         style="text-align:center;text-anchor:middle"
         y="513.59601"
         x="255.85736"
         height="156.14824"
         width="699.84509"
         id="rect1328" /></flowRegion><flowPara
       id="flowPara139"
       style="font-size:18.66666603px;line-height:1.25">Development of FLOSS</flowPara><flowPara
       id="flowPara239"
       style="font-size:18.66666603px;line-height:1.25">Project Interaction</flowPara><flowPara
       id="flowPara241"
       style="font-size:18.66666603px;line-height:1.25">Data Collector </flowPara></flowRoot></g><text
   xml:space="preserve"
   style="font-style:normal;font-variant:normal;font-weight:normal;font-stretch:normal;font-size:16px;line-height:1.25;font-family:'Latin Modern Math';-inkscape-font-specification:'Latin Modern Math, Normal';font-variant-ligatures:normal;font-variant-caps:normal;font-variant-numeric:normal;font-feature-settings:normal;text-align:center;letter-spacing:0px;word-spacing:0px;writing-mode:lr-tb;text-anchor:middle;fill:#000000;fill-opacity:1;stroke:none;stroke-width:0.75"
   x="79.314888"
   y="41.007378"
   id="text1338"><tspan
     sodipodi:role="line"
     id="tspan1336"
     x="79.314888"
     y="41.007378"
     style="font-size:14px;text-align:center;text-anchor:middle;stroke-width:0.75">Key Papers</tspan><tspan
     sodipodi:role="line"
     x="79.314888"
     y="61.007378"
     style="font-size:14px;text-align:center;text-anchor:middle;stroke-width:0.75"
     id="tspan1340">Selection</tspan></text>









<text
   xml:space="preserve"
   style="font-style:normal;font-variant:normal;font-weight:normal;font-stretch:normal;font-size:16px;line-height:1.25;font-family:'Latin Modern Math';-inkscape-font-specification:'Latin Modern Math, Normal';font-variant-ligatures:normal;font-variant-caps:normal;font-variant-numeric:normal;font-feature-settings:normal;text-align:start;letter-spacing:0px;word-spacing:0px;writing-mode:lr-tb;text-anchor:start;fill:#000000;fill-opacity:1;stroke:none;stroke-width:0.75"
   x="520.66229"
   y="49.268463"
   id="text1352"><tspan
     sodipodi:role="line"
     id="tspan1350"
     x="520.66229"
     y="49.268463"
     style="font-size:14px;stroke-width:0.75">Data Mining</tspan></text>



<flowRoot
   xml:space="preserve"
   id="flowRoot137"
   style="fill:black;fill-opacity:1;stroke:none;font-family:'Latin Modern Math';font-style:normal;font-weight:normal;font-size:21.33333333px;line-height:1.25;letter-spacing:0px;word-spacing:0px;-inkscape-font-specification:'Latin Modern Math, Normal';font-stretch:normal;font-variant:normal;text-anchor:start;text-align:start;writing-mode:lr;font-variant-ligatures:normal;font-variant-caps:normal;font-variant-numeric:normal;font-feature-settings:normal"><flowRegion
     id="flowRegion139"><rect
       id="rect141"
       width="106.29368"
       height="43.269993"
       x="418.59015"
       y="217.29063" /></flowRegion><flowPara
     id="flowPara143"></flowPara></flowRoot><text
   xml:space="preserve"
   style="font-style:normal;font-variant:normal;font-weight:normal;font-stretch:normal;font-size:16px;line-height:1.25;font-family:'Latin Modern Math';-inkscape-font-specification:'Latin Modern Math, Normal';font-variant-ligatures:normal;font-variant-caps:normal;font-variant-numeric:normal;font-feature-settings:normal;text-align:start;letter-spacing:0px;word-spacing:0px;writing-mode:lr-tb;text-anchor:start;fill:#000000;fill-opacity:1;stroke:none;stroke-width:0.75"
   x="334.79932"
   y="119.55031"
   id="text152"><tspan
     sodipodi:role="line"
     x="337.12354"
     y="119.55031"
     style="font-size:14px;text-align:center;text-anchor:middle;stroke-width:0.75"
     id="tspan164">FLOSS </tspan><tspan
     sodipodi:role="line"
     x="334.79932"
     y="139.55031"
     style="font-size:14px;text-align:center;text-anchor:middle;stroke-width:0.75"
     id="tspan172">Development</tspan><tspan
     sodipodi:role="line"
     x="334.79932"
     y="159.55031"
     style="font-size:14px;text-align:center;text-anchor:middle;stroke-width:0.75"
     id="tspan170">Conceptual Maps</tspan></text>
<flowRoot
   xml:space="preserve"
   id="flowRoot199"
   style="font-style:normal;font-variant:normal;font-weight:normal;font-stretch:normal;font-size:21.33333397px;line-height:1.25;font-family:'Latin Modern Math';-inkscape-font-specification:'Latin Modern Math, Normal';font-variant-ligatures:normal;font-variant-caps:normal;font-variant-numeric:normal;font-feature-settings:normal;text-align:start;letter-spacing:0px;word-spacing:0px;writing-mode:lr-tb;text-anchor:start;fill:#000000;fill-opacity:1;stroke:none"
   transform="matrix(0.75000002,0,0,0.75000002,0,-6.8247705e-6)"><flowRegion
     id="flowRegion201"><rect
       id="rect203"
       width="380.02341"
       height="259.61996"
       x="1157.002"
       y="87.480652" /></flowRegion><flowPara
     id="flowPara205" /></flowRoot><g
   id="g315"
   transform="matrix(-1,0,0,1,1294.6823,-136.86487)"><g
     id="g227"
     transform="matrix(0.5420654,0,0,0.5420654,274.6546,83.51334)"
     style="stroke-width:1.84479582"><path
       inkscape:connector-curvature="0"
       id="path225"
       style="fill:none;stroke:#4d4d4d;stroke-width:4.17567348;stroke-linecap:round;stroke-linejoin:round;stroke-miterlimit:4;stroke-dasharray:none;stroke-opacity:1"
       d="m 663.152,179.094 h 36.219" /></g><g
     transform="rotate(180,-21,0.75000006)"
     id="g231"><path
       inkscape:connector-curvature="0"
       id="path229"
       style="fill:#4d4d4d;fill-opacity:1;fill-rule:evenodd;stroke:#4d4d4d;stroke-width:0.424404;stroke-linecap:butt;stroke-linejoin:round;stroke-miterlimit:4;stroke-dasharray:none;stroke-opacity:1"
       d="m -695.012,-176.355 -7.418,-2.727 7.418,-2.73 c -1.187,1.613 -1.179,3.816 0,5.457 z" /></g></g><flowRoot
   xml:space="preserve"
   id="flowRoot291"
   style="font-style:normal;font-variant:normal;font-weight:normal;font-stretch:normal;font-size:21.33333397px;line-height:1.25;font-family:'Latin Modern Math';-inkscape-font-specification:'Latin Modern Math, Normal';font-variant-ligatures:normal;font-variant-caps:normal;font-variant-numeric:normal;font-feature-settings:normal;text-align:center;letter-spacing:0px;word-spacing:0px;writing-mode:lr-tb;text-anchor:middle;fill:#000000;fill-opacity:1;stroke:none"
   transform="matrix(0.75000002,0,0,0.75000002,-109.18536,-126.94016)"><flowRegion
     id="flowRegion293"
     style="text-align:center;text-anchor:middle"><rect
       id="rect295"
       width="588.84814"
       height="130.75063"
       x="563.45056"
       y="551.22211"
       style="text-align:center;text-anchor:middle" /></flowRegion><flowPara
     id="flowPara297"
     style="font-size:18.66666603px">Virtual Ethnography</flowPara><flowPara
     id="flowPara299"
     style="font-size:18.66666603px">Case Study</flowPara></flowRoot><g
   id="g344"
   transform="matrix(0,-1.1955865,1,0,-10.5,20.135774)"
   style="stroke-width:0.9145543"><path
     d="m -220.633,284.73 h 78.125 c 0.024,0 0.043,0.012 0.043,0.024 v 119.898 c 0,0.012 -0.019,0.024 -0.043,0.024 h -78.125 c -0.027,0 -0.047,-0.012 -0.047,-0.024 V 284.754 c 0,-0.012 0.02,-0.024 0.047,-0.024 z"
     style="fill:#d7eef4;fill-opacity:1;fill-rule:nonzero;stroke:#5fbcd3;stroke-width:2.1653409;stroke-linecap:square;stroke-linejoin:bevel;stroke-miterlimit:4;stroke-dasharray:none;stroke-opacity:1"
     id="path342"
     inkscape:connector-curvature="0" /></g><text
   id="text352"
   y="211.05031"
   x="334.79932"
   style="font-style:normal;font-variant:normal;font-weight:normal;font-stretch:normal;font-size:16px;line-height:1.25;font-family:'Latin Modern Math';-inkscape-font-specification:'Latin Modern Math, Normal';font-variant-ligatures:normal;font-variant-caps:normal;font-variant-numeric:normal;font-feature-settings:normal;text-align:start;letter-spacing:0px;word-spacing:0px;writing-mode:lr-tb;text-anchor:start;fill:#000000;fill-opacity:1;stroke:none;stroke-width:0.75"
   xml:space="preserve"><tspan
     id="tspan350"
     style="font-size:14px;text-align:center;text-anchor:middle;stroke-width:0.75"
     y="211.05031"
     x="334.79932"
     sodipodi:role="line">Linux</tspan><tspan
     style="font-size:14px;text-align:center;text-anchor:middle;stroke-width:0.75"
     y="231.05031"
     x="337.12354"
     sodipodi:role="line"
     id="tspan369">Development </tspan><tspan
     style="font-size:14px;text-align:center;text-anchor:middle;stroke-width:0.75"
     y="251.05031"
     x="334.79932"
     sodipodi:role="line"
     id="tspan373">Model</tspan><tspan
     style="font-size:14px;text-align:center;text-anchor:middle;stroke-width:0.75"
     y="271.05029"
     x="334.79932"
     sodipodi:role="line"
     id="tspan371">Characteristics</tspan></text>
<text
   xml:space="preserve"
   style="font-style:normal;font-variant:normal;font-weight:normal;font-stretch:normal;font-size:16px;line-height:1.25;font-family:'Latin Modern Math';-inkscape-font-specification:'Latin Modern Math, Normal';font-variant-ligatures:normal;font-variant-caps:normal;font-variant-numeric:normal;font-feature-settings:normal;text-align:start;letter-spacing:0px;word-spacing:0px;writing-mode:lr-tb;text-anchor:start;fill:#000000;fill-opacity:1;stroke:none;stroke-width:0.75"
   x="192.24403"
   y="143.68851"
   id="text1344"><tspan
     sodipodi:role="line"
     id="tspan1342"
     x="192.24403"
     y="143.68851"
     style="font-size:14px;stroke-width:0.75">Coding</tspan></text>
<g
   style="stroke-width:0.7106331"
   transform="matrix(1.0886291,0.78082316,0.61781787,-1.3758534,-149.52903,269.02841)"
   id="g362"><g
     style="stroke-width:0.7106331"
     id="g356"
     transform="translate(0,3)"><path
       inkscape:connector-curvature="0"
       id="path354"
       style="fill:none;stroke:#4d4d4d;stroke-width:1.60850942;stroke-linecap:round;stroke-linejoin:round;stroke-miterlimit:4;stroke-dasharray:none;stroke-opacity:1"
       d="m 228.957,185.445 h 48.504" /></g><g
     style="stroke-width:0.7106331"
     transform="rotate(180,0,1.5)"
     id="g360"><path
       inkscape:connector-curvature="0"
       id="path358"
       style="fill:#4d4d4d;fill-opacity:1;fill-rule:evenodd;stroke:#4d4d4d;stroke-width:0.30159551;stroke-linecap:butt;stroke-linejoin:round;stroke-miterlimit:4;stroke-dasharray:none;stroke-opacity:1"
       d="m -273.102,-182.707 -7.418,-2.727 7.418,-2.73 c -1.187,1.613 -1.179,3.816 0,5.457 z" /></g></g><text
   id="text1348"
   y="244.18851"
   x="192.24403"
   style="font-style:normal;font-variant:normal;font-weight:normal;font-stretch:normal;font-size:16px;line-height:1.25;font-family:'Latin Modern Math';-inkscape-font-specification:'Latin Modern Math, Normal';font-variant-ligatures:normal;font-variant-caps:normal;font-variant-numeric:normal;font-feature-settings:normal;text-align:start;letter-spacing:0px;word-spacing:0px;writing-mode:lr-tb;text-anchor:start;fill:#000000;fill-opacity:1;stroke:none;stroke-width:0.75"
   xml:space="preserve"><tspan
     style="font-size:14px;stroke-width:0.75"
     y="244.18851"
     x="192.24403"
     id="tspan1346"
     sodipodi:role="line">Coding</tspan></text>
<g
   id="g698"
   transform="matrix(0.47372314,0,0,0.31916246,214.87894,123.62075)"
   style="stroke-width:2.57176805"><path
     inkscape:connector-curvature="0"
     id="path700"
     style="fill:none;stroke:#4d4d4d;stroke-width:5.82116604;stroke-linecap:round;stroke-linejoin:round;stroke-miterlimit:4;stroke-dasharray:none;stroke-opacity:1"
     d="M 407.512,182.449 H 468.02" /></g><g
   transform="rotate(180,-16.406839,-0.29868564)"
   id="g702"><path
     inkscape:connector-curvature="0"
     id="path704"
     style="fill:#4d4d4d;fill-opacity:1;fill-rule:evenodd;stroke:#4d4d4d;stroke-width:0.424404;stroke-linecap:butt;stroke-linejoin:round;stroke-miterlimit:4;stroke-dasharray:none;stroke-opacity:1"
     d="m -463.66,-179.707 -7.418,-2.731 7.418,-2.726 c -1.184,1.609 -1.18,3.812 0,5.457 z" /></g></g></svg>