<?xml version="1.0" encoding="UTF-8" standalone="no"?>
<!-- Created with Inkscape (http://www.inkscape.org/) -->

<svg
   xmlns:dc="http://purl.org/dc/elements/1.1/"
   xmlns:cc="http://creativecommons.org/ns#"
   xmlns:rdf="http://www.w3.org/1999/02/22-rdf-syntax-ns#"
   xmlns:svg="http://www.w3.org/2000/svg"
   xmlns="http://www.w3.org/2000/svg"
   xmlns:sodipodi="http://sodipodi.sourceforge.net/DTD/sodipodi-0.dtd"
   xmlns:inkscape="http://www.inkscape.org/namespaces/inkscape"
   width="210mm"
   height="297mm"
   viewBox="0 0 210 297"
   version="1.1"
   id="svg8"
   sodipodi:docname="kernel_arch.svg"
   inkscape:version="0.92.4 (5da689c313, 2019-01-14)">
  <defs
     id="defs2" />
  <sodipodi:namedview
     id="base"
     pagecolor="#ffffff"
     bordercolor="#666666"
     borderopacity="1.0"
     inkscape:pageopacity="0.0"
     inkscape:pageshadow="2"
     inkscape:zoom="0.98994949"
     inkscape:cx="627.55231"
     inkscape:cy="615.57195"
     inkscape:document-units="mm"
     inkscape:current-layer="layer1"
     showgrid="false"
     inkscape:window-width="1920"
     inkscape:window-height="1043"
     inkscape:window-x="1920"
     inkscape:window-y="0"
     inkscape:window-maximized="1" />
  <metadata
     id="metadata5">
    <rdf:RDF>
      <cc:Work
         rdf:about="">
        <dc:format>image/svg+xml</dc:format>
        <dc:type
           rdf:resource="http://purl.org/dc/dcmitype/StillImage" />
      </cc:Work>
    </rdf:RDF>
  </metadata>
  <g
     inkscape:label="Camada 1"
     inkscape:groupmode="layer"
     id="layer1">
    <rect
       style="opacity:1;fill:#ffffff;fill-opacity:1;stroke:none;stroke-width:0.5;stroke-linecap:round;stroke-miterlimit:4;stroke-dasharray:none;stroke-opacity:1"
       id="rect877"
       width="196.85774"
       height="151.43532"
       x="8.0180855"
       y="54.319271"
       inkscape:export-xdpi="90"
       inkscape:export-ydpi="90" />
    <rect
       style="fill:#d3d7cf;fill-opacity:1;stroke:#d3d7cf;stroke-width:0.52064389;stroke-linecap:round;stroke-miterlimit:4;stroke-dasharray:none;stroke-opacity:1"
       id="rect10"
       width="187.48593"
       height="105.73119"
       x="12.846317"
       y="77.12487" />
    <rect
       style="opacity:0.8;fill:#ffffff;fill-opacity:1;stroke:none;stroke-width:0.44238889;stroke-linecap:round;stroke-miterlimit:4;stroke-dasharray:none;stroke-opacity:1"
       id="rect12"
       width="175.38094"
       height="18.898808"
       x="18.672024"
       y="83.292252" />
    <rect
       y="119.80476"
       x="18.672024"
       height="32.505951"
       width="175.38094"
       id="rect14"
       style="fill:#ffffff;fill-opacity:1;stroke:none;stroke-width:0.58018762;stroke-linecap:round;stroke-miterlimit:4;stroke-dasharray:none;stroke-opacity:1;opacity:0.8" />
    <rect
       y="158.43352"
       x="83.86808"
       height="18.898808"
       width="110"
       id="rect18"
       style="opacity:0.8;fill:#ffffff;fill-opacity:1;stroke:none;stroke-width:0.35035583;stroke-linecap:round;stroke-miterlimit:4;stroke-dasharray:none;stroke-opacity:1" />
    <flowRoot
       xml:space="preserve"
       id="flowRoot20"
       style="font-style:normal;font-variant:normal;font-weight:normal;font-stretch:normal;font-size:10.66666698px;line-height:1.25;font-family:'Liberation Sans';-inkscape-font-specification:'Liberation Sans';letter-spacing:0px;word-spacing:0px;fill:#000000;fill-opacity:1;stroke:none"
       transform="matrix(0.26458333,0,0,0.26458333,20.636112,2.7224166)"><flowRegion
         id="flowRegion22"><rect
           id="rect24"
           width="662.85712"
           height="71.428551"
           x="70.571426"
           y="598.80383" /></flowRegion><flowPara
         id="flowPara26"
         style="font-style:normal;font-variant:normal;font-weight:normal;font-stretch:normal;font-size:37.33333206px;font-family:'Latin Modern Math';-inkscape-font-specification:'Latin Modern Math'">Architecture-dependent portion</flowPara></flowRoot>    <flowRoot
       transform="matrix(0.26458333,0,0,0.26458333,15.282438,-28.99411)"
       style="font-style:normal;font-variant:normal;font-weight:normal;font-stretch:normal;font-size:10.66666698px;line-height:1.25;font-family:'Liberation Sans';-inkscape-font-specification:'Liberation Sans';letter-spacing:0px;word-spacing:0px;fill:#000000;fill-opacity:1;stroke:none"
       id="flowRoot34"
       xml:space="preserve"><flowRegion
         id="flowRegion30"><rect
           y="598.80383"
           x="70.571426"
           height="71.428551"
           width="662.85712"
           id="rect28" /></flowRegion><flowPara
         style="font-style:normal;font-variant:normal;font-weight:normal;font-stretch:normal;font-size:37.33333206px;font-family:'Latin Modern Math';-inkscape-font-specification:'Latin Modern Math'"
         id="flowPara32">Architecture-independent portion</flowPara></flowRoot>    <flowRoot
       xml:space="preserve"
       id="flowRoot42"
       style="font-style:normal;font-variant:normal;font-weight:normal;font-stretch:normal;font-size:10.66666698px;line-height:1.25;font-family:'Liberation Sans';-inkscape-font-specification:'Liberation Sans';letter-spacing:0px;word-spacing:0px;fill:#000000;fill-opacity:1;stroke:none"
       transform="matrix(0.26458333,0,0,0.26458333,27.795339,-72.418846)"><flowRegion
         id="flowRegion38"><rect
           id="rect36"
           width="662.85712"
           height="71.428551"
           x="70.571426"
           y="598.80383" /></flowRegion><flowPara
         id="flowPara40"
         style="font-style:normal;font-variant:normal;font-weight:normal;font-stretch:normal;font-size:37.33333206px;font-family:'Latin Modern Math';-inkscape-font-specification:'Latin Modern Math'">System Call Interface (SCI)</flowPara></flowRoot>    <rect
       style="opacity:0.8;fill:#ffffff;fill-opacity:1;stroke:none;stroke-width:0.25509983;stroke-linecap:round;stroke-miterlimit:4;stroke-dasharray:none;stroke-opacity:1"
       id="rect948"
       width="58.316883"
       height="18.898808"
       x="18.672024"
       y="158.43352" />
    <flowRoot
       transform="matrix(0.26458333,0,0,0.26458333,20.636112,2.7224166)"
       style="font-style:normal;font-variant:normal;font-weight:normal;font-stretch:normal;font-size:10.66666698px;line-height:1.25;font-family:'Liberation Sans';-inkscape-font-specification:'Liberation Sans';letter-spacing:0px;word-spacing:0px;fill:#000000;fill-opacity:1;stroke:none"
       id="flowRoot956"
       xml:space="preserve"><flowRegion
         id="flowRegion952"><rect
           y="598.80383"
           x="70.571426"
           height="71.428551"
           width="662.85712"
           id="rect950" /></flowRegion><flowPara
         style="font-style:normal;font-variant:normal;font-weight:normal;font-stretch:normal;font-size:37.33333206px;font-family:'Latin Modern Math';-inkscape-font-specification:'Latin Modern Math'"
         id="flowPara954">Arch</flowPara></flowRoot>  </g>
</svg>
