<?xml version="1.0" encoding="UTF-8" standalone="no"?>
<svg
   xmlns:dc="http://purl.org/dc/elements/1.1/"
   xmlns:cc="http://creativecommons.org/ns#"
   xmlns:rdf="http://www.w3.org/1999/02/22-rdf-syntax-ns#"
   xmlns:svg="http://www.w3.org/2000/svg"
   xmlns="http://www.w3.org/2000/svg"
   xmlns:sodipodi="http://sodipodi.sourceforge.net/DTD/sodipodi-0.dtd"
   xmlns:inkscape="http://www.inkscape.org/namespaces/inkscape"
   version="1.1"
   id="svg2"
   xml:space="preserve"
   width="485.04086"
   height="207.4229"
   viewBox="0 0 485.04086 207.4229"
   sodipodi:docname="GLR_FLOW.svg"
   inkscape:version="1.0.2 (e86c870879, 2021-01-15)"><metadata
     id="metadata8"><rdf:RDF><cc:Work
         rdf:about=""><dc:format>image/svg+xml</dc:format><dc:type
           rdf:resource="http://purl.org/dc/dcmitype/StillImage" /><dc:title /></cc:Work></rdf:RDF></metadata><defs
     id="defs6"><rect
       x="-81.394776"
       y="178.02233"
       width="93.423309"
       height="65.857075"
       id="rect1197" /><rect
       x="-81.394776"
       y="178.02233"
       width="291.131"
       height="77.016322"
       id="rect1203" /><rect
       x="-81.394776"
       y="178.02233"
       width="291.131"
       height="77.016322"
       id="rect1207" /><rect
       x="-81.394776"
       y="178.02233"
       width="291.131"
       height="77.016322"
       id="rect1211" /><rect
       x="-81.394776"
       y="178.02233"
       width="291.131"
       height="77.016322"
       id="rect1315" /><rect
       x="-81.394776"
       y="178.02233"
       width="291.131"
       height="77.016322"
       id="rect1317" /><rect
       x="-81.394776"
       y="178.02233"
       width="291.131"
       height="77.016322"
       id="rect1319" /><rect
       x="-81.394776"
       y="178.02233"
       width="291.131"
       height="77.016322"
       id="rect1321" /><rect
       x="-81.394776"
       y="178.02233"
       width="291.131"
       height="77.016322"
       id="rect1607" /><rect
       x="-81.394776"
       y="178.02233"
       width="291.131"
       height="77.016322"
       id="rect1609" /><rect
       x="-81.394776"
       y="178.02233"
       width="291.131"
       height="77.016322"
       id="rect1611" /><rect
       x="-81.394776"
       y="178.02233"
       width="291.131"
       height="77.016322"
       id="rect1613" /><rect
       x="-81.394775"
       y="178.02232"
       width="291.13101"
       height="77.016319"
       id="rect1613-9" /><rect
       x="-81.394775"
       y="178.02232"
       width="291.13101"
       height="77.016319"
       id="rect1624" /><rect
       x="-81.394775"
       y="178.02232"
       width="291.13101"
       height="77.016319"
       id="rect1611-1" /><rect
       x="-81.394775"
       y="178.02232"
       width="291.13101"
       height="77.016319"
       id="rect1627" /><rect
       x="-81.394775"
       y="178.02232"
       width="291.13101"
       height="77.016319"
       id="rect1609-2" /><rect
       x="-81.394775"
       y="178.02232"
       width="291.13101"
       height="77.016319"
       id="rect1630" /><rect
       x="-81.394775"
       y="178.02232"
       width="291.13101"
       height="77.016319"
       id="rect1607-7" /><rect
       x="-81.394775"
       y="178.02232"
       width="291.13101"
       height="77.016319"
       id="rect1633" /><rect
       x="-81.394775"
       y="178.02232"
       width="291.13101"
       height="77.016319"
       id="rect1607-7-0" /><rect
       x="-81.394775"
       y="178.02232"
       width="291.13101"
       height="77.016319"
       id="rect1756" /><rect
       x="-81.394775"
       y="178.02232"
       width="291.13101"
       height="77.016319"
       id="rect1609-2-9" /><rect
       x="-81.394775"
       y="178.02232"
       width="291.13101"
       height="77.016319"
       id="rect1759" /><rect
       x="-81.394775"
       y="178.02232"
       width="291.13101"
       height="77.016319"
       id="rect1611-1-3" /><rect
       x="-81.394775"
       y="178.02232"
       width="291.13101"
       height="77.016319"
       id="rect1762" /><rect
       x="-81.394775"
       y="178.02232"
       width="291.13101"
       height="77.016319"
       id="rect1613-9-6" /><rect
       x="-81.394775"
       y="178.02232"
       width="291.13101"
       height="77.016319"
       id="rect1765" /></defs><sodipodi:namedview
     pagecolor="#ffffff"
     bordercolor="#666666"
     borderopacity="1"
     objecttolerance="10"
     gridtolerance="10"
     guidetolerance="10"
     inkscape:pageopacity="0"
     inkscape:pageshadow="2"
     inkscape:window-width="1920"
     inkscape:window-height="1009"
     id="namedview4"
     showgrid="false"
     inkscape:zoom="1.7390287"
     inkscape:cx="260.17286"
     inkscape:cy="147.85096"
     inkscape:window-x="0"
     inkscape:window-y="0"
     inkscape:window-maximized="1"
     inkscape:current-layer="g10"
     inkscape:document-rotation="0" /><g
     id="g10"
     inkscape:groupmode="layer"
     inkscape:label="Linux_Comunity_Concepts_Fields"
     transform="matrix(1.3333333,0,0,1.3333333,0,3.1855723e-6)"><text
       xml:space="preserve"
       style="font-size:30px;line-height:1.25;font-family:'Latin Modern Math';-inkscape-font-specification:'Latin Modern Math, Normal';letter-spacing:0px;word-spacing:0px;writing-mode:lr-tb;stroke-width:0.75"
       x="227.93402"
       y="368.59879"
       id="text1281"><tspan
         sodipodi:role="line"
         id="tspan1279"
         x="227.93402"
         y="368.59879"
         style="stroke-width:0.75">Word Cloud</tspan><tspan
         sodipodi:role="line"
         x="227.93402"
         y="406.09879"
         style="stroke-width:0.75"
         id="tspan1283">(NLP script)</tspan></text><text
       xml:space="preserve"
       style="font-size:30px;line-height:1.25;font-family:'Latin Modern Math';-inkscape-font-specification:'Latin Modern Math, Normal';letter-spacing:0px;word-spacing:0px;writing-mode:lr-tb;stroke-width:0.75"
       x="456.66318"
       y="369.53381"
       id="text1287"><tspan
         sodipodi:role="line"
         id="tspan1285"
         x="456.66318"
         y="369.53381"
         style="stroke-width:0.75">Coding</tspan></text><text
       xml:space="preserve"
       style="font-size:30px;line-height:1.25;font-family:'Latin Modern Math';-inkscape-font-specification:'Latin Modern Math, Normal';letter-spacing:0px;word-spacing:0px;writing-mode:lr-tb;stroke-width:0.75"
       x="473.51321"
       y="404.86804"
       id="text1291"><tspan
         sodipodi:role="line"
         id="tspan1289"
         x="473.51321"
         y="404.86804"
         style="stroke-width:0.75">Mind Map</tspan></text><rect
       style="fill:#e5f5f9;fill-opacity:1;stroke:none;stroke-width:0.225;stroke-linecap:round;stroke-linejoin:round;stroke-miterlimit:4;stroke-dasharray:none;stroke-opacity:0"
       id="rect1097"
       width="130.5975"
       height="172.45595"
       x="-162.09367"
       y="5.2293291"
       rx="7.4999995"
       ry="7.4999995" /><text
       xml:space="preserve"
       style="font-size:12px;line-height:1.25;font-family:'Latin Modern Math';-inkscape-font-specification:'Latin Modern Math, Normal';letter-spacing:0px;word-spacing:0px;writing-mode:lr-tb;stroke-width:0.749999"
       x="-120.34489"
       y="20.822729"
       id="text1105"><tspan
         sodipodi:role="line"
         id="tspan1103"
         x="-120.34489"
         y="20.822729"
         style="font-size:12px;stroke-width:0.749999">Planning</tspan></text><rect
       style="fill:#99d8c9;fill-opacity:1;stroke:none;stroke-width:0.225001;stroke-linecap:round;stroke-linejoin:round;stroke-miterlimit:4;stroke-dasharray:none;stroke-opacity:0"
       id="rect1095"
       width="120"
       height="49.047455"
       x="-156.79492"
       y="31.824379"
       rx="7.4999995"
       ry="7.5000005" /><rect
       style="fill:#99d8c9;fill-opacity:1;stroke:none;stroke-width:0.225001;stroke-linecap:round;stroke-linejoin:round;stroke-miterlimit:4;stroke-dasharray:none;stroke-opacity:0"
       id="rect1153"
       width="120"
       height="23.907141"
       x="-156.79492"
       y="84.324379"
       rx="7.4999995"
       ry="7.5" /><rect
       style="fill:#99d8c9;fill-opacity:1;stroke:none;stroke-width:0.225001;stroke-linecap:round;stroke-linejoin:round;stroke-miterlimit:4;stroke-dasharray:none;stroke-opacity:0"
       id="rect1155"
       width="120"
       height="33.000008"
       x="-156.79492"
       y="111.23153"
       rx="7.4999995"
       ry="7.5000005" /><text
       xml:space="preserve"
       id="text1195"
       style="font-size:10px;line-height:1.25;font-family:'Latin Modern Math';-inkscape-font-specification:'Latin Modern Math, Normal';letter-spacing:0px;word-spacing:0px;writing-mode:lr-tb;white-space:pre;shape-inside:url(#rect1197);text-align:center"
       transform="translate(-60.660321,-140.13854)"
       x="44.919926"
       y="0"><tspan
         x="-79.762545"
         y="187.33148"><tspan
           style="text-align:center;text-anchor:middle;shape-inside:url(#rect1197)">Outline the Problem </tspan></tspan><tspan
         x="-79.572515"
         y="199.83148"><tspan
           style="text-align:center;text-anchor:middle;shape-inside:url(#rect1197)">and Define Research </tspan></tspan><tspan
         x="-56.127586"
         y="212.33148"><tspan
           style="text-align:center;text-anchor:middle;shape-inside:url(#rect1197)">Questions</tspan></tspan></text><text
       xml:space="preserve"
       id="text1201"
       style="font-size:10px;line-height:1.25;font-family:'Latin Modern Math';-inkscape-font-specification:'Latin Modern Math, Normal';letter-spacing:0px;word-spacing:0px;writing-mode:lr-tb;white-space:pre;shape-inside:url(#rect1203);"
       transform="translate(-71.775272,-112.49853)" /><text
       xml:space="preserve"
       id="text1205"
       style="font-size:10px;line-height:1.25;font-family:'Latin Modern Math';-inkscape-font-specification:'Latin Modern Math, Normal';letter-spacing:0px;word-spacing:0px;writing-mode:lr-tb;white-space:pre;shape-inside:url(#rect1207);"
       transform="translate(-71.355299,-88.558535)"><tspan
         x="-81.394531"
         y="187.33148"><tspan
           style="shape-inside:url(#rect1207)">Define Eligibility Criteria</tspan></tspan></text><text
       xml:space="preserve"
       id="text1209"
       style="font-size:10px;line-height:1.25;font-family:'Latin Modern Math';-inkscape-font-specification:'Latin Modern Math, Normal';text-align:center;letter-spacing:0px;word-spacing:0px;writing-mode:lr-tb;white-space:pre;shape-inside:url(#rect1211)"
       transform="translate(-160.99582,-63.007738)"
       x="40.499912"
       y="0"><tspan
         x="23.350986"
         y="187.33148"><tspan
           style="text-align:center;text-anchor:middle;shape-inside:url(#rect1211)">Develop a Relaxed
</tspan></tspan><tspan
         x="34.695963"
         y="199.83148"><tspan
           style="text-align:center;text-anchor:middle;shape-inside:url(#rect1211)">Search String</tspan></tspan></text><rect
       style="fill:#99d8c9;fill-opacity:1;stroke:none;stroke-width:0.225001;stroke-linecap:round;stroke-linejoin:round;stroke-miterlimit:4;stroke-dasharray:none;stroke-opacity:0"
       id="rect1375"
       width="120"
       height="23.907141"
       x="-156.79492"
       y="147.32439"
       rx="7.4999995"
       ry="7.5" /><text
       xml:space="preserve"
       style="font-size:10px;line-height:1.25;font-family:'Latin Modern Math';-inkscape-font-specification:'Latin Modern Math, Normal';letter-spacing:0px;word-spacing:0px;writing-mode:lr-tb;stroke-width:0.75"
       x="-152.0748"
       y="161.77795"
       id="text1215-6"><tspan
         sodipodi:role="line"
         id="tspan1213-2"
         x="-152.0748"
         y="161.77795"
         style="font-size:10px;stroke-width:0.75">Define the resource-types</tspan></text><g
       id="g2493"
       transform="translate(0.83900072)"
       inkscape:export-xdpi="300"
       inkscape:export-ydpi="300"><rect
         style="fill:#e5f5f9;fill-opacity:1;stroke:none;stroke-width:0.225;stroke-linecap:round;stroke-linejoin:round;stroke-miterlimit:4;stroke-dasharray:none;stroke-opacity:0"
         id="rect2056"
         width="130.5975"
         height="172.45595"
         x="-26.120739"
         y="5.2293291"
         rx="7.4999995"
         ry="7.4999995" /><text
         xml:space="preserve"
         style="font-size:12px;line-height:1.25;font-family:'Latin Modern Math';-inkscape-font-specification:'Latin Modern Math, Normal';letter-spacing:0px;word-spacing:0px;writing-mode:lr-tb;stroke-width:0.749999"
         x="-18.49386"
         y="21.992729"
         id="text1297"><tspan
           sodipodi:role="line"
           x="-18.49386"
           y="21.992729"
           style="font-size:12px;stroke-width:0.749999"
           id="tspan1323">Data Source Selection</tspan></text><g
         id="g2426"
         transform="rotate(-90,332.59286,297.23499)"><path
           d="m 538.32704,1.6852501 h -37"
           style="fill:none;stroke:#1c1f24;stroke-width:0.668328;stroke-linecap:butt;stroke-linejoin:miter;stroke-miterlimit:4;stroke-dasharray:1.33666, 0.668328;stroke-dashoffset:0;stroke-opacity:1"
           id="path70" /><path
           d="m 508.47104,4.6502501 -8.031,-2.953 8.031,-2.953 c -1.281,1.742 -1.277,4.129 0,5.906 z"
           style="fill:#1c1f24;fill-opacity:1;fill-rule:evenodd;stroke:#1c1f24;stroke-width:0.459475;stroke-linecap:butt;stroke-linejoin:round;stroke-miterlimit:4;stroke-dasharray:none;stroke-opacity:1"
           id="path74" /></g><rect
         style="fill:#99d8c9;fill-opacity:1;stroke:none;stroke-width:0.225001;stroke-linecap:round;stroke-linejoin:round;stroke-miterlimit:4;stroke-dasharray:none;stroke-opacity:0"
         id="rect1299"
         width="120"
         height="69.674538"
         x="-20.821987"
         y="31.824379"
         rx="7.4999995"
         ry="7.5" /><rect
         style="fill:#99d8c9;fill-opacity:1;stroke:none;stroke-width:0.225001;stroke-linecap:round;stroke-linejoin:round;stroke-miterlimit:4;stroke-dasharray:none;stroke-opacity:0"
         id="rect1305"
         width="120"
         height="33.558754"
         x="-20.821987"
         y="131.67278"
         rx="7.4999995"
         ry="7.5" /><text
         xml:space="preserve"
         style="font-size:10px;line-height:1.25;font-family:'Latin Modern Math';-inkscape-font-specification:'Latin Modern Math, Normal';letter-spacing:0px;word-spacing:0px;writing-mode:lr-tb;stroke:#000000;stroke-width:0.225;stroke-miterlimit:4;stroke-dasharray:none"
         x="-9.7618608"
         y="45.886147"
         id="text1219"><tspan
           sodipodi:role="line"
           id="tspan1217"
           x="-9.7618608"
           y="45.886147"
           style="font-size:10px;stroke:#000000;stroke-width:0.225;stroke-miterlimit:4;stroke-dasharray:none">Search for data source</tspan></text><text
         xml:space="preserve"
         style="font-size:10px;line-height:1.25;font-family:'Latin Modern Math';-inkscape-font-specification:'Latin Modern Math, Normal';letter-spacing:0px;word-spacing:0px;writing-mode:lr-tb;stroke-width:0.75"
         x="4.0981069"
         y="62.670143"
         id="text1223"><tspan
           sodipodi:role="line"
           id="tspan1221"
           x="4.0981069"
           y="62.670143"
           style="font-size:10px;stroke-width:0.75">Targeted Source</tspan></text><text
         xml:space="preserve"
         style="font-size:10px;line-height:1.25;font-family:'Latin Modern Math';-inkscape-font-specification:'Latin Modern Math, Normal';letter-spacing:0px;word-spacing:0px;writing-mode:lr-tb;stroke-width:0.75"
         x="-7.5519104"
         y="76.170143"
         id="text1227"><tspan
           sodipodi:role="line"
           id="tspan1225"
           x="-7.5519104"
           y="76.170143"
           style="font-size:10px;stroke-width:0.75">Experts Consultation</tspan></text><text
         xml:space="preserve"
         style="font-size:10px;line-height:1.25;font-family:'Latin Modern Math';-inkscape-font-specification:'Latin Modern Math, Normal';letter-spacing:0px;word-spacing:0px;writing-mode:lr-tb;stroke-width:0.75"
         x="12.573048"
         y="89.670143"
         id="text1231"><tspan
           sodipodi:role="line"
           id="tspan1229"
           x="12.573048"
           y="89.670143"
           style="font-size:10px;stroke-width:0.75">Snowballing</tspan></text><text
         xml:space="preserve"
         style="font-size:10px;line-height:1.25;font-family:'Latin Modern Math';-inkscape-font-specification:'Latin Modern Math, Normal';text-align:center;letter-spacing:0px;word-spacing:0px;writing-mode:lr-tb;text-anchor:middle;stroke-width:0.75"
         x="39.108009"
         y="144.55757"
         id="text1235"><tspan
           sodipodi:role="line"
           x="39.108009"
           y="144.55757"
           style="font-size:10px;text-align:center;text-anchor:middle;stroke-width:0.75"
           id="tspan1239">Data Source Classification</tspan><tspan
           sodipodi:role="line"
           x="39.108009"
           y="157.05757"
           style="font-size:10px;text-align:center;text-anchor:middle;stroke-width:0.75"
           id="tspan1237">(by Audience)</tspan></text></g><text
       xml:space="preserve"
       style="font-size:10px;line-height:1.25;font-family:'Latin Modern Math';-inkscape-font-specification:'Latin Modern Math, Normal';letter-spacing:0px;word-spacing:0px;writing-mode:lr-tb;stroke-width:0.75"
       x="123.06254"
       y="161.96275"
       id="text1605"><tspan
         sodipodi:role="line"
         id="tspan1603"
         x="123.06254"
         y="161.96275"
         style="font-size:10px;stroke-width:0.75" /></text><g
       id="g2517"
       transform="translate(-0.35196305)"
       inkscape:export-xdpi="300"
       inkscape:export-ydpi="300"><rect
         style="fill:#e5f5f9;fill-opacity:1;stroke:none;stroke-width:0.225;stroke-linecap:round;stroke-linejoin:round;stroke-miterlimit:4;stroke-dasharray:none;stroke-opacity:0"
         id="rect1579"
         width="130.5975"
         height="172.45595"
         x="111.88216"
         y="5.2293291"
         rx="7.4999995"
         ry="7.4999995" /><text
         xml:space="preserve"
         style="font-size:12px;line-height:1.25;font-family:'Latin Modern Math';-inkscape-font-specification:'Latin Modern Math, Normal';text-align:center;letter-spacing:0px;word-spacing:0px;writing-mode:lr-tb;text-anchor:middle;stroke-width:0.749999"
         x="177.10289"
         y="20.888729"
         id="text1583"><tspan
           sodipodi:role="line"
           id="tspan1581"
           x="177.10289"
           y="20.888729"
           style="font-size:12px;text-align:center;text-anchor:middle;stroke-width:0.749999">Incremental Screening</tspan><tspan
           sodipodi:role="line"
           x="177.10289"
           y="35.888729"
           style="font-size:12px;text-align:center;text-anchor:middle;stroke-width:0.749999"
           id="tspan1887" /></text><g
         id="g2460"
         transform="rotate(-90,373.84286,200.48499)"><path
           d="m 538.32704,1.6852501 h -37"
           style="fill:none;stroke:#1c1f24;stroke-width:0.668328;stroke-linecap:butt;stroke-linejoin:miter;stroke-miterlimit:4;stroke-dasharray:1.33666, 0.668328;stroke-dashoffset:0;stroke-opacity:1"
           id="path2456" /><path
           d="m 508.47104,4.6502501 -8.031,-2.953 8.031,-2.953 c -1.281,1.742 -1.277,4.129 0,5.906 z"
           style="fill:#1c1f24;fill-opacity:1;fill-rule:evenodd;stroke:#1c1f24;stroke-width:0.459475;stroke-linecap:butt;stroke-linejoin:round;stroke-miterlimit:4;stroke-dasharray:none;stroke-opacity:1"
           id="path2458" /></g><rect
         style="fill:#99d8c9;fill-opacity:1;stroke:none;stroke-width:0.225001;stroke-linecap:round;stroke-linejoin:round;stroke-miterlimit:4;stroke-dasharray:none;stroke-opacity:0"
         id="rect1587"
         width="120"
         height="23.907141"
         x="117.18091"
         y="31.824379"
         rx="7.5"
         ry="7.5" /><g
         id="g2466"
         transform="rotate(-90,401.59286,228.23499)"><path
           d="m 538.32704,1.6852501 h -37"
           style="fill:none;stroke:#1c1f24;stroke-width:0.668328;stroke-linecap:butt;stroke-linejoin:miter;stroke-miterlimit:4;stroke-dasharray:1.33666, 0.668328;stroke-dashoffset:0;stroke-opacity:1"
           id="path2462" /><path
           d="m 508.47104,4.6502501 -8.031,-2.953 8.031,-2.953 c -1.281,1.742 -1.277,4.129 0,5.906 z"
           style="fill:#1c1f24;fill-opacity:1;fill-rule:evenodd;stroke:#1c1f24;stroke-width:0.459475;stroke-linecap:butt;stroke-linejoin:round;stroke-miterlimit:4;stroke-dasharray:none;stroke-opacity:1"
           id="path2464" /></g><rect
         style="fill:#99d8c9;fill-opacity:1;stroke:none;stroke-width:0.225001;stroke-linecap:round;stroke-linejoin:round;stroke-miterlimit:4;stroke-dasharray:none;stroke-opacity:0"
         id="rect1589"
         width="120"
         height="36.129414"
         x="117.18091"
         y="75.509163"
         rx="7.4999995"
         ry="7.5" /><text
         xml:space="preserve"
         style="font-size:10px;line-height:1.25;font-family:'Latin Modern Math';-inkscape-font-specification:'Latin Modern Math, Normal';letter-spacing:0px;word-spacing:0px;writing-mode:lr-tb;stroke-width:0.75"
         x="128.80098"
         y="46.674332"
         id="text1243"><tspan
           sodipodi:role="line"
           id="tspan1241"
           x="128.80098"
           y="46.674332"
           style="font-size:10px;stroke-width:0.75">Grouping by Audience</tspan></text><text
         xml:space="preserve"
         style="font-size:10px;line-height:1.25;font-family:'Latin Modern Math';-inkscape-font-specification:'Latin Modern Math, Normal';text-align:center;letter-spacing:0px;word-spacing:0px;writing-mode:lr-tb;text-anchor:middle;stroke-width:0.75"
         x="177.18091"
         y="90.090851"
         id="text1247"><tspan
           sodipodi:role="line"
           id="tspan1245"
           x="177.18091"
           y="90.090851"
           style="font-size:10px;text-align:center;text-anchor:middle;stroke-width:0.75">Speed Reading</tspan><tspan
           sodipodi:role="line"
           x="177.18091"
           y="102.59085"
           style="font-size:10px;text-align:center;text-anchor:middle;stroke-width:0.75"
           id="tspan1249">(Looking for Keywords)</tspan></text><rect
         style="fill:#99d8c9;fill-opacity:1;stroke:none;stroke-width:0.225001;stroke-linecap:round;stroke-linejoin:round;stroke-miterlimit:4;stroke-dasharray:none;stroke-opacity:0"
         id="rect1975"
         width="120"
         height="36.129414"
         x="117.18091"
         y="131.00917"
         rx="7.4999995"
         ry="7.5" /><text
         xml:space="preserve"
         style="font-size:10px;line-height:1.25;font-family:'Latin Modern Math';-inkscape-font-specification:'Latin Modern Math, Normal';text-align:center;letter-spacing:0px;word-spacing:0px;writing-mode:lr-tb;text-anchor:middle;stroke-width:0.75"
         x="177.13091"
         y="144.96016"
         id="text1247-5"><tspan
           sodipodi:role="line"
           x="177.13091"
           y="144.96016"
           style="font-size:10px;text-align:center;text-anchor:middle;stroke-width:0.75"
           id="tspan1969">Screening by</tspan><tspan
           sodipodi:role="line"
           x="177.13091"
           y="157.46016"
           style="font-size:10px;text-align:center;text-anchor:middle;stroke-width:0.75"
           id="tspan1973">Formality Level</tspan><tspan
           sodipodi:role="line"
           x="177.13091"
           y="169.96016"
           style="font-size:10px;text-align:center;text-anchor:middle;stroke-width:0.75"
           id="tspan1249-5" /></text></g><g
       id="g2535"
       inkscape:export-xdpi="300"
       inkscape:export-ydpi="300"><rect
         style="fill:#e5f5f9;fill-opacity:1;stroke:none;stroke-width:0.225;stroke-linecap:round;stroke-linejoin:round;stroke-miterlimit:4;stroke-dasharray:none;stroke-opacity:0"
         id="rect2013"
         width="130.5975"
         height="172.45595"
         x="248.34216"
         y="5.2293291"
         rx="7.4999995"
         ry="7.4999995" /><text
         xml:space="preserve"
         style="font-size:12px;line-height:1.25;font-family:'Latin Modern Math';-inkscape-font-specification:'Latin Modern Math, Normal';text-align:center;letter-spacing:0px;word-spacing:0px;writing-mode:lr-tb;text-anchor:middle;stroke-width:0.749999"
         x="313.50891"
         y="20.96073"
         id="text2019"><tspan
           sodipodi:role="line"
           x="313.50891"
           y="20.96073"
           style="font-size:12px;text-align:center;text-anchor:middle;stroke-width:0.749999"
           id="tspan2017">Content Analysis</tspan></text><g
         id="g2472"
         transform="rotate(-90,472.09286,157.73499)"><path
           d="m 538.32704,1.6852501 h -37"
           style="fill:none;stroke:#1c1f24;stroke-width:0.668328;stroke-linecap:butt;stroke-linejoin:miter;stroke-miterlimit:4;stroke-dasharray:1.33666, 0.668328;stroke-dashoffset:0;stroke-opacity:1"
           id="path2468" /><path
           d="m 508.47104,4.6502501 -8.031,-2.953 8.031,-2.953 c -1.281,1.742 -1.277,4.129 0,5.906 z"
           style="fill:#1c1f24;fill-opacity:1;fill-rule:evenodd;stroke:#1c1f24;stroke-width:0.459475;stroke-linecap:butt;stroke-linejoin:round;stroke-miterlimit:4;stroke-dasharray:none;stroke-opacity:1"
           id="path2470" /></g><rect
         style="fill:#99d8c9;fill-opacity:1;stroke:none;stroke-width:0.225001;stroke-linecap:round;stroke-linejoin:round;stroke-miterlimit:4;stroke-dasharray:none;stroke-opacity:0"
         id="rect2021"
         width="120"
         height="23.907141"
         x="253.64091"
         y="75.509178"
         rx="7.5"
         ry="7.5" /><rect
         style="fill:#99d8c9;fill-opacity:1;stroke:none;stroke-width:0.225001;stroke-linecap:round;stroke-linejoin:round;stroke-miterlimit:4;stroke-dasharray:none;stroke-opacity:0"
         id="rect2023"
         width="120"
         height="36.129414"
         x="253.64091"
         y="31.824379"
         rx="7.4999995"
         ry="7.5" /><text
         xml:space="preserve"
         style="font-size:10px;line-height:1.25;font-family:'Latin Modern Math';-inkscape-font-specification:'Latin Modern Math, Normal';letter-spacing:0px;word-spacing:0px;writing-mode:lr-tb;stroke-width:0.75"
         x="297.87595"
         y="89.957748"
         id="text2027"><tspan
           sodipodi:role="line"
           id="tspan2025"
           x="297.87595"
           y="89.957748"
           style="font-size:10px;stroke-width:0.75">Coding</tspan></text><text
         xml:space="preserve"
         style="font-size:10px;line-height:1.25;font-family:'Latin Modern Math';-inkscape-font-specification:'Latin Modern Math, Normal';text-align:center;letter-spacing:0px;word-spacing:0px;writing-mode:lr-tb;text-anchor:middle;stroke-width:0.75"
         x="313.64093"
         y="46.590851"
         id="text2033"><tspan
           sodipodi:role="line"
           x="313.64093"
           y="46.590851"
           style="font-size:10px;text-align:center;text-anchor:middle;stroke-width:0.75"
           id="tspan2031">Word Cloud</tspan><tspan
           sodipodi:role="line"
           x="313.64093"
           y="59.090851"
           style="font-size:10px;text-align:center;text-anchor:middle;stroke-width:0.75"
           id="tspan2049">(NLP Script)</tspan></text><rect
         style="fill:#99d8c9;fill-opacity:1;stroke:none;stroke-width:0.225001;stroke-linecap:round;stroke-linejoin:round;stroke-miterlimit:4;stroke-dasharray:none;stroke-opacity:0"
         id="rect2035"
         width="120"
         height="36.129414"
         x="253.64091"
         y="133.39545"
         rx="7.4999995"
         ry="7.5" /><text
         xml:space="preserve"
         style="font-size:10px;line-height:1.25;font-family:'Latin Modern Math';-inkscape-font-specification:'Latin Modern Math, Normal';text-align:center;letter-spacing:0px;word-spacing:0px;writing-mode:lr-tb;text-anchor:middle;stroke-width:0.75"
         x="313.63092"
         y="153.96016"
         id="text2043"><tspan
           sodipodi:role="line"
           x="313.63092"
           y="153.96016"
           style="font-size:10px;text-align:center;text-anchor:middle;stroke-width:0.75"
           id="tspan2041">Mind Map</tspan></text></g></g></svg>
