<?xml version="1.0" encoding="UTF-8" standalone="no"?>
<!-- Created with Inkscape (http://www.inkscape.org/) -->

<svg
   xmlns:dc="http://purl.org/dc/elements/1.1/"
   xmlns:cc="http://creativecommons.org/ns#"
   xmlns:rdf="http://www.w3.org/1999/02/22-rdf-syntax-ns#"
   xmlns:svg="http://www.w3.org/2000/svg"
   xmlns="http://www.w3.org/2000/svg"
   xmlns:sodipodi="http://sodipodi.sourceforge.net/DTD/sodipodi-0.dtd"
   xmlns:inkscape="http://www.inkscape.org/namespaces/inkscape"
   width="292.2189mm"
   height="117.47176mm"
   viewBox="0 0 292.2189 117.47176"
   version="1.1"
   id="svg4805"
   inkscape:version="0.92.4 (5da689c313, 2019-01-14)"
   sodipodi:docname="workflow.svg"
   inkscape:export-filename="/home/melissawen/Mestrado/msc-melissawen/papers/current/opensym2019/figure/workflow.png"
   inkscape:export-xdpi="90"
   inkscape:export-ydpi="90">
  <defs
     id="defs4799">
    <marker
       inkscape:stockid="Arrow2Send"
       orient="auto"
       refY="0"
       refX="0"
       id="marker7389-2"
       style="overflow:visible"
       inkscape:isstock="true">
      <path
         inkscape:connector-curvature="0"
         id="path7387-9"
         style="fill:#4d4d4d;fill-opacity:1;fill-rule:evenodd;stroke:#4d4d4d;stroke-width:0.625;stroke-linejoin:round;stroke-opacity:1"
         d="M 8.7185878,4.0337352 -2.2072895,0.01601326 8.7185884,-4.0017078 c -1.7454984,2.3720609 -1.7354408,5.6174519 -6e-7,8.035443 z"
         transform="matrix(-0.3,0,0,-0.3,0.69,0)" />
    </marker>
    <marker
       inkscape:stockid="Arrow2Send"
       orient="auto"
       refY="0"
       refX="0"
       id="marker15694-6"
       style="overflow:visible"
       inkscape:isstock="true"
       inkscape:collect="always">
      <path
         inkscape:connector-curvature="0"
         id="path15692-0"
         style="fill:#4d4d4d;fill-opacity:1;fill-rule:evenodd;stroke:#4d4d4d;stroke-width:0.625;stroke-linejoin:round;stroke-opacity:1"
         d="M 8.7185878,4.0337352 -2.2072895,0.01601326 8.7185884,-4.0017078 c -1.7454984,2.3720609 -1.7354408,5.6174519 -6e-7,8.035443 z"
         transform="matrix(-0.3,0,0,-0.3,0.69,0)" />
    </marker>
    <marker
       inkscape:stockid="DotM"
       orient="auto"
       refY="0"
       refX="0"
       id="marker8298-2"
       style="overflow:visible"
       inkscape:isstock="true">
      <path
         inkscape:connector-curvature="0"
         id="path8296-7"
         d="m -2.5,-1 c 0,2.76 -2.24,5 -5,5 -2.76,0 -5,-2.24 -5,-5 0,-2.76 2.24,-5 5,-5 2.76,0 5,2.24 5,5 z"
         style="fill:#4d4d4d;fill-opacity:1;fill-rule:evenodd;stroke:#4d4d4d;stroke-width:1.00000003pt;stroke-opacity:1"
         transform="matrix(0.4,0,0,0.4,2.96,0.4)" />
    </marker>
    <marker
       inkscape:stockid="DotM"
       orient="auto"
       refY="0"
       refX="0"
       id="marker17974-0"
       style="overflow:visible"
       inkscape:isstock="true">
      <path
         inkscape:connector-curvature="0"
         id="path17972-9"
         d="m -2.5,-1 c 0,2.76 -2.24,5 -5,5 -2.76,0 -5,-2.24 -5,-5 0,-2.76 2.24,-5 5,-5 2.76,0 5,2.24 5,5 z"
         style="fill:#4d4d4d;fill-opacity:1;fill-rule:evenodd;stroke:#4d4d4d;stroke-width:1.00000003pt;stroke-opacity:1"
         transform="matrix(0.4,0,0,0.4,2.96,0.4)" />
    </marker>
    <marker
       inkscape:stockid="Arrow2Send"
       orient="auto"
       refY="0"
       refX="0"
       id="marker4829"
       style="overflow:visible"
       inkscape:isstock="true">
      <path
         inkscape:connector-curvature="0"
         id="path4827"
         style="fill:#4d4d4d;fill-opacity:1;fill-rule:evenodd;stroke:#4d4d4d;stroke-width:0.625;stroke-linejoin:round;stroke-opacity:1"
         d="M 8.7185878,4.0337352 -2.2072895,0.01601326 8.7185884,-4.0017078 c -1.7454984,2.3720609 -1.7354408,5.6174519 -6e-7,8.035443 z"
         transform="matrix(-0.3,0,0,-0.3,0.69,0)" />
    </marker>
    <marker
       inkscape:stockid="Arrow2Send"
       orient="auto"
       refY="0"
       refX="0"
       id="marker7389-3"
       style="overflow:visible"
       inkscape:isstock="true">
      <path
         inkscape:connector-curvature="0"
         id="path7387-5"
         style="fill:#4d4d4d;fill-opacity:1;fill-rule:evenodd;stroke:#4d4d4d;stroke-width:0.625;stroke-linejoin:round;stroke-opacity:1"
         d="M 8.7185878,4.0337352 -2.2072895,0.01601326 8.7185884,-4.0017078 c -1.7454984,2.3720609 -1.7354408,5.6174519 -6e-7,8.035443 z"
         transform="matrix(-0.3,0,0,-0.3,0.69,0)" />
    </marker>
    <marker
       inkscape:stockid="Arrow2Send"
       orient="auto"
       refY="0"
       refX="0"
       id="marker7389-6"
       style="overflow:visible"
       inkscape:isstock="true">
      <path
         inkscape:connector-curvature="0"
         id="path7387-7"
         style="fill:#4d4d4d;fill-opacity:1;fill-rule:evenodd;stroke:#4d4d4d;stroke-width:0.625;stroke-linejoin:round;stroke-opacity:1"
         d="M 8.7185878,4.0337352 -2.2072895,0.01601326 8.7185884,-4.0017078 c -1.7454984,2.3720609 -1.7354408,5.6174519 -6e-7,8.035443 z"
         transform="matrix(-0.3,0,0,-0.3,0.69,0)" />
    </marker>
  </defs>
  <sodipodi:namedview
     id="base"
     pagecolor="#ffffff"
     bordercolor="#666666"
     borderopacity="1.0"
     inkscape:pageopacity="0.0"
     inkscape:pageshadow="2"
     inkscape:zoom="0.98994949"
     inkscape:cx="323.65001"
     inkscape:cy="272.57246"
     inkscape:document-units="mm"
     inkscape:current-layer="layer1"
     showgrid="false"
     fit-margin-top="0"
     fit-margin-left="0"
     fit-margin-right="0"
     fit-margin-bottom="0"
     inkscape:window-width="1920"
     inkscape:window-height="1009"
     inkscape:window-x="0"
     inkscape:window-y="34"
     inkscape:window-maximized="1" />
  <metadata
     id="metadata4802">
    <rdf:RDF>
      <cc:Work
         rdf:about="">
        <dc:format>image/svg+xml</dc:format>
        <dc:type
           rdf:resource="http://purl.org/dc/dcmitype/StillImage" />
        <dc:title />
      </cc:Work>
    </rdf:RDF>
  </metadata>
  <g
     inkscape:label="Camada 1"
     inkscape:groupmode="layer"
     id="layer1"
     transform="translate(-2.6749812,-119.07169)">
    <path
       style="fill:none;fill-rule:evenodd;stroke:#4d4d4d;stroke-width:0.8235727;stroke-linecap:round;stroke-linejoin:round;stroke-miterlimit:4;stroke-dasharray:none;stroke-dashoffset:0;stroke-opacity:1;marker-end:url(#marker7389-6);paint-order:normal"
       d="m 30.588517,142.00017 v 15.1523"
       id="path7385-5"
       inkscape:connector-curvature="0"
       inkscape:export-filename="/home/siqueira/Documents/usp/mestrado/thesis/quali/figures/apache_arhitecture.png"
       inkscape:export-xdpi="144.75999"
       inkscape:export-ydpi="144.75999"
       sodipodi:nodetypes="cc" />
    <rect
       inkscape:export-ydpi="144.75999"
       inkscape:export-xdpi="144.75999"
       inkscape:export-filename="/home/siqueira/Documents/Repositories/modelo-latex/figuras/nooks_nim.png"
       ry="0.014259494"
       y="8.2209196"
       x="-144.88979"
       height="45.903831"
       width="19.859051"
       id="rect1153"
       style="opacity:1;fill:#a7b3cd;fill-opacity:1;stroke:#a7b3cd;stroke-width:0.86379266;stroke-linecap:square;stroke-linejoin:bevel;stroke-miterlimit:4;stroke-dasharray:none;stroke-opacity:1"
       transform="rotate(-90)"
       rx="0.014259494" />
    <text
       xml:space="preserve"
       style="font-style:normal;font-variant:normal;font-weight:normal;font-stretch:normal;font-size:2.1790359px;line-height:1.36189759px;font-family:'Open Sans';-inkscape-font-specification:'Open Sans';letter-spacing:0px;word-spacing:0px;fill:#000000;fill-opacity:1;stroke:none;stroke-width:0.0544759px;stroke-linecap:butt;stroke-linejoin:miter;stroke-opacity:1"
       x="31.138912"
       y="134.24518"
       id="text2119"><tspan
         id="tspan2117"
         sodipodi:role="line"
         x="31.138912"
         y="134.24518"
         style="font-style:normal;font-variant:normal;font-weight:bold;font-stretch:normal;font-size:5.08441734px;line-height:4.90283108px;font-family:'Latin Modern Math';-inkscape-font-specification:'Latin Modern Math Bold';text-align:center;text-anchor:middle;stroke:#000000;stroke-width:0.0544759px">Review of</tspan><tspan
         sodipodi:role="line"
         x="31.138912"
         y="139.14801"
         style="font-style:normal;font-variant:normal;font-weight:bold;font-stretch:normal;font-size:5.08441734px;line-height:4.90283108px;font-family:'Latin Modern Math';-inkscape-font-specification:'Latin Modern Math Bold';text-align:center;text-anchor:middle;stroke:#000000;stroke-width:0.0544759px"
         id="tspan4505">Literature Review</tspan></text>
    <path
       style="fill:none;fill-rule:evenodd;stroke:#4d4d4d;stroke-width:0.8235727;stroke-linecap:round;stroke-linejoin:round;stroke-miterlimit:4;stroke-dasharray:none;stroke-dashoffset:0;stroke-opacity:1;marker-end:url(#marker7389-3);paint-order:normal"
       d="m 31.255501,176.23372 v 15.1523"
       id="path7385-6"
       inkscape:connector-curvature="0"
       inkscape:export-filename="/home/siqueira/Documents/usp/mestrado/thesis/quali/figures/apache_arhitecture.png"
       inkscape:export-xdpi="144.75999"
       inkscape:export-ydpi="144.75999"
       sodipodi:nodetypes="cc" />
    <rect
       rx="0.014259496"
       transform="rotate(-90)"
       style="opacity:1;fill:#dbdee3;fill-opacity:1;stroke:#a7b3cd;stroke-width:0.86379266;stroke-linecap:square;stroke-linejoin:bevel;stroke-miterlimit:4;stroke-dasharray:none;stroke-opacity:1"
       id="rect4507"
       width="19.859051"
       height="45.903831"
       x="-178.63188"
       y="8.2209139"
       ry="0.014259496"
       inkscape:export-filename="/home/siqueira/Documents/Repositories/modelo-latex/figuras/nooks_nim.png"
       inkscape:export-xdpi="144.75999"
       inkscape:export-ydpi="144.75999" />
    <text
       id="text4513"
       y="167.98727"
       x="31.102564"
       style="font-style:normal;font-variant:normal;font-weight:normal;font-stretch:normal;font-size:2.1790359px;line-height:1.36189759px;font-family:'Open Sans';-inkscape-font-specification:'Open Sans';letter-spacing:0px;word-spacing:0px;fill:#000000;fill-opacity:1;stroke:none;stroke-width:0.0544759px;stroke-linecap:butt;stroke-linejoin:miter;stroke-opacity:1"
       xml:space="preserve"><tspan
         id="tspan4511"
         style="font-style:normal;font-variant:normal;font-weight:bold;font-stretch:normal;font-size:5.08441734px;line-height:4.90283108px;font-family:'Latin Modern Math';-inkscape-font-specification:'Latin Modern Math Bold';text-align:center;text-anchor:middle;stroke:#000000;stroke-width:0.0544759px"
         y="167.98727"
         x="31.102564"
         sodipodi:role="line">Grey Literature</tspan><tspan
         style="font-style:normal;font-variant:normal;font-weight:bold;font-stretch:normal;font-size:5.08441734px;line-height:4.90283108px;font-family:'Latin Modern Math';-inkscape-font-specification:'Latin Modern Math Bold';text-align:center;text-anchor:middle;stroke:#000000;stroke-width:0.0544759px"
         y="172.89011"
         x="31.102564"
         sodipodi:role="line"
         id="tspan4517">Review</tspan></text>
    <rect
       inkscape:export-ydpi="144.75999"
       inkscape:export-xdpi="144.75999"
       inkscape:export-filename="/home/siqueira/Documents/Repositories/modelo-latex/figuras/nooks_nim.png"
       ry="0.014259496"
       y="8.2209139"
       x="-212.62537"
       height="45.903831"
       width="19.859051"
       id="rect4519"
       style="opacity:1;fill:#dbdee3;fill-opacity:1;stroke:#dbdee3;stroke-width:0.86379266;stroke-linecap:square;stroke-linejoin:bevel;stroke-miterlimit:4;stroke-dasharray:none;stroke-opacity:1"
       transform="rotate(-90)"
       rx="0.014259496" />
    <text
       xml:space="preserve"
       style="font-style:normal;font-variant:normal;font-weight:normal;font-stretch:normal;font-size:2.1790359px;line-height:1.36189759px;font-family:'Open Sans';-inkscape-font-specification:'Open Sans';letter-spacing:0px;word-spacing:0px;fill:#000000;fill-opacity:1;stroke:none;stroke-width:0.0544759px;stroke-linecap:butt;stroke-linejoin:miter;stroke-opacity:1"
       x="31.138914"
       y="201.98076"
       id="text4525"><tspan
         sodipodi:role="line"
         x="31.138914"
         y="201.98076"
         style="font-style:normal;font-variant:normal;font-weight:bold;font-stretch:normal;font-size:5.08441734px;line-height:4.90283108px;font-family:'Latin Modern Math';-inkscape-font-specification:'Latin Modern Math Bold';text-align:center;text-anchor:middle;stroke:#000000;stroke-width:0.0544759px"
         id="tspan4521">Systematic Formal</tspan><tspan
         id="tspan4523"
         sodipodi:role="line"
         x="31.138914"
         y="206.88359"
         style="font-style:normal;font-variant:normal;font-weight:bold;font-stretch:normal;font-size:5.08441734px;line-height:4.90283108px;font-family:'Latin Modern Math';-inkscape-font-specification:'Latin Modern Math Bold';text-align:center;text-anchor:middle;stroke:#000000;stroke-width:0.0544759px">Literature Review</tspan></text>
    <ellipse
       style="opacity:1;fill:#d7eef4;fill-opacity:1;stroke:#5fbcd3;stroke-width:0.61767954;stroke-linecap:round;stroke-linejoin:round;stroke-miterlimit:4;stroke-dasharray:none;stroke-dashoffset:0;stroke-opacity:1"
       id="ellipse4556"
       cx="108.84367"
       cy="191.89325"
       rx="26.377483"
       ry="11.864255" />
    <text
       xml:space="preserve"
       style="font-style:normal;font-variant:normal;font-weight:normal;font-stretch:normal;font-size:2.1790359px;line-height:1.36189759px;font-family:'Open Sans';-inkscape-font-specification:'Open Sans';letter-spacing:0px;word-spacing:0px;fill:#000000;fill-opacity:1;stroke:none;stroke-width:0.0544759px;stroke-linecap:butt;stroke-linejoin:miter;stroke-opacity:1"
       x="108.61971"
       y="190.71294"
       id="text4533"><tspan
         id="tspan4531"
         sodipodi:role="line"
         x="108.61971"
         y="190.71294"
         style="font-style:normal;font-variant:normal;font-weight:bold;font-stretch:normal;font-size:5.08441734px;line-height:4.90283108px;font-family:'Latin Modern Math';-inkscape-font-specification:'Latin Modern Math Bold';text-align:center;text-anchor:middle;stroke:#000000;stroke-width:0.0544759px">Index</tspan><tspan
         sodipodi:role="line"
         x="108.61971"
         y="195.61577"
         style="font-style:normal;font-variant:normal;font-weight:bold;font-stretch:normal;font-size:5.08441734px;line-height:4.90283108px;font-family:'Latin Modern Math';-inkscape-font-specification:'Latin Modern Math Bold';text-align:center;text-anchor:middle;stroke:#000000;stroke-width:0.0544759px"
         id="tspan4537">Evidence and Gaps</tspan></text>
    <rect
       rx="2.2929254"
       style="opacity:1;vector-effect:none;fill:none;fill-opacity:1;stroke:#6f6f91;stroke-width:0.41178635;stroke-linecap:butt;stroke-linejoin:miter;stroke-miterlimit:4;stroke-dasharray:0.41178636, 0.82357270999999999;stroke-dashoffset:0;stroke-opacity:1;paint-order:normal"
       id="rect399-7"
       width="56.303627"
       height="117.05996"
       x="2.8808744"
       y="119.27759"
       ry="2.181088"
       inkscape:export-filename="/home/siqueira/Documents/Code/articles/ieeeSW/releaseEng3/figures/pipeline_2.png"
       inkscape:export-xdpi="59.993629"
       inkscape:export-ydpi="59.993629" />
    <rect
       rx="0.011955453"
       inkscape:export-ydpi="144.75999"
       inkscape:export-xdpi="144.75999"
       inkscape:export-filename="/home/siqueira/Documents/Repositories/modelo-latex/figuras/nooks_nim.png"
       ry="0.011955454"
       y="165.55026"
       x="-173.21338"
       height="45.143143"
       width="16.337196"
       id="rect4790"
       style="opacity:1;fill:#dbdee3;fill-opacity:1;stroke:#dbdee3;stroke-width:0.86379266;stroke-linecap:square;stroke-linejoin:bevel;stroke-miterlimit:4;stroke-dasharray:none;stroke-opacity:1"
       transform="rotate(-90)" />
    <text
       xml:space="preserve"
       style="font-style:normal;font-variant:normal;font-weight:normal;font-stretch:normal;font-size:2.1790359px;line-height:3.18139267px;font-family:'Open Sans';-inkscape-font-specification:'Open Sans';letter-spacing:0px;word-spacing:0px;fill:#000000;fill-opacity:1;stroke:none;stroke-width:0.0544759px;stroke-linecap:butt;stroke-linejoin:miter;stroke-opacity:1"
       x="187.69754"
       y="166.25742"
       id="text4594"><tspan
         id="tspan4592"
         sodipodi:role="line"
         x="187.69754"
         y="166.25742"
         style="font-style:normal;font-variant:normal;font-weight:bold;font-stretch:normal;font-size:5.08441734px;line-height:4.90283108px;font-family:'Latin Modern Math';-inkscape-font-specification:'Latin Modern Math Bold';text-align:center;text-anchor:middle;stroke:#000000;stroke-width:0.0544759px">Data Mining</tspan></text>
    <rect
       transform="rotate(-90)"
       style="opacity:1;fill:#d7eef4;fill-opacity:1;stroke:#5fbcd3;stroke-width:0.86379266;stroke-linecap:square;stroke-linejoin:bevel;stroke-miterlimit:4;stroke-dasharray:none;stroke-opacity:1"
       id="rect4622"
       width="21.39986"
       height="58.350098"
       x="-140.90346"
       y="158.57333"
       ry="0.011955456"
       inkscape:export-filename="/home/siqueira/Documents/Repositories/modelo-latex/figuras/nooks_nim.png"
       inkscape:export-xdpi="144.75999"
       inkscape:export-ydpi="144.75999"
       rx="0.011955453" />
    <text
       id="text4626"
       y="126.4735"
       x="187.75011"
       style="font-style:normal;font-variant:normal;font-weight:normal;font-stretch:normal;font-size:2.1790359px;line-height:3.18139267px;font-family:'Open Sans';-inkscape-font-specification:'Open Sans';letter-spacing:0px;word-spacing:0px;fill:#000000;fill-opacity:1;stroke:none;stroke-width:0.0544759px;stroke-linecap:butt;stroke-linejoin:miter;stroke-opacity:1"
       xml:space="preserve"><tspan
         style="font-style:normal;font-variant:normal;font-weight:bold;font-stretch:normal;font-size:5.08441734px;line-height:4.90283108px;font-family:'Latin Modern Math';-inkscape-font-specification:'Latin Modern Math Bold';text-align:center;text-anchor:middle;stroke:#000000;stroke-width:0.0544759px"
         y="126.4735"
         x="187.75011"
         sodipodi:role="line"
         id="tspan4624">FLOSS Project</tspan><tspan
         style="font-style:normal;font-variant:normal;font-weight:bold;font-stretch:normal;font-size:5.08441734px;line-height:4.90283108px;font-family:'Latin Modern Math';-inkscape-font-specification:'Latin Modern Math Bold';text-align:center;text-anchor:middle;stroke:#000000;stroke-width:0.0544759px"
         y="131.50261"
         x="187.75011"
         sodipodi:role="line"
         id="tspan4628">Data Interaction</tspan><tspan
         style="font-style:normal;font-variant:normal;font-weight:bold;font-stretch:normal;font-size:5.08441734px;line-height:4.90283108px;font-family:'Latin Modern Math';-inkscape-font-specification:'Latin Modern Math Bold';text-align:center;text-anchor:middle;stroke:#000000;stroke-width:0.0544759px"
         y="136.53172"
         x="187.75011"
         sodipodi:role="line"
         id="tspan4634">Collector Development</tspan></text>
    <rect
       transform="rotate(-90)"
       style="opacity:1;fill:#dbdee3;fill-opacity:1;stroke:#a7b3cd;stroke-width:0.86379266;stroke-linecap:square;stroke-linejoin:bevel;stroke-miterlimit:4;stroke-dasharray:none;stroke-opacity:1"
       id="rect4636"
       width="16.337196"
       height="45.143143"
       x="-199.71634"
       y="165.55026"
       ry="0.011955454"
       inkscape:export-filename="/home/siqueira/Documents/Repositories/modelo-latex/figuras/nooks_nim.png"
       inkscape:export-xdpi="144.75999"
       inkscape:export-ydpi="144.75999"
       rx="0.011955453" />
    <text
       id="text4640"
       y="192.76039"
       x="187.72205"
       style="font-style:normal;font-variant:normal;font-weight:normal;font-stretch:normal;font-size:2.1790359px;line-height:3.18139267px;font-family:'Open Sans';-inkscape-font-specification:'Open Sans';letter-spacing:0px;word-spacing:0px;fill:#000000;fill-opacity:1;stroke:none;stroke-width:0.0544759px;stroke-linecap:butt;stroke-linejoin:miter;stroke-opacity:1"
       xml:space="preserve"><tspan
         style="font-style:normal;font-variant:normal;font-weight:bold;font-stretch:normal;font-size:5.08441734px;line-height:4.90283108px;font-family:'Latin Modern Math';-inkscape-font-specification:'Latin Modern Math Bold';text-align:center;text-anchor:middle;stroke:#000000;stroke-width:0.0544759px"
         y="192.76039"
         x="187.72205"
         sodipodi:role="line"
         id="tspan4638">Action-Research</tspan></text>
    <rect
       inkscape:export-ydpi="59.993629"
       inkscape:export-xdpi="59.993629"
       inkscape:export-filename="/home/siqueira/Documents/Code/articles/ieeeSW/releaseEng3/figures/pipeline_2.png"
       ry="2.4037962"
       y="150.02087"
       x="158.64932"
       height="86.316681"
       width="58.945019"
       id="rect4642"
       style="opacity:1;vector-effect:none;fill:none;fill-opacity:1;stroke:#6f6f91;stroke-width:0.43229896;stroke-linecap:butt;stroke-linejoin:miter;stroke-miterlimit:4;stroke-dasharray:0.43229897, 0.86459794999999984;stroke-dashoffset:0;stroke-opacity:1;paint-order:normal"
       rx="2.2929254" />
    <text
       id="text4656"
       y="222.58273"
       x="30.998764"
       style="font-style:normal;font-variant:normal;font-weight:normal;font-stretch:normal;font-size:2.1790359px;line-height:1.36189759px;font-family:'Open Sans';-inkscape-font-specification:'Open Sans';letter-spacing:0px;word-spacing:0px;fill:#000000;fill-opacity:1;stroke:none;stroke-width:0.0544759px;stroke-linecap:butt;stroke-linejoin:miter;stroke-opacity:1"
       xml:space="preserve"><tspan
         style="font-style:normal;font-variant:normal;font-weight:bold;font-stretch:normal;font-size:5.08441734px;line-height:4.90283108px;font-family:'Latin Modern Math';-inkscape-font-specification:'Latin Modern Math Bold';text-align:center;text-anchor:middle;stroke:#000000;stroke-width:0.0544759px"
         y="223.83252"
         x="30.998764"
         sodipodi:role="line"
         id="tspan4652" /><tspan
         id="tspan4654"
         style="font-style:normal;font-variant:normal;font-weight:bold;font-stretch:normal;font-size:5.08441734px;line-height:4.90283108px;font-family:'Latin Modern Math';-inkscape-font-specification:'Latin Modern Math Bold';text-align:center;text-anchor:middle;stroke:#000000;stroke-width:0.0544759px"
         y="227.95187"
         x="30.998764"
         sodipodi:role="line">Multivocal</tspan><tspan
         style="font-style:normal;font-variant:normal;font-weight:bold;font-stretch:normal;font-size:5.08441734px;line-height:4.90283108px;font-family:'Latin Modern Math';-inkscape-font-specification:'Latin Modern Math Bold';text-align:center;text-anchor:middle;stroke:#000000;stroke-width:0.0544759px"
         y="232.85471"
         x="30.998764"
         sodipodi:role="line"
         id="tspan84">Literature Review</tspan></text>
    <text
       xml:space="preserve"
       style="font-style:normal;font-variant:normal;font-weight:normal;font-stretch:normal;font-size:2.1790359px;line-height:1.36189759px;font-family:'Open Sans';-inkscape-font-specification:'Open Sans';letter-spacing:0px;word-spacing:0px;fill:#000000;fill-opacity:1;stroke:none;stroke-width:0.0544759px;stroke-linecap:butt;stroke-linejoin:miter;stroke-opacity:1"
       x="188.08713"
       y="226.94388"
       id="text4666"><tspan
         id="tspan4662"
         sodipodi:role="line"
         x="188.08713"
         y="228.19366"
         style="font-style:normal;font-variant:normal;font-weight:bold;font-stretch:normal;font-size:5.08441734px;line-height:4.90283108px;font-family:'Latin Modern Math';-inkscape-font-specification:'Latin Modern Math Bold';text-align:center;text-anchor:middle;stroke:#000000;stroke-width:0.0544759px" /><tspan
         sodipodi:role="line"
         x="188.08713"
         y="232.31302"
         style="font-style:normal;font-variant:normal;font-weight:bold;font-stretch:normal;font-size:5.08441734px;line-height:4.90283108px;font-family:'Latin Modern Math';-inkscape-font-specification:'Latin Modern Math Bold';text-align:center;text-anchor:middle;stroke:#000000;stroke-width:0.0544759px"
         id="tspan4664">Linux Case Study</tspan></text>
    <ellipse
       ry="12.744719"
       rx="26.377483"
       cy="192.33348"
       cx="268.20755"
       id="ellipse4674"
       style="opacity:1;fill:#d7eef4;fill-opacity:1;stroke:#5fbcd3;stroke-width:0.61767954;stroke-linecap:round;stroke-linejoin:round;stroke-miterlimit:4;stroke-dasharray:none;stroke-dashoffset:0;stroke-opacity:1" />
    <text
       id="text4680"
       y="188.67081"
       x="267.98358"
       style="font-style:normal;font-variant:normal;font-weight:normal;font-stretch:normal;font-size:2.1790359px;line-height:1.36189759px;font-family:'Open Sans';-inkscape-font-specification:'Open Sans';letter-spacing:0px;word-spacing:0px;fill:#000000;fill-opacity:1;stroke:none;stroke-width:0.0544759px;stroke-linecap:butt;stroke-linejoin:miter;stroke-opacity:1"
       xml:space="preserve"><tspan
         id="tspan4678"
         style="font-style:normal;font-variant:normal;font-weight:bold;font-stretch:normal;font-size:5.08441734px;line-height:4.90283108px;font-family:'Latin Modern Math';-inkscape-font-specification:'Latin Modern Math Bold';text-align:center;text-anchor:middle;stroke:#000000;stroke-width:0.0544759px"
         y="188.67081"
         x="267.98358"
         sodipodi:role="line">Linux</tspan><tspan
         style="font-style:normal;font-variant:normal;font-weight:bold;font-stretch:normal;font-size:5.08441734px;line-height:4.90283108px;font-family:'Latin Modern Math';-inkscape-font-specification:'Latin Modern Math Bold';text-align:center;text-anchor:middle;stroke:#000000;stroke-width:0.0544759px"
         y="193.57364"
         x="267.98358"
         sodipodi:role="line"
         id="tspan4684">Development Model</tspan><tspan
         style="font-style:normal;font-variant:normal;font-weight:bold;font-stretch:normal;font-size:5.08441734px;line-height:4.90283108px;font-family:'Latin Modern Math';-inkscape-font-specification:'Latin Modern Math Bold';text-align:center;text-anchor:middle;stroke:#000000;stroke-width:0.0544759px"
         y="198.47647"
         x="267.98358"
         sodipodi:role="line"
         id="tspan4686">Characterization</tspan></text>
    <path
       style="fill:none;fill-rule:evenodd;stroke:#4d4d4d;stroke-width:0.8235727;stroke-linecap:round;stroke-linejoin:round;stroke-miterlimit:4;stroke-dasharray:none;stroke-dashoffset:0;stroke-opacity:1;marker-end:url(#marker7389-2);paint-order:normal"
       d="M 60.552739,191.89715 H 80.082867"
       id="path7385-1"
       inkscape:connector-curvature="0"
       inkscape:export-filename="/home/siqueira/Documents/usp/mestrado/thesis/quali/figures/apache_arhitecture.png"
       inkscape:export-xdpi="144.75999"
       inkscape:export-ydpi="144.75999"
       sodipodi:nodetypes="cc" />
    <path
       sodipodi:nodetypes="cc"
       inkscape:export-ydpi="144.75999"
       inkscape:export-xdpi="144.75999"
       inkscape:export-filename="/home/siqueira/Documents/usp/mestrado/thesis/quali/figures/apache_arhitecture.png"
       inkscape:connector-curvature="0"
       id="path2224-3"
       d="M 188.12183,142.58611 V 154.6821"
       style="fill:none;fill-rule:evenodd;stroke:#4d4d4d;stroke-width:0.62402415;stroke-linecap:round;stroke-linejoin:round;stroke-miterlimit:4;stroke-dasharray:none;stroke-dashoffset:0;stroke-opacity:1;marker-start:url(#marker8298-2);marker-end:url(#marker17974-0);paint-order:normal" />
    <path
       style="fill:none;fill-rule:evenodd;stroke:#4d4d4d;stroke-width:0.97249782;stroke-linecap:round;stroke-linejoin:round;stroke-miterlimit:4;stroke-dasharray:none;stroke-dashoffset:0;stroke-opacity:1;marker-end:url(#marker15694-6);paint-order:normal"
       d="m 133.66268,185.98979 29.98184,-20.36256"
       id="path4788"
       inkscape:connector-curvature="0"
       inkscape:export-filename="/home/siqueira/Documents/usp/mestrado/thesis/quali/figures/apache_arhitecture.png"
       inkscape:export-xdpi="144.75999"
       inkscape:export-ydpi="144.75999"
       sodipodi:nodetypes="cc" />
    <path
       sodipodi:nodetypes="cc"
       inkscape:export-ydpi="144.75999"
       inkscape:export-xdpi="144.75999"
       inkscape:export-filename="/home/siqueira/Documents/usp/mestrado/thesis/quali/figures/apache_arhitecture.png"
       inkscape:connector-curvature="0"
       id="path4792"
       d="m 219.13851,191.8972 h 19.53016"
       style="fill:none;fill-rule:evenodd;stroke:#4d4d4d;stroke-width:0.8235727;stroke-linecap:round;stroke-linejoin:round;stroke-miterlimit:4;stroke-dasharray:none;stroke-dashoffset:0;stroke-opacity:1;marker-end:url(#marker7389-2);paint-order:normal" />
    <path
       sodipodi:nodetypes="cc"
       inkscape:export-ydpi="144.75999"
       inkscape:export-xdpi="144.75999"
       inkscape:export-filename="/home/siqueira/Documents/usp/mestrado/thesis/quali/figures/apache_arhitecture.png"
       inkscape:connector-curvature="0"
       id="path118"
       d="m 136.3664,191.89715 h 26.19742"
       style="fill:none;fill-rule:evenodd;stroke:#4d4d4d;stroke-width:0.95384419;stroke-linecap:round;stroke-linejoin:round;stroke-miterlimit:4;stroke-dasharray:none;stroke-dashoffset:0;stroke-opacity:1;marker-end:url(#marker7389-2);paint-order:normal" />
    <path
       style="fill:none;fill-rule:evenodd;stroke:#4d4d4d;stroke-width:0.36052784;stroke-linecap:round;stroke-linejoin:round;stroke-miterlimit:4;stroke-dasharray:none;stroke-dashoffset:0;stroke-opacity:1;marker-start:url(#marker8298-2);marker-end:url(#marker17974-0);paint-order:normal"
       d="m 187.32002,201.38172 v 4.03753"
       id="path120"
       inkscape:connector-curvature="0"
       inkscape:export-filename="/home/siqueira/Documents/usp/mestrado/thesis/quali/figures/apache_arhitecture.png"
       inkscape:export-xdpi="144.75999"
       inkscape:export-ydpi="144.75999"
       sodipodi:nodetypes="cc" />
    <rect
       rx="0.011955453"
       inkscape:export-ydpi="144.75999"
       inkscape:export-xdpi="144.75999"
       inkscape:export-filename="/home/siqueira/Documents/Repositories/modelo-latex/figuras/nooks_nim.png"
       ry="0.011955454"
       y="165.55026"
       x="-222.99936"
       height="45.143143"
       width="16.337196"
       id="rect122"
       style="opacity:1;fill:#dbdee3;fill-opacity:1;stroke:#a7b3cd;stroke-width:0.86379266;stroke-linecap:square;stroke-linejoin:bevel;stroke-miterlimit:4;stroke-dasharray:none;stroke-opacity:1"
       transform="rotate(-90)" />
    <text
       xml:space="preserve"
       style="font-style:normal;font-variant:normal;font-weight:normal;font-stretch:normal;font-size:2.1790359px;line-height:3.18139267px;font-family:'Open Sans';-inkscape-font-specification:'Open Sans';letter-spacing:0px;word-spacing:0px;fill:#000000;fill-opacity:1;stroke:none;stroke-width:0.0544759px;stroke-linecap:butt;stroke-linejoin:miter;stroke-opacity:1"
       x="187.72205"
       y="213.92677"
       id="text126"><tspan
         id="tspan124"
         sodipodi:role="line"
         x="187.72205"
         y="213.92677"
         style="font-style:normal;font-variant:normal;font-weight:bold;font-stretch:normal;font-size:5.08441734px;line-height:4.90283108px;font-family:'Latin Modern Math';-inkscape-font-specification:'Latin Modern Math Bold';text-align:center;text-anchor:middle;stroke:#000000;stroke-width:0.0544759px">Journal of</tspan><tspan
         sodipodi:role="line"
         x="187.72205"
         y="218.95589"
         style="font-style:normal;font-variant:normal;font-weight:bold;font-stretch:normal;font-size:5.08441734px;line-height:4.90283108px;font-family:'Latin Modern Math';-inkscape-font-specification:'Latin Modern Math Bold';text-align:center;text-anchor:middle;stroke:#000000;stroke-width:0.0544759px"
         id="tspan128">Contribution</tspan></text>
    <rect
       rx="0.0032582444"
       transform="rotate(-90)"
       style="opacity:1;fill:#a7b3cd;fill-opacity:1;stroke:#a7b3cd;stroke-width:0.19737358;stroke-linecap:square;stroke-linejoin:bevel;stroke-miterlimit:4;stroke-dasharray:none;stroke-opacity:1"
       id="rect925"
       width="4.5377235"
       height="10.488864"
       x="-131.09"
       y="245.22305"
       ry="0.0032582444"
       inkscape:export-filename="/home/siqueira/Documents/Repositories/modelo-latex/figuras/nooks_nim.png"
       inkscape:export-xdpi="144.75999"
       inkscape:export-ydpi="144.75999" />
    <rect
       inkscape:export-ydpi="144.75999"
       inkscape:export-xdpi="144.75999"
       inkscape:export-filename="/home/siqueira/Documents/Repositories/modelo-latex/figuras/nooks_nim.png"
       ry="0.0032582444"
       y="245.22305"
       x="-140.23793"
       height="10.488864"
       width="4.5377235"
       id="rect927"
       style="opacity:1;fill:#dbdee3;fill-opacity:1;stroke:#a7b3cd;stroke-width:1;stroke-linecap:square;stroke-linejoin:bevel;stroke-miterlimit:4;stroke-dasharray:none;stroke-opacity:1"
       transform="rotate(-90)"
       rx="0.0032582444" />
    <rect
       rx="0.0032582444"
       transform="rotate(-90)"
       style="opacity:1;fill:#dbdee3;fill-opacity:1;stroke:#dbdee3;stroke-width:0.19737358;stroke-linecap:square;stroke-linejoin:bevel;stroke-miterlimit:4;stroke-dasharray:none;stroke-opacity:1"
       id="rect929"
       width="4.5377235"
       height="10.488864"
       x="-149.38586"
       y="245.22305"
       ry="0.0032582444"
       inkscape:export-filename="/home/siqueira/Documents/Repositories/modelo-latex/figuras/nooks_nim.png"
       inkscape:export-xdpi="144.75999"
       inkscape:export-ydpi="144.75999" />
    <flowRoot
       xml:space="preserve"
       id="flowRoot931"
       style="font-style:normal;font-variant:normal;font-weight:normal;font-stretch:normal;font-size:21.33333397px;line-height:0.75;font-family:'Latin Modern Math';-inkscape-font-specification:'Latin Modern Math, Normal';font-variant-ligatures:normal;font-variant-caps:normal;font-variant-numeric:normal;font-feature-settings:normal;text-align:start;letter-spacing:0px;word-spacing:0px;writing-mode:lr-tb;text-anchor:start;fill:#000000;fill-opacity:1;stroke:none"
       transform="matrix(0.26458333,0,0,0.26458333,1.6166478,118.54252)"><flowRegion
         id="flowRegion933"
         style="line-height:0.75"><rect
           id="rect935"
           width="125.25896"
           height="145.46196"
           x="979.84796"
           y="27.804918"
           style="line-height:0.75" /></flowRegion><flowPara
         id="flowPara937"
         style="font-size:18.66666603px;line-height:19.76692963px">Finished</flowPara><flowPara
         style="font-size:18.66666603px;line-height:19.76692963px"
         id="flowPara945" /><flowPara
         id="flowPara939"
         style="font-size:18.66666603px;line-height:19.76692963px">In Progress</flowPara><flowPara
         style="font-size:18.66666603px;line-height:19.76692963px"
         id="flowPara947" /><flowPara
         id="flowPara941"
         style="font-size:18.66666603px;line-height:19.76692963px">Future Step</flowPara></flowRoot>  </g>
</svg>
