[
  {
    "objectID": "index.html",
    "href": "index.html",
    "title": "Empirische Arbeiten in der Kognitiven Psychologie / Reach & Touch Lab",
    "section": "",
    "text": "1 Infos zu empirischen Projekten im Rahmen von ES/BSc/MSc\nHier finden Sie Informationen zum Inhalt und Ablauf von Empirischen Seminaren sowie BSc- und MSc-Arbeiten in der Arbeitsgruppe Kognitive Psychologie mit den beiden Forschungslaboren Reach & Touch Lab.\nHaben unsere Forschungsthemen Ihr Interesse geweckt?\nFalls noch Fragen offen geblieben sind, oder Sie sich Ihren Platz im BSc-Seminar oder im Konservatorium für die MSc-Arbeit sichern möchten, sprechen Sie uns gern an!"
  },
  {
    "objectID": "index.html#arbeitsgruppe-kognitive-psychologie---wer-ist-das-überhaupt",
    "href": "index.html#arbeitsgruppe-kognitive-psychologie---wer-ist-das-überhaupt",
    "title": "Empirische Arbeiten in der Kognitiven Psychologie / Reach & Touch Lab",
    "section": "1.1 Arbeitsgruppe Kognitive Psychologie - wer ist das überhaupt?",
    "text": "1.1 Arbeitsgruppe Kognitive Psychologie - wer ist das überhaupt?\nWir sind Tobias Heed (Professor für Kognitive Psychologie) und Xaver Fuchs, Boukje Habets, Markus Aichhorn und Christian Seegelke (Postdocs im Bereich Kognitive Psychologie). Infos über uns und unsere Forschungsthemen unserer Homepage."
  },
  {
    "objectID": "index.html#welche-themen-betreut-die-arbeitsgruppe-kognitive-psychologie",
    "href": "index.html#welche-themen-betreut-die-arbeitsgruppe-kognitive-psychologie",
    "title": "Empirische Arbeiten in der Kognitiven Psychologie / Reach & Touch Lab",
    "section": "1.2 Welche Themen betreut die Arbeitsgruppe Kognitive Psychologie?",
    "text": "1.2 Welche Themen betreut die Arbeitsgruppe Kognitive Psychologie?\nUnsere Forschung befasst sich mit mehreren Themen, die wir in unserer Arbeit zusammenführen:\n\n\n\n\n\n\n\n\n\n\n\nSomatosensorisches System\nBerührung, Propriozeption, Schmerz\n\n\n\n\n\nMultisensorik\nZusammenführen der verschiedenen Sinnessysteme\n\n\n\n\n\nBewegung\nMotorische Planung, Verknüpfung von Motorik und Wahrnehmung/Kognition\n\n\n\n\nBewegungen zu Berührungenm also zum eigenen Körper hin\n\n\n\n\nBedeutung von Berührung und Bewegung für die Verarbeitung und Repräsentation des eigenen Körpers\n\n\n\n\n\nEntwicklung von Multisensorik und Körperwissen\nWelche Rolle spielt Berührung und Bewegung in der Entwicklung?"
  },
  {
    "objectID": "index.html#welche-methoden-nutzt-die-gruppe-und-welche-davon-kann-ich-im-rahmen-meines-es-oder-meiner-bscmsc-arbeit-erlernen",
    "href": "index.html#welche-methoden-nutzt-die-gruppe-und-welche-davon-kann-ich-im-rahmen-meines-es-oder-meiner-bscmsc-arbeit-erlernen",
    "title": "Empirische Arbeiten in der Kognitiven Psychologie / Reach & Touch Lab",
    "section": "1.3 Welche Methoden nutzt die Gruppe, und welche davon kann ich im Rahmen meines ES oder meiner BSc/MSc-Arbeit erlernen?",
    "text": "1.3 Welche Methoden nutzt die Gruppe, und welche davon kann ich im Rahmen meines ES oder meiner BSc/MSc-Arbeit erlernen?\nWir forschen mit vielen unterschiedlichen Methoden: Verhaltensmaße, Bewegungsmessung, Bewegungsmanipulation, EEG, fMRT, Modellierung und manchmal TMS.\n\n\n\n\n\n\nIm Rahmen der ES und BSc leiten wir meistens Experimente mit Verhaltensmaßen oder Bewegungsmessung/-manipulation an. Hauptgrund hierfür ist der sehr enge Zeitrahmen der ES und BSc-Arbeiten. Bei guter Planung sind eventuell auch die andere Methoden machbar."
  },
  {
    "objectID": "index.html#sind-die-themen-und-experimente-vorgegeben",
    "href": "index.html#sind-die-themen-und-experimente-vorgegeben",
    "title": "Empirische Arbeiten in der Kognitiven Psychologie / Reach & Touch Lab",
    "section": "1.4 Sind die Themen und Experimente vorgegeben?",
    "text": "1.4 Sind die Themen und Experimente vorgegeben?\nIn den meisten Fällen bieten wir festen Themen an, zu denen wir bereits eine klare Experimentidee haben. Ihre Experimente sind nicht einfach als Lückenfüller ausgedacht, damit Sie was zu tun haben, sondern sie interessieren uns selbst. Ihr Experiment trägt immer dazu bei, Fragen zu beantworten, die wir in unserer Forschung auch selbst gerade bearbeiten. Manchmal sind dies Pilotexperimente für neue Forschungsideen; manchmal ist Ihr Experiment eines von mehreren, die wir für einen geplanten Forschungsartikel erheben; und manchmal handelt es sich um Kontrollexperimente für Befunde, die bereits vorliegen.\n\n\n\n\n\n\nFestgelegte Themen haben Vorteile:\n\n\n\n\nWir kennen uns mit den Themen, die Sie bearbeiten, hervorragend aus.\nWir können Ihnen alles im Detail erklären.\nWir können Experimente i.A. technisch angemessen und effizient umsetzen und kennen uns mit den Tücken unserer Methoden aus.\nDa Sie bei uns echt mitarbeiten, haben wir ein sehr großes Interesse daran, dass Sie alles verstehen und in der Folge richtig mitarbeiten können.\n\n\n\nFast immer besprechen wir das Design im Detail mit Ihnen und beziehen Sie zu Beginn in die Fixierung des Experiments mit ein. Häufig bringen Studierende wichtige und wertvolle Ideen zur Anpassung der Experimente ein, die wir dann auch umsetzen.\nAußerdem bestehen bei vielen Themen Freiheiten bzgl. der bearbeiteten Hypothese bzw. Auswertung. Insofern besteht von Ihrer Seite immer Spielraum zur Mitgestaltung der Forschung."
  },
  {
    "objectID": "index.html#was-lerne-ich-wenn-ich-in-der-kognitiven-psychologie-mein-esbscmsc-seminar-mache",
    "href": "index.html#was-lerne-ich-wenn-ich-in-der-kognitiven-psychologie-mein-esbscmsc-seminar-mache",
    "title": "Empirische Arbeiten in der Kognitiven Psychologie / Reach & Touch Lab",
    "section": "1.5 Was lerne ich, wenn ich in der Kognitiven Psychologie mein ES/BSc/MSc-Seminar mache?",
    "text": "1.5 Was lerne ich, wenn ich in der Kognitiven Psychologie mein ES/BSc/MSc-Seminar mache?\nWir vermitteln Ihnen den echten Forschungsprozess von der Planung bis zum Aufschreiben. Sie erarbeiten alle Schritte mit unserer Unterstützung:\n\nPlanung und Design\nErhebung\nAnalyse\nInterpretation\nSchreiben\n\n\n\n\n\n\n\nBetreut die Arbeitsgruppe auch externe Arbeiten?\n\n\n\nz.B. mit Hauptbetreuer*In in einer anderen Klinik/ Uni\nGrundsätzlich betreuen wir aus den in den vorherigen Punkten genannten Gründen nur Themen, die in unseren Forschungsbereich fallen.\n\nWenn Sie finden, dass dies für Ihre extern erstellte Arbeit der Fall sein könnte, sprechen Sie Tobias Heed gern dazu an."
  },
  {
    "objectID": "index.html#wie-ist-der-allgemeine-ablauf-eines-projektes",
    "href": "index.html#wie-ist-der-allgemeine-ablauf-eines-projektes",
    "title": "Empirische Arbeiten in der Kognitiven Psychologie / Reach & Touch Lab",
    "section": "1.6 Wie ist der allgemeine Ablauf eines Projektes?",
    "text": "1.6 Wie ist der allgemeine Ablauf eines Projektes?\nWie viel Daten muss ich erheben? Wir versuchen den Aufwand zwischen allen Arbeiten möglichst vergleichbar zu gestalten.\n\n\n\n\n\n\nGrundregel Zeitaufwand\n\n\n\n\nBSc-Arbeiten erheben 40h +/- 20%.\nMSc-Arbeiten erheben 80h +/- 20%.\n\nDie Erhebungszeiten erstrecken sich über einen längeren Zeitraum, abhängig von der Planung der Erhebungstermine. Uns ist es wichtig, dass der Arbeitsaufwand planbar und überschaubar ist und der Datensatz sinnvoll ist.\nDer Datensatz sollte eine ausreichende Anzahl von Versuchspersonen und Trials enthalten, um eine aussagekräftige Statistik zu ermöglichen."
  },
  {
    "objectID": "index.html#was-ist-der-allgemeine-zeitplan",
    "href": "index.html#was-ist-der-allgemeine-zeitplan",
    "title": "Empirische Arbeiten in der Kognitiven Psychologie / Reach & Touch Lab",
    "section": "1.7 Was ist der allgemeine Zeitplan?",
    "text": "1.7 Was ist der allgemeine Zeitplan?\n\nIm ES und BSc finden Experimenterhebung und Aufschreiben im selben Semester statt. Daher ist der Zeitplan ziemlich straff. Wir führen Sie in den Seminaren strukturiert durch Ihr Projekt. Dabei beginnt die Datenerhebung so früh wie möglich, d.h. typischerweise innerhalb des ersten Monats der Seminare.\nBei den MSc-Arbeiten besteht größere Flexibilität, da sie sich über zwei Semester erstrecken. Hier erfolgt die Planung in enger Absprache mit Ihre*r Betreuer*in. Im Allgemeinen streben wir jedoch an, dass die Datenerhebung im ersten Semester und Auswertung/Aufschreiben im zweiten Semester laufen.\n\n\n1.7.1 Ist der Zeitplan flexibel?\nJa. Es ist uns bewusst, dass viele Studierende aus verschiedenen Gründen schneller oder langsamer sein möchten als der oben genannte Plan. Es ist jedoch wichtig, den Zeitplan zu besprechen und abzustimmen, um sicherzustellen, dass alles organisatorisch reibungslos funktioniert und die Arbeit mit Ihrem Studienplan in Einklang steht."
  },
  {
    "objectID": "index.html#mache-ich-meine-experimente-bzw.-arbeit-allein",
    "href": "index.html#mache-ich-meine-experimente-bzw.-arbeit-allein",
    "title": "Empirische Arbeiten in der Kognitiven Psychologie / Reach & Touch Lab",
    "section": "1.8 Mache ich meine Experimente bzw. Arbeit allein?",
    "text": "1.8 Mache ich meine Experimente bzw. Arbeit allein?\n\nIm ES arbeiten Sie typischerweise in Teams. Sie können meistens zwischen mehreren Experimenten wählen.\nBei den BSc- und MSc-Arbeiten bieten wir sowohl Einzelarbeiten als auch Arbeiten für 2er-Teams an. Teams bieten sich immer dann an, wenn der Erhebungsaufwand vergleichsweise groß ist."
  },
  {
    "objectID": "index.html#stimmt-es-dass-man-in-der-arbeitsgruppe-kognitive-psychologie-mit-r-rechnen-muss",
    "href": "index.html#stimmt-es-dass-man-in-der-arbeitsgruppe-kognitive-psychologie-mit-r-rechnen-muss",
    "title": "Empirische Arbeiten in der Kognitiven Psychologie / Reach & Touch Lab",
    "section": "1.9 Stimmt es, dass man in der Arbeitsgruppe Kognitive Psychologie mit R rechnen muss?",
    "text": "1.9 Stimmt es, dass man in der Arbeitsgruppe Kognitive Psychologie mit R rechnen muss?\n\nIm Empirischen Seminar, ja – wir führen Sie aber im Seminar in R ein und helfen Ihnen bei er Umsetzung Ihrer Analyse.\nFür BSc/MSc, nein. Wir empfehlen sehr dringlich, dass Sie R verwenden, setzen dies aber nicht voraus. Sie können grundsätzlich jede Statistiksoftware verwenden, die Sie sich aussuchen.\n\nWir erwarten aber, dass Sie sich dadurch nicht in der Wahl der Analysemethode einschränken lassen (also “das geht aber mit dem Programm XYZ nicht”, gilt nicht).\nIn der Praxis ist dies kaum je ein Problem, da in ES/BSc/MSc immer Auswertungen mit Standardverfahren wie Anova, Regression o.ä. möglich sind.\n\n\n\n\n\n\n\n\nWichtig zu wissen ist, dass wir konkrete Unterstützung für Ihre Umsetzung nur in R geben können, da wir uns mit anderen Programmen nicht auskennen.\nD.h., inhaltliche Besprechung erfolgt natürlich immer, aber Probleme bei der Umsetzung können wir nur in R unterstützen.\n\n\n\n\n\n\n\n\n\nLohnt es sich, sich in R einzuarbeiten?\n\n\n\nViele Studierende nutzen unsere Veranstaltungen, um sich in R einzuarbeiten. Wir bieten eine ausführlich dokumentierte Anleitung für statistische Analysen in R an, mit deren Hilfe Sie Ihre eigene Analyse Schritt für Schritt durchführen können.\nUnsere Anleitung enthält alle wichtigen Schritte zur Arbeit mit den Daten für viele unserer Projekte. Von der Installation des Programms bis hin zur Datenaufbereitung, Visualisierung, Statistik und Erstellung der entsprechenden Tabellen und Abbildungen für Ihren Bericht. Diese Anleitung finden Sie hier.\n\nAlso: Ja. In der Realität ist R eine der belibtesten Softwares zur Datenanalyse. Viele von Ihnen werden in ihrer weiteren beruflichen und/oder akademischen Laufbahn (Studium bei Abschlussarbeiten) noch mit R zu tun haben. Falls Sie also die Ressourcen dafür aufbringen wollen, würden wir Ihnen den Umgang mit R empfehlen."
  },
  {
    "objectID": "index.html#kontakt-aufnehmen",
    "href": "index.html#kontakt-aufnehmen",
    "title": "Empirische Arbeiten in der Kognitiven Psychologie / Reach & Touch Lab",
    "section": "1.10 Kontakt aufnehmen",
    "text": "1.10 Kontakt aufnehmen\nInteresse geweckt? Noch Fragen offen? Sie möchten sich Ihren Platz im BSc-Seminar oder im Konversatorium für die MSc-Arbeit sichern?\nSprechen Sie uns gern an - vor/nach unseren Veranstaltungen, per Email oder schauen Sie bei uns im Büro vorbei. Bei den verschiedenen Themenbereichen steht jeweils die beste Ansprechpartner*in; Sie können aber jederzeit auch andere Mitglieder der Arbeitsgruppe fragen."
  },
  {
    "objectID": "02-questions-before-starting.html#theoretischer-und-empirischer-hintergrund",
    "href": "02-questions-before-starting.html#theoretischer-und-empirischer-hintergrund",
    "title": "2  Vorab-Fragen bevor man eine Studie beginnt",
    "section": "2.1 Theoretischer und empirischer Hintergrund",
    "text": "2.1 Theoretischer und empirischer Hintergrund\n\nWas ist die grundsätzliche Fragestellung bzw. der Untersuchungsgegenstand der Studie? Bitte gehen Sie kurz auf den theoretischen Hintergrund ein."
  },
  {
    "objectID": "02-questions-before-starting.html#hypothesen",
    "href": "02-questions-before-starting.html#hypothesen",
    "title": "2  Vorab-Fragen bevor man eine Studie beginnt",
    "section": "2.2 Hypothesen",
    "text": "2.2 Hypothesen\n\nWas sind die aus der Theorie abgeleiteten Hypothesen?"
  },
  {
    "objectID": "02-questions-before-starting.html#methoden-und-operationalisierung-der-frage",
    "href": "02-questions-before-starting.html#methoden-und-operationalisierung-der-frage",
    "title": "2  Vorab-Fragen bevor man eine Studie beginnt",
    "section": "2.3 Methoden und Operationalisierung der Frage",
    "text": "2.3 Methoden und Operationalisierung der Frage\n\nWie wird die Frage grundsätzlich untersucht (z.B. mittels einer behavioralen Untersuchung im Labor)?\nWelche Methoden und welches Experimentalparadigma kommen zum Einsatz?\nWelche Faktoren werden im Experiment manipuliert, d.h. was sind die unabhängigen Variablen?\nWas ist/sind die abhängigen Variablen, d.h. worin soll sich die experimentelle Manipulation äußern (z.B. Reaktionszeit)?\nWelche(s) statistische(n) Verfahren kommt zum Einsatz?\nWie ist das statistische Untersuchungsdesign genau spezifiziert?(z.B. 2 (mit vs. ohne Aufmerksamkeit) x 2 (Hand vs. Fuß) faktorielles within-subject Design mit Messwiederholung auf allen Stufen)\nWie viele Versuchspersonen sollen gemessen werden und wie ist die Zahl festgelegt worden? Ist die Power geschätzt worden?"
  },
  {
    "objectID": "02-questions-before-starting.html#operationaliserte-hypothesenerwartete-ergebnisse",
    "href": "02-questions-before-starting.html#operationaliserte-hypothesenerwartete-ergebnisse",
    "title": "2  Vorab-Fragen bevor man eine Studie beginnt",
    "section": "2.4 Operationaliserte Hypothesen/erwartete Ergebnisse",
    "text": "2.4 Operationaliserte Hypothesen/erwartete Ergebnisse\n\nWas für Ergebnisse erwarten Sie konkret in Ihrem Experiment aufgrund der Theorie und unter Verwendung des beschriebenen Versuchsplans? Operationalisieren Sie ihre Hypothesen.\nWie würde man dieses optimale Ergebnis dann in Bezug auf die übergeordnete Fragestellung interpretieren, die Sie zu Anfang als Problem/Fragestellung formuliert haben?"
  },
  {
    "objectID": "02-questions-before-starting.html#diskussion-und-interpretation",
    "href": "02-questions-before-starting.html#diskussion-und-interpretation",
    "title": "2  Vorab-Fragen bevor man eine Studie beginnt",
    "section": "2.5 Diskussion und Interpretation",
    "text": "2.5 Diskussion und Interpretation\n\nWelche anderen Ergebnismuster sind vorstellbar?\nWären solche anderen Muster auch interpretierbar, oder müsste man sagen, dass man hinterher nichts Neues weiß, wenn nicht das gewünschte Muster herauskommt?\nDenken Sie dabei auch an die Problematik der Interpretation von Nulleffekten."
  },
  {
    "objectID": "03-available-projects.html#körper-im-raum",
    "href": "03-available-projects.html#körper-im-raum",
    "title": "3  Aktuelle Forschungsthemen",
    "section": "3.1 Körper im Raum",
    "text": "3.1 Körper im Raum\nStudienleitung: tobias.heed@plus.ac.at\nMethoden: Motion-Tracking & Psychophysik\nEs erscheint selbstverständlich, dass unser Körper sich im dreidimensionalen Raum zurechtfindet, da unsere Welt in dieser Form existiert. Allerdings zeigen verschiedene Phänomene im Bereich der Körperwahrnehmung, dass es nicht so einfach ist.\nSelbst scheinbar triviale Fragen wie die Unterscheidung zwischen zwei Berührungen am gleichen Körperteil können von Menschen nicht immer zuverlässig beantwortet werden. Der Grund dafür ist, dass sich die räumliche Beziehung zwischen Körper und Umwelt ständig verändert, aus dem einfachen Grund, weil sich unser Körper flexibel bewegen lässt. Wie wir Berührungen unserem Körper zuordnen und wie wir daraufhin unsere Handlungen planen, sind Forschungsfragen, mit denen wir uns unter anderem beschäftigen.\n\n\n\n\n\n\nInteressiert?\n\n\n\nWir bieten regelmäßig Experimente zu diesen Themen an, darunter Verhaltensstudien sowie Studien mit EEG, Motion Tracking und MRT. Für weitere Informationen zu den derzeit geplanten Studien sprechen Sie mich bitte einfach an.\n\n\n\n\n\nKörper im Raum"
  },
  {
    "objectID": "03-available-projects.html#attention-please-aufmerksamkeit-und-handlungsplanung",
    "href": "03-available-projects.html#attention-please-aufmerksamkeit-und-handlungsplanung",
    "title": "3  Aktuelle Forschungsthemen",
    "section": "3.2 Attention Please! Aufmerksamkeit und Handlungsplanung",
    "text": "3.2 Attention Please! Aufmerksamkeit und Handlungsplanung\nStudienleitung: Christian.Seegelke@plus.ac.at\nMethoden: Motion-Tracking & Psychophysik\nWenn wir zwei Dinge gleichzeitig tun, ist unsere Leistung normalerweise schlechter als bei zwei getrennten Tätigkeiten. Diese Beobachtung wird oft mit einer begrenzten Aufmerksamkeitskapazität erklärt, bei der unsere Aufmerksamkeit wie ein Scheinwerfer immer nur an einem Ort sein kann.\n\nStudien zeigen jedoch, dass Aufmerksamkeit teilweise auf mehrere Orte gleichzeitig gerichtet werden kann.\n\n\n\n\n\n\n\nIm Rahmen dieses Projekts untersuchen wir Faktoren, die den zeitlichen und räumlichen Verlauf der Aufmerksamkeitsverteilung beeinflussen, um ein besseres Verständnis der Rolle von Aufmerksamkeit im Kontext von Handlungsplanung zu erlangen.\n\n\n\n\n\n\nAufmerksamkeit und Handlungsplanung"
  },
  {
    "objectID": "03-available-projects.html#sensomotorische-entscheidungen-unter-unsicherheit",
    "href": "03-available-projects.html#sensomotorische-entscheidungen-unter-unsicherheit",
    "title": "3  Aktuelle Forschungsthemen",
    "section": "3.2 Sensomotorische Entscheidungen unter Unsicherheit",
    "text": "3.2 Sensomotorische Entscheidungen unter Unsicherheit\nStudienleitung: christian.seegelke@plus.ac.at\nMethoden: Motion-Tracking\nUnsere Umwelt ist dynamisch, flexibel und unsicher. Das sensomotorische System muss daher schnell auf Veränderungen reagieren können, zum Beispiel im Kontext von Sportspielen.\n\nNeurophysiologische Befunde legen nahe, dass das Gehirn mehrere Handlungsoptionen gleichzeitig vorbereitet, um flexibel auf Umweltänderungen reagieren zu können.\n\n\n\n\n\n\n\n\nIn diesem Projekt versuchen wir solche Entscheidungen mittels Bewegungsmessung sichtbar zu machen."
  },
  {
    "objectID": "03-available-projects.html#aus-alt-mach-neu-recycling-von-bewegungsplänen",
    "href": "03-available-projects.html#aus-alt-mach-neu-recycling-von-bewegungsplänen",
    "title": "3  Aktuelle Forschungsthemen",
    "section": "3.4 Aus Alt mach Neu: Recycling von Bewegungsplänen",
    "text": "3.4 Aus Alt mach Neu: Recycling von Bewegungsplänen\nStudienleitung: Christian.Seegelke@plus.ac.at\nMethoden: Motion-Tracking, Verhaltensdaten\nVorangegangene Bewegungen beeinflussen die Planung und Ausführung nachfolgender Bewegungen. Werden z.B. zwei Bewegungen nacheinander ausgeführt, sind sie sich ähnlicher, als wären sie isoliert ausgeführt worden. Außerdem fällt uns die Ausführung der zweiten Bewegung leichter, wenn sie identisch mit der ersten ist.\n\nDie übliche Erklärung für diese Befunde lautet, dass es kognitiv effizienter ist, einen vorherigen Bewegungsplan wiederzuverwenden, anstatt für jede einzelne Bewegung einen neuen Plan zu erstellen.\n\n\n\n\n\n\n\nIn diesem Projekt stellen wir diese Hypothese auf den Prüfstand und testen ihre Generalisierbarkeit.\n\n\n\n\n\n\nRecycling von Bewegungsplänen"
  },
  {
    "objectID": "03-available-projects.html#linksrechts-kleingross",
    "href": "03-available-projects.html#linksrechts-kleingross",
    "title": "3  Aktuelle Forschungsthemen",
    "section": "3.3 Links-rechts, klein-groß: Repräsentation von (numerischer) Größe und Raum",
    "text": "3.3 Links-rechts, klein-groß: Repräsentation von (numerischer) Größe und Raum\nStudienleitung: christian.seegelke@plus.ac.at\nMethoden: Motion-Tracking, Verhaltensdaten\nIn der Schule lernen wir den Umgang mit Zahlen oft mit Hilfe des sogenannten Zahlenstrahls. Dabei werden kleine Zahlen links und große Zahlen rechts dargestellt. Auch kognitiv scheinen wir Zahlen räumlich entlang eines solchen mentalen Zahlenstrahls zu repräsentieren.\n\nEvidenz dafür liefert unter anderem der sogenannte SNARC-Effekt, welcher die räumliche Verarbeitung von Zahlen belegt. Es besteht die Tendenz, dass kleine Zahlen schneller mit der linken Hand und große Zahlen schneller mit der rechten Hand beantwortet werden.\nDieser sogenannte SNARC-Effekt wurde nicht nur bei Erwachsenen, sondern auch bei Kleinkindern und Tieren beobachtet, weshalb eine kulturelle Erklärung als Ursache infrage gestellt wird.\n\n\n\n\n\n\n\nIn diesem Projekt untersuchen wir den SNARC und SNARC-ähnliche Effekte genauer, um so potenziellen Erklärungsursachen auf den Grund zu gehen."
  },
  {
    "objectID": "03-available-projects.html#spin-my-hand-right-round-zur-rolle-von-motorischer-simulation-bei-lateralitätsentscheidungen",
    "href": "03-available-projects.html#spin-my-hand-right-round-zur-rolle-von-motorischer-simulation-bei-lateralitätsentscheidungen",
    "title": "3  Aktuelle Forschungsthemen",
    "section": "3.4 Spin my hand right round: Zur Rolle von motorischer Simulation bei Lateralitätsentscheidungen",
    "text": "3.4 Spin my hand right round: Zur Rolle von motorischer Simulation bei Lateralitätsentscheidungen\nStudienleitung: christian.seegelke@plus.ac.at\nMethoden: Verhaltensdaten\nWir können uns Bewegungen „im Kopf” vorstellen, ohne sie tatsächlich auszuführen. Solche motorischen Simulationen können motorische Leistung verbessern (z.B. im Sport) oder motorischen Lernen unterstützen. Unklar hingegen ist ob motorische Simulation auch genutzt wird, um sensorische oder kognitive Probleme zu lösen.\n\n\n\n\n\n\nIm Rahmen dieses Projekts wollen wir untersuchen inwiefern Wahrnehmungsentscheidungen bzgl. der Identität von Körperteilen (Händen) auf motorische Simulationsprozesse zurückgreifen."
  },
  {
    "objectID": "03-available-projects.html#have-a-break-have-a-boost-motorisches-lernen-in-pausen",
    "href": "03-available-projects.html#have-a-break-have-a-boost-motorisches-lernen-in-pausen",
    "title": "3  Aktuelle Forschungsthemen",
    "section": "3.5 Have a break – have a boost? Motorisches Lernen in Pausen",
    "text": "3.5 Have a break – have a boost? Motorisches Lernen in Pausen\nStudienleitung: christian.seegelke@plus.ac.at\nMethoden: Motion-Tracking\nUm adäquat mit Veränderung des eigenen Körpers (z.B. durch Wachstum, Alter, Verletzung etc.) oder der Umwelt umzugehen, ist es nötig unsere Bewegungen flexibel anpassen zu können, um auch weiterhin unsere Bewegungsziele zu erreichen. Solche motorischen Adaptationsprozesse sind Gegenstand intensiver Forschung, aber dennoch immer nicht vollständig verstanden, da offenbar viele sensomotorische und kognitive Faktoren sie beeinflussen.\n\n\n\n\n\n\nIn diesem Projekt wollen wir u.a. der Frage nachgehen, ob kurze Pausen produktiv für den motorischen Lernprozess sind."
  },
  {
    "objectID": "03-available-projects.html#häschen-auf-der-haut",
    "href": "03-available-projects.html#häschen-auf-der-haut",
    "title": "3  Aktuelle Forschungsthemen",
    "section": "3.8 Häschen auf der Haut",
    "text": "3.8 Häschen auf der Haut\nStudienleitung: Xaver.Fuchs@plus.ac.at\nMethoden: taktile Stimulation, Verhaltensexperimente im Labor, eventuell EEG\nDas Gehirn versucht stets Sinnesinformationen in einen sinnenhaften Gesamtzusammenhang zu interpretieren. Dabei verlässt es sich auf innere Vorerwartungen (sogenannte Priors), die auf Erfahrungen beruhen. Ein Beispiel dafür ist die sogenannte “Cutaneous Rabbit Illusion”: Reize, die schnell an zwei voneinander entfernten Orten präsentiert werden, spürt man als eine Serie von Berührung entlang der Haut zwischen den beiden Orten. Quasi wie ein „Häschen”, das über die Haut läuft. Die in der Mitte empfunden Berührungen sind somit illusionär, da dort nie ein Reiz tatsächlich stattgefunden hat.\n\n\n\n\n\n\nNach wie vor sind viele Fragen bezügliche dieses Phänomens offen, zum Beispiel wie beeinflussen persönliche Erfahrung die Vorerwartung von Berührungen auf der Haut?\nMehrere Abschlussarbeiten zu diesem Thema sind möglich.\n\n\n\n\n\n\nImage: https://en.wikipedia.org/wiki/Rabbit\n\n\n\n\n\nBayesianisches Wahrnehmungsmodell"
  },
  {
    "objectID": "03-available-projects.html#der-körper-im-gehirn",
    "href": "03-available-projects.html#der-körper-im-gehirn",
    "title": "3  Aktuelle Forschungsthemen",
    "section": "3.9 Der Körper im Gehirn",
    "text": "3.9 Der Körper im Gehirn\nStudienleitung: Xaver.Fuchs@plus.ac.at\nMethoden: taktile Stimulation, EEG\nBerührungen führen im Gehirn zu einer Aktivierung in somatosensorischen Verarbeitungszentren. Diese Aktivierung lässt sich mit einem EEG messen und daraus kann ein somatosensorisch evoziertes Potential (SEP) errechnet werden. Es ist bisher sehr wenig darüber bekannt, wie sich die SEPs zwischen Körperteilen unterscheiden, wie sie auf Veränderungen der Körperstellung reagieren und wie stabil sie über die Zeit sind. Eine grundsätzliche Frage ist, ob SEPs ein reiner „read out” der Stimulation auf der Haut sind oder ob SEPs bereits repräsentieren, wie sich der Körper im Raum befindet.\n\n\n\n\n\n\nIn diesem Projekt wollen wir EEG-basierte somatosensorische Körperkarten messen, indem wir SEPs an vielen Stellen des Körpers gleichzeitig messen. Dazu haben wir ein Verfahren entwickelt, bei dem die Messung sehr schnell mit einer sehr hohe Frequenz an Stimuli erfolgt.\nIn mehreren Abschlussarbeiten kann diese Methode zum Einsatz kommen, um Fragen zur Repräsentation von Berührungen auf dem Körper und im Raum zu beantworten.\n\n\n\n\n\n\nImage: https://de.wikipedia.org/wiki/Homunkulus"
  },
  {
    "objectID": "03-available-projects.html#schmerz-und-handwahrnehmung",
    "href": "03-available-projects.html#schmerz-und-handwahrnehmung",
    "title": "3  Aktuelle Forschungsthemen",
    "section": "3.6 Schmerz und Handwahrnehmung",
    "text": "3.6 Schmerz und Handwahrnehmung\nStudienleitung: xaver.fuchs@plus.ac.at\nMethoden: experimentelle Schmerzinduktion, taktile Stimulation, Verhaltensexperimente im Labor\nUnter Schmerzen kann sich die Wahrnehmung des eigenen Körpers und seiner Handlungsmöglichkeiten beträchtlich verändern. Das erkennt man schon bei sich selbst, wenn man eine Verletzung hat. Im Bereich von chronischen Schmerzen ist ein viel diskutiertes Thema, ob Veränderungen in der Körperwahrnehmung (oder „Körperrepräsentation“) nicht sogar ein Teil des Problems sind und auch eine aufrechterhaltende oder verschlimmernde Rolle spielen können. Viele Fragen sind allerdings weitgehend unklar. Hier kann in einigen Experimente untersucht werden, wie sich eine experimentelle Schmerzinduktion auf eine zugrunde liegende und weitgehend unbewusste Repräsentation der eigenen Handgröße auswirkt. Wir induzieren dabei leichte Schmerzen in der Hand mittels einer Kombination von ABC-Creme, die wegen des enthaltenen Extraktes aus Chilischoten sich auf der Haut warm anfühlt, und einer Wärmelampe. Die Versuchspersonen schätzen dabei wahrgenommene Orte von Berührungsreizen auf der Haut oder den empfundenen Abstand zwischen zwei berührten Orten ein.\n\n\n\n\n\n\nBei chronischen Schmerzen ist die Wahrnehmung des eigenen Körpers verändert und manche Therapien versuchen genau an dieser Stelle anzusetzen. Aber ist die Veränderte Körperwahrnehmung wirklich eine Konsequenz der Schmerzen? Oder ist es eher andersherum? Das kann untersucht werden, indem man Schmerzen experimentell erzeugt und die Auswirkungen auf die Körperwahrnehmung misst.\nMehrere Abschlussarbeiten zu diesem Thema sind möglich.\n\n\n\n\n\n\nTaktile Distanzwahrnehmung bei Hitzeschmerz\n\n\n\n\n\nTaktile Lokalisation bei Hitzeschmerz"
  },
  {
    "objectID": "03-available-projects.html#sensorische-und-physiologische-prozesse-bei-selbstberührung",
    "href": "03-available-projects.html#sensorische-und-physiologische-prozesse-bei-selbstberührung",
    "title": "3  Aktuelle Forschungsthemen",
    "section": "3.7 Sensorische und physiologische Prozesse bei Selbstberührung",
    "text": "3.7 Sensorische und physiologische Prozesse bei Selbstberührung\nStudienleitung: xaver.fuchs@plus.ac.at\nMethoden: taktile Stimulation, Verhaltensexperimente im Labor, phsysiologische Messungen, Selbstreport\nWenn man sich mit der eigenen Hand selbst berührt, zum Beispiel im Gesicht, dann ist das eine spezielle Situation, denn wir fühlen diese Berührung sowohl an der Hand wie auch im Gesicht. Diese Situation, in der Forschung manchmal als „Touchant-Touché“ bezeichnet, könnte eine wichtige Rolle spielen, wie wir unseren eigenen Körper und seine Dimensionen lernen. Gleichzeitig wird Selbstberührungen auch eine Funktion bei Kognition und Emotionsregulation attestiert. Bisher ist zu dem Thema nicht viel geforscht worden und viele Fragen offen. Es können Experimente durchgeführt werden zu der subjektiven Empfindung von Selbstberührung und deren Auswirkung auf das Wohlbefinden, zur Auswirkung auf physiologische Prozesse, wie Herzrate und Atemfrequenz, sowie zu Effekten auf die Verarbeitung von Berührungsreizen selbst.\n\n\n\n\n\n\nSelbstberührungen sind für das Gehirn eine besondere Situation mit großem Informationsgehalt über den Zustand des eigenen Körpers sowie seinen räumlichen Aspekten, zum Beispiel wie groß er (bzw. einzelnen Partien) sind und wo sie sich im Raum befinden.\nMehrere Abschlussarbeiten zu diesem Thema sind möglich.\n\n\n\n\n\n\nSelbstberührung führt zu Doppelempfindung"
  }
]